Hospital Service Area,Hospital County,Operating Certificate Number,Permanent Facility Id,Facility Name,Age Group,Zip Code - 3 digits,Gender,Race,Ethnicity,Length of Stay,Type of Admission,Patient Disposition,Discharge Year,CCS Diagnosis Code,CCS Diagnosis Description,CCS Procedure Code,CCS Procedure Description,APR DRG Code,APR DRG Description,APR MDC Code,APR MDC Description,APR Severity of Illness Code,APR Severity of Illness Description,APR Risk of Mortality,APR Medical Surgical Description,Payment Typology 1,Payment Typology 2,Payment Typology 3,Birth Weight,Abortion Edit Indicator,Emergency Department Indicator,Total Charges,Total Costs
New York City,Manhattan,7002053,001463,NYU Langone Hospitals,50 to 69,100,M,Other Race,Spanish/Hispanic,1,Emergency,Home or Self Care,2017,661,Substance-related disorders,000,NO PROC,816,Toxic effects of non-medicinal substances,21,"Poisonings, Toxic Effects, Other Injuries and Other Complications of Treatment",2,Moderate,Moderate,Medical,Medicaid,,,,N,Y,19853.39,6539.83
New York City,Manhattan,7002053,001463,NYU Langone Hospitals,70 or Older,112,F,Other Race,Not Span/Hispanic,4,Emergency,Home or Self Care,2017,243,Poisoning by nonmedicinal substances,000,NO PROC,816,Toxic effects of non-medicinal substances,21,"Poisonings, Toxic Effects, Other Injuries and Other Complications of Treatment",1,Minor,Major,Medical,Medicaid,,,,N,Y,33761.84,13400.48
New York City,Manhattan,7002053,001463,NYU Langone Hospitals,0 to 17,112,F,White,Not Span/Hispanic,5,Emergency,Home or Self Care,2017,243,Poisoning by nonmedicinal substances,000,NO PROC,816,Toxic effects of non-medicinal substances,21,"Poisonings, Toxic Effects, Other Injuries and Other Complications of Treatment",2,Moderate,Minor,Medical,Medicaid,,,,N,Y,38327.62,11828.31
New York City,Manhattan,7002053,001463,NYU Langone Hospitals,50 to 69,100,M,White,Not Span/Hispanic,1,Emergency,Left Against Medical Advice,2017,661,Substance-related disorders,000,NO PROC,816,Toxic effects of non-medicinal substances,21,"Poisonings, Toxic Effects, Other Injuries and Other Complications of Treatment",2,Moderate,Moderate,Medical,Self-Pay,,,,N,Y,26029.31,8288.76
New York City,Manhattan,7002053,001463,NYU Langone Hospitals,0 to 17,100,M,White,Not Span/Hispanic,1,Emergency,Home or Self Care,2017,243,Poisoning by nonmedicinal substances,000,NO PROC,816,Toxic effects of non-medicinal substances,21,"Poisonings, Toxic Effects, Other Injuries and Other Complications of Treatment",1,Minor,Minor,Medical,Federal/State/Local/VA,,,,N,Y,18508.02,5935.77
New York City,Manhattan,7002053,001463,NYU Langone Hospitals,70 or Older,112,M,White,Not Span/Hispanic,2,Emergency,Home w/ Home Health Services,2017,242,Poisoning by other medications and drugs,000,NO PROC,816,Toxic effects of non-medicinal substances,21,"Poisonings, Toxic Effects, Other Injuries and Other Complications of Treatment",2,Moderate,Moderate,Medical,Medicare,,,,N,Y,50383.52,18900.79
New York City,Manhattan,7002053,001463,NYU Langone Hospitals,30 to 49,100,M,Other Race,Unknown,3,Emergency,Psychiatric Hospital or Unit of Hosp,2017,661,Substance-related disorders,216,RESP INTUB/MECH VENTIL,816,Toxic effects of non-medicinal substances,21,"Poisonings, Toxic Effects, Other Injuries and Other Complications of Treatment",4,Extreme,Extreme,Medical,Medicaid,,,,N,Y,50660.81,22637.86
New York City,Manhattan,7002053,001463,NYU Langone Hospitals,0 to 17,112,F,Other Race,Not Span/Hispanic,1,Emergency,Home or Self Care,2017,662,Suicide and intentional self-inflicted injury,070,UP GASTRO ENDOSC/BIOPSY,816,Toxic effects of non-medicinal substances,21,"Poisonings, Toxic Effects, Other Injuries and Other Complications of Treatment",1,Minor,Minor,Medical,Private Health Insurance,,,,N,N,17147.75,3844.93
New York City,Manhattan,7002053,001463,NYU Langone Hospitals,50 to 69,107,M,Black/African American,Not Span/Hispanic,2,Emergency,Left Against Medical Advice,2017,661,Substance-related disorders,000,NO PROC,816,Toxic effects of non-medicinal substances,21,"Poisonings, Toxic Effects, Other Injuries and Other Complications of Treatment",2,Moderate,Moderate,Medical,Medicaid,,,,N,Y,28855.66,10238.50
New York City,Manhattan,7002053,001463,NYU Langone Hospitals,50 to 69,OOS,M,White,Not Span/Hispanic,1,Emergency,Home or Self Care,2017,661,Substance-related disorders,216,RESP INTUB/MECH VENTIL,816,Toxic effects of non-medicinal substances,21,"Poisonings, Toxic Effects, Other Injuries and Other Complications of Treatment",3,Major,Major,Medical,Private Health Insurance,,,,N,Y,30874.25,11532.62
New York City,Manhattan,7002053,001463,NYU Langone Hospitals,30 to 49,,F,White,Not Span/Hispanic,3,Emergency,Home or Self Care,2017,661,Substance-related disorders,000,NO PROC,816,Toxic effects of non-medicinal substances,21,"Poisonings, Toxic Effects, Other Injuries and Other Complications of Treatment",2,Moderate,Minor,Medical,Private Health Insurance,,,,N,Y,45822.11,15891.71
New York City,Manhattan,7002053,001463,NYU Langone Hospitals,30 to 49,,M,Other Race,Unknown,2,Emergency,Home or Self Care,2017,661,Substance-related disorders,222,BLOOD TRANSFUSION,816,Toxic effects of non-medicinal substances,21,"Poisonings, Toxic Effects, Other Injuries and Other Complications of Treatment",4,Extreme,Major,Medical,Medicare,,,,N,Y,45452.10,18538.87
New York City,Manhattan,7002053,001463,NYU Langone Hospitals,50 to 69,112,F,Other Race,Not Span/Hispanic,5,Emergency,Home w/ Home Health Services,2017,243,Poisoning by nonmedicinal substances,000,NO PROC,816,Toxic effects of non-medicinal substances,21,"Poisonings, Toxic Effects, Other Injuries and Other Complications of Treatment",3,Major,Major,Medical,Medicaid,,,,N,Y,88804.53,47957.75
New York City,Manhattan,7002053,001463,NYU Langone Hospitals,30 to 49,100,M,Black/African American,Not Span/Hispanic,1,Emergency,Left Against Medical Advice,2017,661,Substance-related disorders,000,NO PROC,816,Toxic effects of non-medicinal substances,21,"Poisonings, Toxic Effects, Other Injuries and Other Complications of Treatment",3,Major,Major,Medical,Medicaid,,,,N,Y,14700.66,5740.41
New York City,Manhattan,7002053,001463,NYU Langone Hospitals,70 or Older,113,F,White,Not Span/Hispanic,3,Emergency,Home w/ Home Health Services,2017,661,Substance-related disorders,000,NO PROC,816,Toxic effects of non-medicinal substances,21,"Poisonings, Toxic Effects, Other Injuries and Other Complications of Treatment",4,Extreme,Extreme,Medical,Medicare,,,,N,Y,66813.18,18749.81
New York City,Manhattan,7002053,001463,NYU Langone Hospitals,0 to 17,112,F,Black/African American,Not Span/Hispanic,4,Elective,Psychiatric Hospital or Unit of Hosp,2017,662,Suicide and intentional self-inflicted injury,216,RESP INTUB/MECH VENTIL,816,Toxic effects of non-medicinal substances,21,"Poisonings, Toxic Effects, Other Injuries and Other Complications of Treatment",3,Major,Major,Medical,Private Health Insurance,,,,N,N,102674.85,16436.81
