Hospital Service Area,Hospital County,Operating Certificate Number,Permanent Facility Id,Facility Name,Age Group,Zip Code - 3 digits,Gender,Race,Ethnicity,Length of Stay,Type of Admission,Patient Disposition,Discharge Year,CCS Diagnosis Code,CCS Diagnosis Description,CCS Procedure Code,CCS Procedure Description,APR DRG Code,APR DRG Description,APR MDC Code,APR MDC Description,APR Severity of Illness Code,APR Severity of Illness Description,APR Risk of Mortality,APR Medical Surgical Description,Payment Typology 1,Payment Typology 2,Payment Typology 3,Birth Weight,Abortion Edit Indicator,Emergency Department Indicator,Total Charges,Total Costs
Long Island,Nassau,2908000,000511,NYU Langone Hospital-Long Island,18 to 29,113,M,White,Not Span/Hispanic,1,Emergency,Home or Self Care,2019,INJ023,"TOXIC EFFECTS, INITIAL ENCOUNTER",,,816,TOXIC EFFECTS OF NON-MEDICINAL SUBSTANCES,21,"INJURIES, POISONINGS AND TOXIC EFFECTS OF DRUGS",2,Moderate,Moderate,Medical,Medicaid,Medicaid,,,,true,31771.6,4520.86
Long Island,Nassau,2908000,000511,NYU Langone Hospital-Long Island,18 to 29,115,M,White,Spanish/Hispanic,1,Emergency,Home or Self Care,2019,INJ022,"POISONING BY DRUGS, INITIAL ENCOUNTER",,,816,TOXIC EFFECTS OF NON-MEDICINAL SUBSTANCES,21,"INJURIES, POISONINGS AND TOXIC EFFECTS OF DRUGS",1,Minor,Minor,Medical,Medicaid,Medicaid,,,,true,25792.17,3100.6
Long Island,Nassau,2908000,000511,NYU Langone Hospital-Long Island,70 or Older,115,F,Black/African American,Spanish/Hispanic,1,Emergency,Home or Self Care,2019,INJ023,"TOXIC EFFECTS, INITIAL ENCOUNTER",,,816,TOXIC EFFECTS OF NON-MEDICINAL SUBSTANCES,21,"INJURIES, POISONINGS AND TOXIC EFFECTS OF DRUGS",3,Major,Major,Medical,Medicare,Medicare,,,,true,38290.45,4005.38
Long Island,Nassau,2908000,000511,NYU Langone Hospital-Long Island,0 to 17,117,M,White,Not Span/Hispanic,1,Emergency,Home or Self Care,2019,INJ023,"TOXIC EFFECTS, INITIAL ENCOUNTER",,,816,TOXIC EFFECTS OF NON-MEDICINAL SUBSTANCES,21,"INJURIES, POISONINGS AND TOXIC EFFECTS OF DRUGS",1,Minor,Minor,Medical,Blue Cross/Blue Shield,,,,,true,15648.91,2823.48
Long Island,Nassau,2908000,000511,NYU Langone Hospital-Long Island,30 to 49,115,F,Black/African American,Not Span/Hispanic,6,Emergency,Left Against Medical Advice,2019,INJ022,"POISONING BY DRUGS, INITIAL ENCOUNTER",,,816,TOXIC EFFECTS OF NON-MEDICINAL SUBSTANCES,21,"INJURIES, POISONINGS AND TOXIC EFFECTS OF DRUGS",4,Extreme,Extreme,Medical,Medicaid,Medicaid,,,,true,44991.96,11067.06
Long Island,Nassau,2908000,000511,NYU Langone Hospital-Long Island,50 to 69,115,M,Black/African American,Not Span/Hispanic,3,Emergency,Home or Self Care,2019,INJ022,"POISONING BY DRUGS, INITIAL ENCOUNTER",NCM002,TOMOGRAPHIC NUCLEAR MEDICINE IMAGING,816,TOXIC EFFECTS OF NON-MEDICINAL SUBSTANCES,21,"INJURIES, POISONINGS AND TOXIC EFFECTS OF DRUGS",2,Moderate,Minor,Medical,Medicaid,,,,,true,42934.77,8664.67
Long Island,Nassau,2908000,000511,NYU Langone Hospital-Long Island,0 to 17,115,F,Black/African American,Not Span/Hispanic,1,Urgent,Psychiatric Hospital or Unit of Hosp,2019,MBD012,SUICIDAL IDEATION/ATTEMPT/INTENTIONAL SELF-HARM,,,816,TOXIC EFFECTS OF NON-MEDICINAL SUBSTANCES,21,"INJURIES, POISONINGS AND TOXIC EFFECTS OF DRUGS",3,Major,Moderate,Medical,Medicaid,Medicaid,,,,false,10530.37,1957.3
Long Island,Nassau,2908000,000511,NYU Langone Hospital-Long Island,50 to 69,115,M,Black/African American,Not Span/Hispanic,4,Emergency,Home or Self Care,2019,INJ022,"POISONING BY DRUGS, INITIAL ENCOUNTER",,,816,TOXIC EFFECTS OF NON-MEDICINAL SUBSTANCES,21,"INJURIES, POISONINGS AND TOXIC EFFECTS OF DRUGS",1,Minor,Minor,Medical,Medicaid,Medicaid,,,,true,42438.75,8632.6
Long Island,Nassau,2908000,000511,NYU Langone Hospital-Long Island,30 to 49,115,F,Black/African American,Not Span/Hispanic,5,Emergency,Home or Self Care,2019,INJ022,"POISONING BY DRUGS, INITIAL ENCOUNTER",,,816,TOXIC EFFECTS OF NON-MEDICINAL SUBSTANCES,21,"INJURIES, POISONINGS AND TOXIC EFFECTS OF DRUGS",3,Major,Minor,Medical,Medicaid,,,,,true,46291.99,10015.6
Long Island,Nassau,2908000,000511,NYU Langone Hospital-Long Island,30 to 49,115,F,Black/African American,Not Span/Hispanic,2,Emergency,Left Against Medical Advice,2019,INJ022,"POISONING BY DRUGS, INITIAL ENCOUNTER",SUD001,SUBSTANCE USE DETOXIFICATION,816,TOXIC EFFECTS OF NON-MEDICINAL SUBSTANCES,21,"INJURIES, POISONINGS AND TOXIC EFFECTS OF DRUGS",3,Major,Major,Medical,Medicaid,,,,,true,26780.23,4668.65
Long Island,Nassau,2908000,000511,NYU Langone Hospital-Long Island,70 or Older,115,F,White,Not Span/Hispanic,2,Trauma,Home w/ Home Health Services,2019,INJ023,"TOXIC EFFECTS, INITIAL ENCOUNTER",,,816,TOXIC EFFECTS OF NON-MEDICINAL SUBSTANCES,21,"INJURIES, POISONINGS AND TOXIC EFFECTS OF DRUGS",4,Extreme,Major,Medical,Medicare,Medicare,,,,true,55045.93,7634.87
Long Island,Nassau,2908000,000511,NYU Langone Hospital-Long Island,30 to 49,115,M,White,Spanish/Hispanic,6,Emergency,Home or Self Care,2019,INJ022,"POISONING BY DRUGS, INITIAL ENCOUNTER",ESA003,MECHANICAL VENTILATION,816,TOXIC EFFECTS OF NON-MEDICINAL SUBSTANCES,21,"INJURIES, POISONINGS AND TOXIC EFFECTS OF DRUGS",4,Extreme,Extreme,Medical,Medicaid,Medicaid,,,,true,164875.88,24627.05
Long Island,Nassau,2908000,000511,NYU Langone Hospital-Long Island,30 to 49,115,M,White,Not Span/Hispanic,25,Emergency,Home w/ Home Health Services,2019,INJ022,"POISONING BY DRUGS, INITIAL ENCOUNTER",ESA003,MECHANICAL VENTILATION,816,TOXIC EFFECTS OF NON-MEDICINAL SUBSTANCES,21,"INJURIES, POISONINGS AND TOXIC EFFECTS OF DRUGS",4,Extreme,Extreme,Medical,Medicare,Medicare,Medicaid,,,true,587257.34,89820.06
Long Island,Nassau,2908000,000511,NYU Langone Hospital-Long Island,30 to 49,117,M,White,Not Span/Hispanic,11,Emergency,Home or Self Care,2019,INJ022,"POISONING BY DRUGS, INITIAL ENCOUNTER",CNS002,LUMBAR PUNCTURE,816,TOXIC EFFECTS OF NON-MEDICINAL SUBSTANCES,21,"INJURIES, POISONINGS AND TOXIC EFFECTS OF DRUGS",4,Extreme,Extreme,Medical,Blue Cross/Blue Shield,,,,,true,231206.67,30908.49
Long Island,Nassau,2908000,000511,NYU Langone Hospital-Long Island,30 to 49,115,F,Black/African American,Not Span/Hispanic,1,Emergency,Home or Self Care,2019,INJ022,"POISONING BY DRUGS, INITIAL ENCOUNTER",,,816,TOXIC EFFECTS OF NON-MEDICINAL SUBSTANCES,21,"INJURIES, POISONINGS AND TOXIC EFFECTS OF DRUGS",1,Minor,Minor,Medical,Medicare,Medicare,,,,true,21210.68,2820.53
Long Island,Nassau,2908000,000511,NYU Langone Hospital-Long Island,50 to 69,OOS,M,Black/African American,Not Span/Hispanic,3,Emergency,Home or Self Care,2019,INJ022,"POISONING BY DRUGS, INITIAL ENCOUNTER",MAM004,CARDIAC STRESS TESTS,816,TOXIC EFFECTS OF NON-MEDICINAL SUBSTANCES,21,"INJURIES, POISONINGS AND TOXIC EFFECTS OF DRUGS",2,Moderate,Minor,Medical,Medicare,Medicare,Medicaid,,,true,36079.04,6884.65
Long Island,Nassau,2908000,000511,NYU Langone Hospital-Long Island,50 to 69,115,M,Black/African American,Not Span/Hispanic,1,Emergency,Left Against Medical Advice,2019,INJ022,"POISONING BY DRUGS, INITIAL ENCOUNTER",,,816,TOXIC EFFECTS OF NON-MEDICINAL SUBSTANCES,21,"INJURIES, POISONINGS AND TOXIC EFFECTS OF DRUGS",3,Major,Moderate,Medical,Medicaid,Medicaid,,,,true,42275.84,5091.52
Long Island,Nassau,2908000,000511,NYU Langone Hospital-Long Island,30 to 49,115,M,Black/African American,Not Span/Hispanic,1,Emergency,Left Against Medical Advice,2019,INJ022,"POISONING BY DRUGS, INITIAL ENCOUNTER",SUD001,SUBSTANCE USE DETOXIFICATION,816,TOXIC EFFECTS OF NON-MEDICINAL SUBSTANCES,21,"INJURIES, POISONINGS AND TOXIC EFFECTS OF DRUGS",2,Moderate,Moderate,Medical,Medicaid,,,,,true,24198.16,3314.55
Long Island,Nassau,2908000,000511,NYU Langone Hospital-Long Island,30 to 49,117,M,White,Not Span/Hispanic,1,Emergency,Home or Self Care,2019,INJ022,"POISONING BY DRUGS, INITIAL ENCOUNTER",,,816,TOXIC EFFECTS OF NON-MEDICINAL SUBSTANCES,21,"INJURIES, POISONINGS AND TOXIC EFFECTS OF DRUGS",2,Moderate,Minor,Medical,Medicaid,Medicaid,,,,true,43515.14,4442.25
Long Island,Nassau,2908000,000511,NYU Langone Hospital-Long Island,0 to 17,115,F,Other Race,Spanish/Hispanic,1,Emergency,Home or Self Care,2019,INJ023,"TOXIC EFFECTS, INITIAL ENCOUNTER",,,816,TOXIC EFFECTS OF NON-MEDICINAL SUBSTANCES,21,"INJURIES, POISONINGS AND TOXIC EFFECTS OF DRUGS",2,Moderate,Minor,Medical,Medicaid,Medicaid,,,,true,14394.25,2607.86
Long Island,Nassau,2908000,000511,NYU Langone Hospital-Long Island,18 to 29,115,M,Black/African American,Not Span/Hispanic,2,Emergency,Psychiatric Hospital or Unit of Hosp,2019,MBD012,SUICIDAL IDEATION/ATTEMPT/INTENTIONAL SELF-HARM,,,816,TOXIC EFFECTS OF NON-MEDICINAL SUBSTANCES,21,"INJURIES, POISONINGS AND TOXIC EFFECTS OF DRUGS",1,Minor,Minor,Medical,Blue Cross/Blue Shield,,,,,true,21149.35,4214.06
Long Island,Nassau,2908000,000511,NYU Langone Hospital-Long Island,50 to 69,110,M,White,Not Span/Hispanic,11,Emergency,Psychiatric Hospital or Unit of Hosp,2019,MBD012,SUICIDAL IDEATION/ATTEMPT/INTENTIONAL SELF-HARM,RES007,AIRWAY INTUBATION,816,TOXIC EFFECTS OF NON-MEDICINAL SUBSTANCES,21,"INJURIES, POISONINGS AND TOXIC EFFECTS OF DRUGS",4,Extreme,Extreme,Medical,Medicare,Medicare,Blue Cross/Blue Shield,,,true,233723.77,36657.01
Long Island,Nassau,2908000,000511,NYU Langone Hospital-Long Island,50 to 69,115,M,Black/African American,Not Span/Hispanic,4,Emergency,Home or Self Care,2019,INJ022,"POISONING BY DRUGS, INITIAL ENCOUNTER",MAM004,CARDIAC STRESS TESTS,816,TOXIC EFFECTS OF NON-MEDICINAL SUBSTANCES,21,"INJURIES, POISONINGS AND TOXIC EFFECTS OF DRUGS",1,Minor,Minor,Medical,Medicaid,Medicaid,,,,true,56543.7,11430.62
Long Island,Nassau,2908000,000511,NYU Langone Hospital-Long Island,30 to 49,117,F,White,Not Span/Hispanic,10,Emergency,Inpatient Rehabilitation Facility,2019,INJ022,"POISONING BY DRUGS, INITIAL ENCOUNTER",SUD001,SUBSTANCE USE DETOXIFICATION,816,TOXIC EFFECTS OF NON-MEDICINAL SUBSTANCES,21,"INJURIES, POISONINGS AND TOXIC EFFECTS OF DRUGS",3,Major,Major,Medical,Medicaid,Medicaid,,,,true,120619.38,22652.94
Long Island,Nassau,2908000,000511,NYU Langone Hospital-Long Island,30 to 49,,M,Black/African American,Unknown,2,Emergency,Home or Self Care,2019,INJ022,"POISONING BY DRUGS, INITIAL ENCOUNTER",,,816,TOXIC EFFECTS OF NON-MEDICINAL SUBSTANCES,21,"INJURIES, POISONINGS AND TOXIC EFFECTS OF DRUGS",1,Minor,Minor,Medical,Medicaid,Medicaid,,,,true,27811.5,4962.61
Long Island,Nassau,2908000,000511,NYU Langone Hospital-Long Island,30 to 49,115,M,Black/African American,Not Span/Hispanic,9,Emergency,Expired,2019,INJ022,"POISONING BY DRUGS, INITIAL ENCOUNTER",ESA003,MECHANICAL VENTILATION,816,TOXIC EFFECTS OF NON-MEDICINAL SUBSTANCES,21,"INJURIES, POISONINGS AND TOXIC EFFECTS OF DRUGS",4,Extreme,Extreme,Medical,Medicaid,Medicaid,,,,true,381972.24,44649.13
Long Island,Nassau,2908000,000511,NYU Langone Hospital-Long Island,30 to 49,,F,White,Unknown,1,Emergency,Left Against Medical Advice,2019,INJ022,"POISONING BY DRUGS, INITIAL ENCOUNTER",,,816,TOXIC EFFECTS OF NON-MEDICINAL SUBSTANCES,21,"INJURIES, POISONINGS AND TOXIC EFFECTS OF DRUGS",3,Major,Major,Medical,Medicaid,Medicaid,,,,true,41951.83,5458.86
Long Island,Nassau,2908000,000511,NYU Langone Hospital-Long Island,30 to 49,115,F,Black/African American,Not Span/Hispanic,2,Emergency,Home or Self Care,2019,INJ022,"POISONING BY DRUGS, INITIAL ENCOUNTER",,,816,TOXIC EFFECTS OF NON-MEDICINAL SUBSTANCES,21,"INJURIES, POISONINGS AND TOXIC EFFECTS OF DRUGS",3,Major,Moderate,Medical,Medicaid,,,,,true,55516.55,6144.6
Long Island,Nassau,2908000,000511,NYU Langone Hospital-Long Island,30 to 49,115,M,White,Not Span/Hispanic,1,Emergency,Home or Self Care,2019,INJ022,"POISONING BY DRUGS, INITIAL ENCOUNTER",,,816,TOXIC EFFECTS OF NON-MEDICINAL SUBSTANCES,21,"INJURIES, POISONINGS AND TOXIC EFFECTS OF DRUGS",1,Minor,Minor,Medical,Private Health Insurance,,,,,true,27066.49,3722.11
Long Island,Nassau,2908000,000511,NYU Langone Hospital-Long Island,0 to 17,118,F,White,Not Span/Hispanic,5,Emergency,Home or Self Care,2019,INJ023,"TOXIC EFFECTS, INITIAL ENCOUNTER",,,816,TOXIC EFFECTS OF NON-MEDICINAL SUBSTANCES,21,"INJURIES, POISONINGS AND TOXIC EFFECTS OF DRUGS",3,Major,Moderate,Medical,Medicaid,Medicaid,,,,true,81145.18,13920.97
Long Island,Nassau,2908000,000511,NYU Langone Hospital-Long Island,50 to 69,110,F,Other Race,Spanish/Hispanic,1,Emergency,Home or Self Care,2019,INJ023,"TOXIC EFFECTS, INITIAL ENCOUNTER",,,816,TOXIC EFFECTS OF NON-MEDICINAL SUBSTANCES,21,"INJURIES, POISONINGS AND TOXIC EFFECTS OF DRUGS",2,Moderate,Moderate,Medical,Private Health Insurance,Medicare,Medicare,,,true,33657.29,4372.25
Long Island,Nassau,2908000,000511,NYU Langone Hospital-Long Island,18 to 29,117,M,Other Race,Spanish/Hispanic,3,Emergency,Home or Self Care,2019,INJ023,"TOXIC EFFECTS, INITIAL ENCOUNTER",SUD001,SUBSTANCE USE DETOXIFICATION,816,TOXIC EFFECTS OF NON-MEDICINAL SUBSTANCES,21,"INJURIES, POISONINGS AND TOXIC EFFECTS OF DRUGS",3,Major,Moderate,Medical,Medicaid,Medicaid,,,,true,45839.6,7755.7
Long Island,Nassau,2908000,000511,NYU Langone Hospital-Long Island,30 to 49,115,F,White,Not Span/Hispanic,1,Emergency,Home or Self Care,2019,INJ023,"TOXIC EFFECTS, INITIAL ENCOUNTER",,,816,TOXIC EFFECTS OF NON-MEDICINAL SUBSTANCES,21,"INJURIES, POISONINGS AND TOXIC EFFECTS OF DRUGS",2,Moderate,Minor,Medical,Private Health Insurance,,,,,true,17542.01,3085.4
Long Island,Nassau,2908000,000511,NYU Langone Hospital-Long Island,30 to 49,117,F,White,Not Span/Hispanic,2,Emergency,Home or Self Care,2019,INJ023,"TOXIC EFFECTS, INITIAL ENCOUNTER",,,816,TOXIC EFFECTS OF NON-MEDICINAL SUBSTANCES,21,"INJURIES, POISONINGS AND TOXIC EFFECTS OF DRUGS",4,Extreme,Extreme,Medical,Medicaid,Medicaid,,,,true,41644.27,6033.6
Long Island,Nassau,2908000,000511,NYU Langone Hospital-Long Island,50 to 69,115,M,White,Not Span/Hispanic,4,Emergency,Home or Self Care,2019,INJ023,"TOXIC EFFECTS, INITIAL ENCOUNTER",,,816,TOXIC EFFECTS OF NON-MEDICINAL SUBSTANCES,21,"INJURIES, POISONINGS AND TOXIC EFFECTS OF DRUGS",2,Moderate,Minor,Medical,Blue Cross/Blue Shield,,,,,true,58710.16,9654.26
Long Island,Nassau,2908000,000511,NYU Langone Hospital-Long Island,50 to 69,118,M,White,Not Span/Hispanic,2,Emergency,Home or Self Care,2019,INJ022,"POISONING BY DRUGS, INITIAL ENCOUNTER",MAM005,MEASUREMENT DURING CARDIAC CATHETERIZATION,816,TOXIC EFFECTS OF NON-MEDICINAL SUBSTANCES,21,"INJURIES, POISONINGS AND TOXIC EFFECTS OF DRUGS",2,Moderate,Moderate,Medical,Medicaid,,,,,true,71005.31,11389.01
Long Island,Nassau,2908000,000511,NYU Langone Hospital-Long Island,50 to 69,115,M,Black/African American,Not Span/Hispanic,2,Emergency,Home or Self Care,2019,INJ022,"POISONING BY DRUGS, INITIAL ENCOUNTER",,,816,TOXIC EFFECTS OF NON-MEDICINAL SUBSTANCES,21,"INJURIES, POISONINGS AND TOXIC EFFECTS OF DRUGS",1,Minor,Minor,Medical,Medicaid,,,,,true,41861.2,7151.31
Long Island,Nassau,2908000,000511,NYU Langone Hospital-Long Island,50 to 69,115,M,Black/African American,Not Span/Hispanic,2,Emergency,Home or Self Care,2019,INJ022,"POISONING BY DRUGS, INITIAL ENCOUNTER",,,816,TOXIC EFFECTS OF NON-MEDICINAL SUBSTANCES,21,"INJURIES, POISONINGS AND TOXIC EFFECTS OF DRUGS",2,Moderate,Minor,Medical,Medicaid,,,,,true,31194.01,5363.94
Long Island,Nassau,2908000,000511,NYU Langone Hospital-Long Island,50 to 69,115,M,Black/African American,Not Span/Hispanic,6,Emergency,Home or Self Care,2019,INJ022,"POISONING BY DRUGS, INITIAL ENCOUNTER",,,816,TOXIC EFFECTS OF NON-MEDICINAL SUBSTANCES,21,"INJURIES, POISONINGS AND TOXIC EFFECTS OF DRUGS",2,Moderate,Minor,Medical,Medicaid,,,,,true,66476.15,13489.18
Long Island,Nassau,2908000,000511,NYU Langone Hospital-Long Island,70 or Older,115,F,Other Race,Spanish/Hispanic,1,Emergency,Home or Self Care,2019,INJ023,"TOXIC EFFECTS, INITIAL ENCOUNTER",,,816,TOXIC EFFECTS OF NON-MEDICINAL SUBSTANCES,21,"INJURIES, POISONINGS AND TOXIC EFFECTS OF DRUGS",3,Major,Major,Medical,Medicare,Blue Cross/Blue Shield,,,,true,26342.35,3310.82
Long Island,Nassau,2908000,000511,NYU Langone Hospital-Long Island,18 to 29,117,F,Other Race,Not Span/Hispanic,1,Emergency,Home or Self Care,2019,INJ023,"TOXIC EFFECTS, INITIAL ENCOUNTER",,,816,TOXIC EFFECTS OF NON-MEDICINAL SUBSTANCES,21,"INJURIES, POISONINGS AND TOXIC EFFECTS OF DRUGS",2,Moderate,Minor,Medical,Private Health Insurance,,,,,true,35096.01,3753.43
Long Island,Nassau,2908000,000511,NYU Langone Hospital-Long Island,70 or Older,115,F,White,Not Span/Hispanic,5,Emergency,Home w/ Home Health Services,2019,INJ022,"POISONING BY DRUGS, INITIAL ENCOUNTER",RES007,AIRWAY INTUBATION,816,TOXIC EFFECTS OF NON-MEDICINAL SUBSTANCES,21,"INJURIES, POISONINGS AND TOXIC EFFECTS OF DRUGS",4,Extreme,Extreme,Medical,Medicare,Blue Cross/Blue Shield,,,,true,111701.47,18787.21
Long Island,Nassau,2908000,000511,NYU Langone Hospital-Long Island,18 to 29,115,F,White,Spanish/Hispanic,2,Emergency,Home or Self Care,2019,INJ022,"POISONING BY DRUGS, INITIAL ENCOUNTER",,,816,TOXIC EFFECTS OF NON-MEDICINAL SUBSTANCES,21,"INJURIES, POISONINGS AND TOXIC EFFECTS OF DRUGS",1,Minor,Minor,Medical,Blue Cross/Blue Shield,,,,,true,34659.24,5122.59
Long Island,Nassau,2908000,000511,NYU Langone Hospital-Long Island,18 to 29,115,F,White,Not Span/Hispanic,2,Emergency,Home or Self Care,2019,INJ022,"POISONING BY DRUGS, INITIAL ENCOUNTER",,,816,TOXIC EFFECTS OF NON-MEDICINAL SUBSTANCES,21,"INJURIES, POISONINGS AND TOXIC EFFECTS OF DRUGS",2,Moderate,Minor,Medical,Self-Pay,,,,,true,19685.08,2910.3
Long Island,Nassau,2908000,000511,NYU Langone Hospital-Long Island,0 to 17,115,F,White,Unknown,3,Emergency,Home or Self Care,2019,INJ023,"TOXIC EFFECTS, INITIAL ENCOUNTER",,,816,TOXIC EFFECTS OF NON-MEDICINAL SUBSTANCES,21,"INJURIES, POISONINGS AND TOXIC EFFECTS OF DRUGS",3,Major,Moderate,Medical,Medicaid,,,,,true,44994.76,17689.34
Long Island,Nassau,2908000,000511,NYU Langone Hospital-Long Island,0 to 17,115,M,White,Spanish/Hispanic,2,Elective,Home or Self Care,2019,INJ022,"POISONING BY DRUGS, INITIAL ENCOUNTER",ESA003,MECHANICAL VENTILATION,816,TOXIC EFFECTS OF NON-MEDICINAL SUBSTANCES,21,"INJURIES, POISONINGS AND TOXIC EFFECTS OF DRUGS",4,Extreme,Moderate,Medical,Medicaid,,,,,false,44025.12,13058.04
Long Island,Nassau,2908000,000511,NYU Langone Hospital-Long Island,18 to 29,110,M,Other Race,Not Span/Hispanic,4,Emergency,Home or Self Care,2019,INJ022,"POISONING BY DRUGS, INITIAL ENCOUNTER",,,816,TOXIC EFFECTS OF NON-MEDICINAL SUBSTANCES,21,"INJURIES, POISONINGS AND TOXIC EFFECTS OF DRUGS",4,Extreme,Extreme,Medical,Medicaid,,,,,true,51079.42,8972.81
Long Island,Nassau,2908000,000511,NYU Langone Hospital-Long Island,50 to 69,115,M,Black/African American,Not Span/Hispanic,2,Emergency,Home or Self Care,2019,INJ022,"POISONING BY DRUGS, INITIAL ENCOUNTER",,,816,TOXIC EFFECTS OF NON-MEDICINAL SUBSTANCES,21,"INJURIES, POISONINGS AND TOXIC EFFECTS OF DRUGS",4,Extreme,Extreme,Medical,Medicaid,,,,,true,32373.31,5133.66
