Hospital Service Area,Hospital County,Operating Certificate Number,Permanent Facility Id,Facility Name,Age Group,Zip Code - 3 digits,Gender,Race,Ethnicity,Length of Stay,Type of Admission,Patient Disposition,Discharge Year,CCS Diagnosis Code,CCS Diagnosis Description,CCS Procedure Code,CCS Procedure Description,APR DRG Code,APR DRG Description,APR MDC Code,APR MDC Description,APR Severity of Illness Code,APR Severity of Illness Description,APR Risk of Mortality,APR Medical Surgical Description,Payment Typology 1,Payment Typology 2,Payment Typology 3,Birth Weight,Abortion Edit Indicator,Emergency Department Indicator,Total Charges,Total Costs
Hudson Valley,Westchester,5902001,001045,White Plains Hospital Center,70 or Older,105,F,Other Race,Not Span/Hispanic,3,Emergency,Psychiatric Hospital or Unit of Hosp,2019,MBD012,SUICIDAL IDEATION/ATTEMPT/INTENTIONAL SELF-HARM,MST007,HIP ARTHROPLASTY,817,OVERDOSE,21,"INJURIES, POISONINGS AND TOXIC EFFECTS OF DRUGS",2,Moderate,Moderate,Medical,Medicare,Private Health Insurance,,,,true,52711,11355.62
Capital/Adirond,Albany,0101000,000001,Albany Medical Center Hospital,18 to 29,121,F,White,Not Span/Hispanic,4,Emergency,Psychiatric Hospital or Unit of Hosp,2019,MBD012,SUICIDAL IDEATION/ATTEMPT/INTENTIONAL SELF-HARM,,,817,OVERDOSE,21,"INJURIES, POISONINGS AND TOXIC EFFECTS OF DRUGS",2,Moderate,Minor,Medical,Private Health Insurance,Private Health Insurance,,,,true,16097.64,5497.63
New York City,Manhattan,7002024,001456,Mount Sinai Hospital,0 to 17,100,M,Other Race,Not Span/Hispanic,2,Urgent,Short-term Hospital,2019,MBD012,SUICIDAL IDEATION/ATTEMPT/INTENTIONAL SELF-HARM,,,817,OVERDOSE,21,"INJURIES, POISONINGS AND TOXIC EFFECTS OF DRUGS",1,Minor,Minor,Medical,Medicaid,Medicaid,Self-Pay,,,false,44464.26,7982.59
Finger Lakes,Monroe,2701003,000411,Rochester General Hospital,0 to 17,146,F,White,Not Span/Hispanic,6,Emergency,Home or Self Care,2019,MBD012,SUICIDAL IDEATION/ATTEMPT/INTENTIONAL SELF-HARM,,,817,OVERDOSE,21,"INJURIES, POISONINGS AND TOXIC EFFECTS OF DRUGS",2,Moderate,Minor,Medical,Medicaid,,,,,true,16986.59,9014.4
Western NY,Erie,1401005,000210,Erie County Medical Center,50 to 69,142,F,White,Not Span/Hispanic,7,Emergency,Psychiatric Hospital or Unit of Hosp,2019,MBD012,SUICIDAL IDEATION/ATTEMPT/INTENTIONAL SELF-HARM,ESA003,MECHANICAL VENTILATION,817,OVERDOSE,21,"INJURIES, POISONINGS AND TOXIC EFFECTS OF DRUGS",4,Extreme,Extreme,Medical,Medicaid,Medicaid,,,,true,42618.93,20932.15
Hudson Valley,Rockland,4329000,000779,Good Samaritan Hospital of Suffern,70 or Older,109,F,White,Not Span/Hispanic,3,Emergency,Home or Self Care,2019,MBD012,SUICIDAL IDEATION/ATTEMPT/INTENTIONAL SELF-HARM,ESA003,MECHANICAL VENTILATION,817,OVERDOSE,21,"INJURIES, POISONINGS AND TOXIC EFFECTS OF DRUGS",4,Extreme,Extreme,Medical,Medicare,,,,,true,45995.51,7069.12
New York City,Manhattan,7002001,001438,Bellevue Hospital Center,30 to 49,100,M,Black/African American,Not Span/Hispanic,2,Emergency,Home or Self Care,2019,MBD012,SUICIDAL IDEATION/ATTEMPT/INTENTIONAL SELF-HARM,MAM008,CARDIAC MONITORING,817,OVERDOSE,21,"INJURIES, POISONINGS AND TOXIC EFFECTS OF DRUGS",3,Major,Moderate,Medical,Medicare,Medicare,Medicaid,,,true,14306.12,9507.85
Long Island,Nassau,2952005,000552,Plainview Hospital,50 to 69,118,F,White,Not Span/Hispanic,5,Emergency,Psychiatric Hospital or Unit of Hosp,2019,MBD012,SUICIDAL IDEATION/ATTEMPT/INTENTIONAL SELF-HARM,,,817,OVERDOSE,21,"INJURIES, POISONINGS AND TOXIC EFFECTS OF DRUGS",4,Extreme,Extreme,Medical,Private Health Insurance,,,,,true,50544.52,13774.16
Capital/Adirond,Columbia,1001000,000146,Columbia Memorial Hospital,18 to 29,120,F,White,Not Span/Hispanic,1,Elective,Psychiatric Hospital or Unit of Hosp,2019,MBD012,SUICIDAL IDEATION/ATTEMPT/INTENTIONAL SELF-HARM,,,817,OVERDOSE,21,"INJURIES, POISONINGS AND TOXIC EFFECTS OF DRUGS",1,Minor,Minor,Medical,Medicaid,,,,,true,7219.98,2002.47
Central NY,Onondaga,3301007,000635,University Hospital SUNY Health Science Center,30 to 49,132,M,White,Not Span/Hispanic,3,Emergency,Psychiatric Hospital or Unit of Hosp,2019,MBD012,SUICIDAL IDEATION/ATTEMPT/INTENTIONAL SELF-HARM,ESA003,MECHANICAL VENTILATION,817,OVERDOSE,21,"INJURIES, POISONINGS AND TOXIC EFFECTS OF DRUGS",4,Extreme,Extreme,Medical,Medicaid,,,,,true,52808.44,13046.43
Central NY,Onondaga,3301007,000635,University Hospital SUNY Health Science Center,0 to 17,134,M,White,Not Span/Hispanic,3,Emergency,Psychiatric Hospital or Unit of Hosp,2019,MBD012,SUICIDAL IDEATION/ATTEMPT/INTENTIONAL SELF-HARM,,,817,OVERDOSE,21,"INJURIES, POISONINGS AND TOXIC EFFECTS OF DRUGS",3,Major,Minor,Medical,Medicaid,,,,,true,27391.7,7680.41
Capital/Adirond,Schenectady,4601001,000829,Ellis Hospital,18 to 29,123,F,White,Not Span/Hispanic,2,Emergency,Home or Self Care,2019,MBD012,SUICIDAL IDEATION/ATTEMPT/INTENTIONAL SELF-HARM,ESA004,NON-INVASIVE VENTILATION,817,OVERDOSE,21,"INJURIES, POISONINGS AND TOXIC EFFECTS OF DRUGS",2,Moderate,Minor,Medical,Medicare,Medicare,Medicaid,,,true,8962.45,2742.49
Western NY,Erie,1401005,000210,Erie County Medical Center,30 to 49,142,F,White,Not Span/Hispanic,2,Emergency,Psychiatric Hospital or Unit of Hosp,2019,MBD012,SUICIDAL IDEATION/ATTEMPT/INTENTIONAL SELF-HARM,MST015,CLOSED REDUCTION OF BONES AND JOINTS,817,OVERDOSE,21,"INJURIES, POISONINGS AND TOXIC EFFECTS OF DRUGS",3,Major,Moderate,Medical,Medicaid,Medicaid,,,,true,8969.2,4160.57
New York City,Kings,7001002,001286,Brookdale Hospital Medical Center,18 to 29,112,F,Black/African American,Not Span/Hispanic,1,Emergency,Home or Self Care,2019,MBD012,SUICIDAL IDEATION/ATTEMPT/INTENTIONAL SELF-HARM,,,817,OVERDOSE,21,"INJURIES, POISONINGS AND TOXIC EFFECTS OF DRUGS",1,Minor,Minor,Medical,Private Health Insurance,,,,,true,8831.81,3684.09
New York City,Kings,7001046,001309,Interfaith Medical Center,18 to 29,112,M,Other Race,Spanish/Hispanic,1,Emergency,Psychiatric Hospital or Unit of Hosp,2019,MBD012,SUICIDAL IDEATION/ATTEMPT/INTENTIONAL SELF-HARM,,,817,OVERDOSE,21,"INJURIES, POISONINGS AND TOXIC EFFECTS OF DRUGS",2,Moderate,Minor,Medical,Medicaid,Medicaid,,,,true,8221.41,3162.72
New York City,Kings,7001046,001309,Interfaith Medical Center,50 to 69,112,M,Black/African American,Not Span/Hispanic,8,Emergency,Home or Self Care,2019,MBD012,SUICIDAL IDEATION/ATTEMPT/INTENTIONAL SELF-HARM,GIS004,GI SYSTEM ENDOSCOPY WITHOUT BIOPSY (DIAGNOSTIC),817,OVERDOSE,21,"INJURIES, POISONINGS AND TOXIC EFFECTS OF DRUGS",3,Major,Moderate,Medical,Private Health Insurance,,,,,true,61250.84,25037.29
Hudson Valley,Westchester,5957001,001139,Westchester Medical Center,50 to 69,105,F,White,Not Span/Hispanic,16,Emergency,Psychiatric Hospital or Unit of Hosp,2019,MBD012,SUICIDAL IDEATION/ATTEMPT/INTENTIONAL SELF-HARM,RES007,AIRWAY INTUBATION,817,OVERDOSE,21,"INJURIES, POISONINGS AND TOXIC EFFECTS OF DRUGS",2,Moderate,Minor,Medical,Private Health Insurance,,,,,true,320450.88,63252.98
New York City,Kings,7001002,001286,Brookdale Hospital Medical Center,18 to 29,112,F,Black/African American,Unknown,3,Emergency,Home or Self Care,2019,MBD012,SUICIDAL IDEATION/ATTEMPT/INTENTIONAL SELF-HARM,,,817,OVERDOSE,21,"INJURIES, POISONINGS AND TOXIC EFFECTS OF DRUGS",1,Minor,Minor,Medical,Private Health Insurance,,,,,true,19293.64,9263.34
Capital/Adirond,Albany,0101004,000005,St. Peter's Hospital,18 to 29,121,F,White,Not Span/Hispanic,2,Elective,Psychiatric Hospital or Unit of Hosp,2019,MBD012,SUICIDAL IDEATION/ATTEMPT/INTENTIONAL SELF-HARM,,,817,OVERDOSE,21,"INJURIES, POISONINGS AND TOXIC EFFECTS OF DRUGS",2,Moderate,Minor,Medical,Private Health Insurance,,,,,false,9662.25,3619.68
Hudson Valley,Westchester,5957001,001139,Westchester Medical Center,0 to 17,105,F,Other Race,Unknown,3,Emergency,Psychiatric Hospital or Unit of Hosp,2019,MBD012,SUICIDAL IDEATION/ATTEMPT/INTENTIONAL SELF-HARM,,,817,OVERDOSE,21,"INJURIES, POISONINGS AND TOXIC EFFECTS OF DRUGS",2,Moderate,Minor,Medical,Medicaid,Medicaid,,,,true,88431.13,15752.72
New York City,Manhattan,7002054,001464,New York-Presbyterian Hospital - Columbia Presbyterian Center,18 to 29,110,F,White,Not Span/Hispanic,4,Emergency,Psychiatric Hospital or Unit of Hosp,2019,MBD012,SUICIDAL IDEATION/ATTEMPT/INTENTIONAL SELF-HARM,,,817,OVERDOSE,21,"INJURIES, POISONINGS AND TOXIC EFFECTS OF DRUGS",2,Moderate,Minor,Medical,Blue Cross/Blue Shield,Self-Pay,,,,true,98075.13,43549.53
Central NY,Cayuga,0501000,000085,Auburn Community Hospital,30 to 49,130,F,White,Not Span/Hispanic,1,Emergency,Short-term Hospital,2019,MBD012,SUICIDAL IDEATION/ATTEMPT/INTENTIONAL SELF-HARM,,,817,OVERDOSE,21,"INJURIES, POISONINGS AND TOXIC EFFECTS OF DRUGS",1,Minor,Minor,Medical,Medicaid,,,,,false,12556.62,4305.52
New York City,Kings,7002053,001304,NYU Langone Hospital-Brooklyn,18 to 29,112,M,Other Race,Spanish/Hispanic,2,Emergency,Psychiatric Hospital or Unit of Hosp,2019,MBD012,SUICIDAL IDEATION/ATTEMPT/INTENTIONAL SELF-HARM,,,817,OVERDOSE,21,"INJURIES, POISONINGS AND TOXIC EFFECTS OF DRUGS",2,Moderate,Minor,Medical,Private Health Insurance,,,,,true,30127.65,8144.98
Hudson Valley,Westchester,5957001,001139,Westchester Medical Center,0 to 17,124,F,White,Not Span/Hispanic,6,Emergency,Psychiatric Hospital or Unit of Hosp,2019,MBD012,SUICIDAL IDEATION/ATTEMPT/INTENTIONAL SELF-HARM,,,817,OVERDOSE,21,"INJURIES, POISONINGS AND TOXIC EFFECTS OF DRUGS",1,Minor,Minor,Medical,Private Health Insurance,Private Health Insurance,,,,true,91418.42,15701.71
Finger Lakes,Monroe,2701003,000411,Rochester General Hospital,30 to 49,146,F,Black/African American,Not Span/Hispanic,4,Emergency,Psychiatric Hospital or Unit of Hosp,2019,MBD012,SUICIDAL IDEATION/ATTEMPT/INTENTIONAL SELF-HARM,,,817,OVERDOSE,21,"INJURIES, POISONINGS AND TOXIC EFFECTS OF DRUGS",2,Moderate,Minor,Medical,Medicaid,,,,,true,15043.68,7918.21
Western NY,Erie,1401005,000210,Erie County Medical Center,30 to 49,140,M,White,Not Span/Hispanic,40,Emergency,Court/Law Enforcement,2019,MBD012,SUICIDAL IDEATION/ATTEMPT/INTENTIONAL SELF-HARM,,,817,OVERDOSE,21,"INJURIES, POISONINGS AND TOXIC EFFECTS OF DRUGS",2,Moderate,Minor,Medical,Medicare,Medicaid,Medicare,,,true,57429.08,48376.91
Hudson Valley,Dutchess,1327000,000192,Northern Dutchess Hospital,30 to 49,124,M,White,Not Span/Hispanic,1,Emergency,Psychiatric Hospital or Unit of Hosp,2019,MBD012,SUICIDAL IDEATION/ATTEMPT/INTENTIONAL SELF-HARM,,,817,OVERDOSE,21,"INJURIES, POISONINGS AND TOXIC EFFECTS OF DRUGS",1,Minor,Minor,Medical,Medicaid,,,,,true,6888.27,1942.82
Capital/Adirond,Fulton,1701000,000330,Nathan Littauer Hospital,18 to 29,120,F,White,Not Span/Hispanic,1,Emergency,Cancer Center or Children's Hospital,2019,MBD012,SUICIDAL IDEATION/ATTEMPT/INTENTIONAL SELF-HARM,,,817,OVERDOSE,21,"INJURIES, POISONINGS AND TOXIC EFFECTS OF DRUGS",1,Minor,Minor,Medical,Medicaid,,,,,false,9776.52,1402.99
Western NY,Erie,1401005,000210,Erie County Medical Center,50 to 69,140,M,White,Not Span/Hispanic,2,Emergency,Home or Self Care,2019,MBD012,SUICIDAL IDEATION/ATTEMPT/INTENTIONAL SELF-HARM,,,817,OVERDOSE,21,"INJURIES, POISONINGS AND TOXIC EFFECTS OF DRUGS",3,Major,Moderate,Medical,Medicare,Medicare,Self-Pay,,,true,12175,6568.13
Long Island,Suffolk,5154001,000925,Good Samaritan Hospital Medical Center,0 to 17,117,F,White,Not Span/Hispanic,1,Emergency,Psychiatric Hospital or Unit of Hosp,2019,MBD012,SUICIDAL IDEATION/ATTEMPT/INTENTIONAL SELF-HARM,,,817,OVERDOSE,21,"INJURIES, POISONINGS AND TOXIC EFFECTS OF DRUGS",2,Moderate,Minor,Medical,Blue Cross/Blue Shield,,,,,true,16727,4942.04
New York City,Manhattan,7002002,001439,Mount Sinai Beth Israel,50 to 69,100,F,White,Not Span/Hispanic,5,Emergency,Left Against Medical Advice,2019,MBD012,SUICIDAL IDEATION/ATTEMPT/INTENTIONAL SELF-HARM,IMG008,ULTRASONOGRAPHY,817,OVERDOSE,21,"INJURIES, POISONINGS AND TOXIC EFFECTS OF DRUGS",4,Extreme,Major,Medical,Medicare,Self-Pay,,,,true,61956.51,12574
Hudson Valley,Orange,3522000,000694,St Luke's Cornwall Hospital/Newburgh,50 to 69,125,F,White,Not Span/Hispanic,2,Emergency,Home or Self Care,2019,MBD012,SUICIDAL IDEATION/ATTEMPT/INTENTIONAL SELF-HARM,,,817,OVERDOSE,21,"INJURIES, POISONINGS AND TOXIC EFFECTS OF DRUGS",2,Moderate,Minor,Medical,Medicaid,,,,,true,26108.29,4747.56
Hudson Valley,Orange,3522000,000694,St Luke's Cornwall Hospital/Newburgh,30 to 49,125,F,Other Race,Spanish/Hispanic,1,Emergency,Psychiatric Hospital or Unit of Hosp,2019,MBD012,SUICIDAL IDEATION/ATTEMPT/INTENTIONAL SELF-HARM,,,817,OVERDOSE,21,"INJURIES, POISONINGS AND TOXIC EFFECTS OF DRUGS",2,Moderate,Minor,Medical,Private Health Insurance,,,,,true,12481.33,2411.86
Finger Lakes,Monroe,2701003,000411,Rochester General Hospital,18 to 29,146,F,Black/African American,Not Span/Hispanic,1,Emergency,Home or Self Care,2019,MBD012,SUICIDAL IDEATION/ATTEMPT/INTENTIONAL SELF-HARM,,,817,OVERDOSE,21,"INJURIES, POISONINGS AND TOXIC EFFECTS OF DRUGS",3,Major,Moderate,Medical,Blue Cross/Blue Shield,,,,,true,7248.41,2575.8
Finger Lakes,Monroe,2701003,000411,Rochester General Hospital,30 to 49,146,F,Black/African American,Not Span/Hispanic,2,Emergency,Home or Self Care,2019,MBD012,SUICIDAL IDEATION/ATTEMPT/INTENTIONAL SELF-HARM,,,817,OVERDOSE,21,"INJURIES, POISONINGS AND TOXIC EFFECTS OF DRUGS",2,Moderate,Minor,Medical,Medicaid,,,,,true,11043.45,4515.61
Finger Lakes,Monroe,2701003,000411,Rochester General Hospital,30 to 49,146,F,Black/African American,Not Span/Hispanic,2,Emergency,Home or Self Care,2019,MBD012,SUICIDAL IDEATION/ATTEMPT/INTENTIONAL SELF-HARM,,,817,OVERDOSE,21,"INJURIES, POISONINGS AND TOXIC EFFECTS OF DRUGS",2,Moderate,Minor,Medical,Medicare,Medicaid,,,,true,8270.35,3497.69
Western NY,Cattaraugus,0401001,000066,Olean General Hospital,30 to 49,147,M,White,Not Span/Hispanic,2,Emergency,Left Against Medical Advice,2019,MBD012,SUICIDAL IDEATION/ATTEMPT/INTENTIONAL SELF-HARM,,,817,OVERDOSE,21,"INJURIES, POISONINGS AND TOXIC EFFECTS OF DRUGS",2,Moderate,Minor,Medical,Medicare,Medicaid,,,,true,9027.46,4579.59
Capital/Adirond,Schenectady,4601001,000829,Ellis Hospital,30 to 49,123,F,White,Not Span/Hispanic,7,Emergency,Home or Self Care,2019,MBD012,SUICIDAL IDEATION/ATTEMPT/INTENTIONAL SELF-HARM,MST030,"MUSCULOSKELETAL PROCEDURES, NEC",817,OVERDOSE,21,"INJURIES, POISONINGS AND TOXIC EFFECTS OF DRUGS",1,Minor,Minor,Medical,Medicaid,Medicaid,,,,false,31422.45,11694.35
Western NY,Niagara,3121001,000583,Mount St. Mary's Hospital and Health Center,50 to 69,140,F,White,Not Span/Hispanic,8,Emergency,Short-term Hospital,2019,MBD012,SUICIDAL IDEATION/ATTEMPT/INTENTIONAL SELF-HARM,MAM005,MEASUREMENT DURING CARDIAC CATHETERIZATION,817,OVERDOSE,21,"INJURIES, POISONINGS AND TOXIC EFFECTS OF DRUGS",4,Extreme,Extreme,Medical,Medicare,Private Health Insurance,,,,true,23983.31,20512.99
New York City,Kings,7001021,001306,New York - Presbyterian Brooklyn Methodist Hospital,30 to 49,100,F,White,Not Span/Hispanic,1,Emergency,Left Against Medical Advice,2019,MBD012,SUICIDAL IDEATION/ATTEMPT/INTENTIONAL SELF-HARM,,,817,OVERDOSE,21,"INJURIES, POISONINGS AND TOXIC EFFECTS OF DRUGS",2,Moderate,Moderate,Medical,Medicare,Medicare,Medicaid,,,true,9967.85,3119.47
Central NY,Tompkins,5401001,000977,Cayuga Medical Center at Ithaca,50 to 69,148,M,White,Not Span/Hispanic,2,Emergency,Psychiatric Hospital or Unit of Hosp,2019,MBD012,SUICIDAL IDEATION/ATTEMPT/INTENTIONAL SELF-HARM,,,817,OVERDOSE,21,"INJURIES, POISONINGS AND TOXIC EFFECTS OF DRUGS",2,Moderate,Minor,Medical,Self-Pay,Self-Pay,Self-Pay,,,true,6900.79,5385.82
Long Island,Suffolk,5151001,000245,Stony Brook University Hospital,0 to 17,117,M,White,Not Span/Hispanic,3,Emergency,Psychiatric Hospital or Unit of Hosp,2019,MBD012,SUICIDAL IDEATION/ATTEMPT/INTENTIONAL SELF-HARM,,,817,OVERDOSE,21,"INJURIES, POISONINGS AND TOXIC EFFECTS OF DRUGS",1,Minor,Minor,Medical,Private Health Insurance,,,,,true,29244.74,8831.59
New York City,Queens,7003010,001637,New York - Presbyterian/Queens,50 to 69,113,F,White,Not Span/Hispanic,4,Emergency,Skilled Nursing Home,2019,MBD012,SUICIDAL IDEATION/ATTEMPT/INTENTIONAL SELF-HARM,IMG007,COMPUTERIZED TOMOGRAPHY (CT) WITHOUT CONTRAST,817,OVERDOSE,21,"INJURIES, POISONINGS AND TOXIC EFFECTS OF DRUGS",2,Moderate,Minor,Medical,Medicare,Medicare,Self-Pay,,,true,31702.91,8297.14
Western NY,Erie,1401005,000210,Erie County Medical Center,50 to 69,142,M,White,Not Span/Hispanic,2,Emergency,Psychiatric Hospital or Unit of Hosp,2019,MBD012,SUICIDAL IDEATION/ATTEMPT/INTENTIONAL SELF-HARM,,,817,OVERDOSE,21,"INJURIES, POISONINGS AND TOXIC EFFECTS OF DRUGS",1,Minor,Minor,Medical,Medicare,,,,,true,8402.05,4295.31
New York City,Manhattan,7002054,001458,New York-Presbyterian Hospital - New York Weill Cornell Center,50 to 69,100,M,White,Not Span/Hispanic,17,Emergency,Psychiatric Hospital or Unit of Hosp,2019,MBD012,SUICIDAL IDEATION/ATTEMPT/INTENTIONAL SELF-HARM,ESA004,NON-INVASIVE VENTILATION,817,OVERDOSE,21,"INJURIES, POISONINGS AND TOXIC EFFECTS OF DRUGS",4,Extreme,Extreme,Medical,Private Health Insurance,Self-Pay,,,,true,294564.78,99212.6
Central NY,Onondaga,3301007,000635,University Hospital SUNY Health Science Center,50 to 69,133,F,White,Not Span/Hispanic,1,Emergency,Psychiatric Hospital or Unit of Hosp,2019,MBD012,SUICIDAL IDEATION/ATTEMPT/INTENTIONAL SELF-HARM,,,817,OVERDOSE,21,"INJURIES, POISONINGS AND TOXIC EFFECTS OF DRUGS",3,Major,Moderate,Medical,Medicare,Medicaid,,,,true,22266.1,6446.15
Long Island,Nassau,2950002,000528,Nassau University Medical Center,30 to 49,117,M,Other Race,Not Span/Hispanic,1,Emergency,Home or Self Care,2019,MBD012,SUICIDAL IDEATION/ATTEMPT/INTENTIONAL SELF-HARM,IMG007,COMPUTERIZED TOMOGRAPHY (CT) WITHOUT CONTRAST,817,OVERDOSE,21,"INJURIES, POISONINGS AND TOXIC EFFECTS OF DRUGS",1,Minor,Minor,Medical,Medicaid,Medicaid,Self-Pay,,,false,11787.5,3028.27
Finger Lakes,Monroe,2701003,000411,Rochester General Hospital,50 to 69,146,M,Other Race,Spanish/Hispanic,5,Emergency,Psychiatric Hospital or Unit of Hosp,2019,MBD012,SUICIDAL IDEATION/ATTEMPT/INTENTIONAL SELF-HARM,CAR024,VENOUS AND ARTERIAL CATHETER PLACEMENT,817,OVERDOSE,21,"INJURIES, POISONINGS AND TOXIC EFFECTS OF DRUGS",4,Extreme,Extreme,Medical,Medicare,Medicaid,,,,true,29397.08,13581.65
Capital/Adirond,Albany,0101000,000001,Albany Medical Center Hospital,30 to 49,121,M,White,Not Span/Hispanic,2,Emergency,Psychiatric Hospital or Unit of Hosp,2019,MBD012,SUICIDAL IDEATION/ATTEMPT/INTENTIONAL SELF-HARM,,,817,OVERDOSE,21,"INJURIES, POISONINGS AND TOXIC EFFECTS OF DRUGS",1,Minor,Minor,Medical,"Managed Care, Unspecified",,,,,true,18826.66,4337.31
Western NY,Erie,1401005,000210,Erie County Medical Center,18 to 29,142,F,White,Not Span/Hispanic,2,Emergency,Psychiatric Hospital or Unit of Hosp,2019,MBD012,SUICIDAL IDEATION/ATTEMPT/INTENTIONAL SELF-HARM,,,817,OVERDOSE,21,"INJURIES, POISONINGS AND TOXIC EFFECTS OF DRUGS",3,Major,Moderate,Medical,Blue Cross/Blue Shield,Medicaid,,,,true,9143.6,4337.64
Western NY,Erie,1401005,000210,Erie County Medical Center,30 to 49,142,F,White,Not Span/Hispanic,1,Emergency,Psychiatric Hospital or Unit of Hosp,2019,MBD012,SUICIDAL IDEATION/ATTEMPT/INTENTIONAL SELF-HARM,,,817,OVERDOSE,21,"INJURIES, POISONINGS AND TOXIC EFFECTS OF DRUGS",2,Moderate,Minor,Medical,Medicaid,Medicaid,,,,true,7961.82,2895.72
New York City,Manhattan,7002032,001469,Mount Sinai Morningside,30 to 49,100,F,Other Race,Spanish/Hispanic,2,Emergency,Psychiatric Hospital or Unit of Hosp,2019,MBD012,SUICIDAL IDEATION/ATTEMPT/INTENTIONAL SELF-HARM,IMG007,COMPUTERIZED TOMOGRAPHY (CT) WITHOUT CONTRAST,817,OVERDOSE,21,"INJURIES, POISONINGS AND TOXIC EFFECTS OF DRUGS",2,Moderate,Moderate,Medical,Medicare,Medicare,Self-Pay,,,true,42413.58,14410.77
New York City,Manhattan,7002032,001469,Mount Sinai Morningside,18 to 29,OOS,F,White,Not Span/Hispanic,1,Emergency,Psychiatric Hospital or Unit of Hosp,2019,MBD012,SUICIDAL IDEATION/ATTEMPT/INTENTIONAL SELF-HARM,ADM021,"ADMINISTRATION OF THERAPEUTIC SUBSTANCES, NEC",817,OVERDOSE,21,"INJURIES, POISONINGS AND TOXIC EFFECTS OF DRUGS",2,Moderate,Minor,Medical,Private Health Insurance,Self-Pay,,,,true,20498.02,6784.69
Hudson Valley,Westchester,5957001,001139,Westchester Medical Center,0 to 17,114,F,Black/African American,Not Span/Hispanic,2,Emergency,Psychiatric Hospital or Unit of Hosp,2019,MBD012,SUICIDAL IDEATION/ATTEMPT/INTENTIONAL SELF-HARM,,,817,OVERDOSE,21,"INJURIES, POISONINGS AND TOXIC EFFECTS OF DRUGS",2,Moderate,Minor,Medical,Medicaid,Medicaid,,,,true,33970.09,5760.37
New York City,Manhattan,7002054,001458,New York-Presbyterian Hospital - New York Weill Cornell Center,18 to 29,100,F,Other Race,Not Span/Hispanic,4,Emergency,Psychiatric Hospital or Unit of Hosp,2019,MBD012,SUICIDAL IDEATION/ATTEMPT/INTENTIONAL SELF-HARM,,,817,OVERDOSE,21,"INJURIES, POISONINGS AND TOXIC EFFECTS OF DRUGS",1,Minor,Minor,Medical,"Managed Care, Unspecified",Medicaid,Self-Pay,,,true,48735.55,10806.15
Central NY,Onondaga,3301007,000635,University Hospital SUNY Health Science Center,18 to 29,132,M,White,Not Span/Hispanic,2,Emergency,Psychiatric Hospital or Unit of Hosp,2019,MBD012,SUICIDAL IDEATION/ATTEMPT/INTENTIONAL SELF-HARM,,,817,OVERDOSE,21,"INJURIES, POISONINGS AND TOXIC EFFECTS OF DRUGS",1,Minor,Minor,Medical,Medicaid,,,,,true,24037.3,6822.79
Central NY,Onondaga,3301007,000635,University Hospital SUNY Health Science Center,50 to 69,130,F,White,Not Span/Hispanic,5,Emergency,Home or Self Care,2019,MBD012,SUICIDAL IDEATION/ATTEMPT/INTENTIONAL SELF-HARM,MHT002,PSYCHOTHERAPY FOR MENTAL HEALTH (EXCLUDING SUBSTANCE USE),817,OVERDOSE,21,"INJURIES, POISONINGS AND TOXIC EFFECTS OF DRUGS",2,Moderate,Minor,Medical,Blue Cross/Blue Shield,,,,,true,26888.9,7038.7
Finger Lakes,Monroe,2701005,000413,Strong Memorial Hospital,30 to 49,144,F,White,Not Span/Hispanic,2,Emergency,Home or Self Care,2019,MBD012,SUICIDAL IDEATION/ATTEMPT/INTENTIONAL SELF-HARM,,,817,OVERDOSE,21,"INJURIES, POISONINGS AND TOXIC EFFECTS OF DRUGS",2,Moderate,Minor,Medical,Blue Cross/Blue Shield,,,,,true,7397.47,3107.71
Central NY,Madison,2601001,000397,Oneida Health Hospital,50 to 69,134,M,White,Not Span/Hispanic,4,Emergency,Short-term Hospital,2019,MBD012,SUICIDAL IDEATION/ATTEMPT/INTENTIONAL SELF-HARM,RES007,AIRWAY INTUBATION,817,OVERDOSE,21,"INJURIES, POISONINGS AND TOXIC EFFECTS OF DRUGS",3,Major,Major,Medical,Medicare,Medicare,Self-Pay,,,true,29114.83,13666.28
Central NY,Oneida,3201002,000589,"Rome Memorial Hospital, Inc",18 to 29,134,F,White,Not Span/Hispanic,1,Emergency,Psychiatric Hospital or Unit of Hosp,2019,MBD012,SUICIDAL IDEATION/ATTEMPT/INTENTIONAL SELF-HARM,,,817,OVERDOSE,21,"INJURIES, POISONINGS AND TOXIC EFFECTS OF DRUGS",1,Minor,Minor,Medical,Blue Cross/Blue Shield,,,,,true,13527.42,4898.02
New York City,Manhattan,7002002,001439,Mount Sinai Beth Israel,18 to 29,100,F,Other Race,Unknown,2,Emergency,Psychiatric Hospital or Unit of Hosp,2019,MBD012,SUICIDAL IDEATION/ATTEMPT/INTENTIONAL SELF-HARM,,,817,OVERDOSE,21,"INJURIES, POISONINGS AND TOXIC EFFECTS OF DRUGS",2,Moderate,Minor,Medical,Medicaid,Medicaid,Self-Pay,,,false,35624.85,9118.12
New York City,Manhattan,7002032,001466,Mount Sinai West,30 to 49,100,M,Other Race,Spanish/Hispanic,2,Emergency,Home or Self Care,2019,MBD012,SUICIDAL IDEATION/ATTEMPT/INTENTIONAL SELF-HARM,ADM021,"ADMINISTRATION OF THERAPEUTIC SUBSTANCES, NEC",817,OVERDOSE,21,"INJURIES, POISONINGS AND TOXIC EFFECTS OF DRUGS",2,Moderate,Minor,Medical,Medicaid,Self-Pay,,,,false,21490.8,4858.88
Central NY,Onondaga,3301007,000635,University Hospital SUNY Health Science Center,0 to 17,132,F,Black/African American,Not Span/Hispanic,2,Emergency,Home or Self Care,2019,MBD012,SUICIDAL IDEATION/ATTEMPT/INTENTIONAL SELF-HARM,MHT002,PSYCHOTHERAPY FOR MENTAL HEALTH (EXCLUDING SUBSTANCE USE),817,OVERDOSE,21,"INJURIES, POISONINGS AND TOXIC EFFECTS OF DRUGS",2,Moderate,Minor,Medical,Medicaid,,,,,true,16491.4,4800.63