Hospital Service Area,Hospital County,Operating Certificate Number,Permanent Facility Id,Facility Name,Age Group,Zip Code - 3 digits,Gender,Race,Ethnicity,Length of Stay,Type of Admission,Patient Disposition,Discharge Year,CCS Diagnosis Code,CCS Diagnosis Description,CCS Procedure Code,CCS Procedure Description,APR DRG Code,APR DRG Description,APR MDC Code,APR MDC Description,APR Severity of Illness Code,APR Severity of Illness Description,APR Risk of Mortality,APR Medical Surgical Description,Payment Typology 1,Payment Typology 2,Payment Typology 3,Birth Weight,Abortion Edit Indicator,Emergency Department Indicator,Total Charges,Total Costs
New York City,Manhattan,7002053,001463,NYU Langone Hospitals,50 to 69,112,M,White,Not Span/Hispanic,7,Emergency,Home or Self Care,2017,090,Inflammation; infection of eye (except that caused by tuberculosis or sexually transmitteddisease),004,DIAGNOSTIC SPINAL TAP,082,Eye disorders except major infections,02,Diseases and Disorders of the Eye,2,Moderate,Minor,Medical,Medicare,,,,N,Y,106899.48,20663.91
New York City,Manhattan,7002053,001463,NYU Langone Hospitals,30 to 49,103,M,White,Not Span/Hispanic,4,Emergency,Home or Self Care,2017,090,Inflammation; infection of eye (except that caused by tuberculosis or sexually transmitteddisease),000,NO PROC,082,Eye disorders except major infections,02,Diseases and Disorders of the Eye,1,Minor,Minor,Medical,Private Health Insurance,,,,N,Y,75071.36,16783.30
New York City,Manhattan,7002053,001463,NYU Langone Hospitals,18 to 29,104,F,Black/African American,Not Span/Hispanic,2,Emergency,Home or Self Care,2017,090,Inflammation; infection of eye (except that caused by tuberculosis or sexually transmitteddisease),000,NO PROC,082,Eye disorders except major infections,02,Diseases and Disorders of the Eye,2,Moderate,Minor,Medical,Private Health Insurance,,,,N,Y,50819.97,10203.79
New York City,Manhattan,7002053,001463,NYU Langone Hospitals,30 to 49,113,F,White,Spanish/Hispanic,3,Emergency,Home or Self Care,2017,090,Inflammation; infection of eye (except that caused by tuberculosis or sexually transmitteddisease),000,NO PROC,082,Eye disorders except major infections,02,Diseases and Disorders of the Eye,3,Major,Major,Medical,Private Health Insurance,,,,N,Y,23416.63,11320.88
New York City,Manhattan,7002053,001463,NYU Langone Hospitals,50 to 69,103,F,Other Race,Not Span/Hispanic,5,Emergency,Home or Self Care,2017,090,Inflammation; infection of eye (except that caused by tuberculosis or sexually transmitteddisease),004,DIAGNOSTIC SPINAL TAP,082,Eye disorders except major infections,02,Diseases and Disorders of the Eye,2,Moderate,Minor,Medical,Medicaid,,,,N,Y,63887.87,18664.94
New York City,Manhattan,7002053,001463,NYU Langone Hospitals,18 to 29,OOS,F,White,Not Span/Hispanic,3,Emergency,Home or Self Care,2017,090,Inflammation; infection of eye (except that caused by tuberculosis or sexually transmitteddisease),004,DIAGNOSTIC SPINAL TAP,082,Eye disorders except major infections,02,Diseases and Disorders of the Eye,1,Minor,Minor,Medical,Private Health Insurance,,,,N,Y,72806.19,15611.82
New York City,Manhattan,7002053,001463,NYU Langone Hospitals,30 to 49,112,F,White,Spanish/Hispanic,2,Emergency,Home or Self Care,2017,091,Other eye disorders,004,DIAGNOSTIC SPINAL TAP,082,Eye disorders except major infections,02,Diseases and Disorders of the Eye,1,Minor,Minor,Medical,Blue Cross/Blue Shield,,,,N,Y,87661.56,17042.65
New York City,Manhattan,7002053,001463,NYU Langone Hospitals,18 to 29,112,F,White,Not Span/Hispanic,6,Emergency,Home or Self Care,2017,090,Inflammation; infection of eye (except that caused by tuberculosis or sexually transmitteddisease),019,OT THER PRCS EYELIDS,082,Eye disorders except major infections,02,Diseases and Disorders of the Eye,1,Minor,Minor,Medical,Medicaid,,,,N,Y,54012.68,24232.31
New York City,Manhattan,7002053,001463,NYU Langone Hospitals,30 to 49,112,M,White,Not Span/Hispanic,2,Emergency,Home or Self Care,2017,090,Inflammation; infection of eye (except that caused by tuberculosis or sexually transmitteddisease),004,DIAGNOSTIC SPINAL TAP,082,Eye disorders except major infections,02,Diseases and Disorders of the Eye,1,Minor,Minor,Medical,Private Health Insurance,,,,N,Y,46559.51,10737.09
New York City,Manhattan,7002053,001463,NYU Langone Hospitals,30 to 49,OOS,M,White,Not Span/Hispanic,3,Urgent,Home or Self Care,2017,090,Inflammation; infection of eye (except that caused by tuberculosis or sexually transmitteddisease),000,NO PROC,082,Eye disorders except major infections,02,Diseases and Disorders of the Eye,2,Moderate,Minor,Medical,Blue Cross/Blue Shield,,,,N,N,42280.37,12863.72
New York City,Manhattan,7002053,001463,NYU Langone Hospitals,70 or Older,OOS,F,Other Race,Spanish/Hispanic,2,Emergency,Home or Self Care,2017,041,Cancer; other and unspecified primary,000,NO PROC,082,Eye disorders except major infections,02,Diseases and Disorders of the Eye,3,Major,Moderate,Medical,Medicare,,,,N,Y,43319.29,14247.63
New York City,Manhattan,7002053,001463,NYU Langone Hospitals,70 or Older,112,F,White,Not Span/Hispanic,2,Emergency,Left Against Medical Advice,2017,088,Glaucoma,000,NO PROC,082,Eye disorders except major infections,02,Diseases and Disorders of the Eye,2,Moderate,Moderate,Medical,Medicare,,,,N,Y,15324.39,5789.92
New York City,Manhattan,7002053,001463,NYU Langone Hospitals,30 to 49,OOS,F,Other Race,Not Span/Hispanic,3,Emergency,Home or Self Care,2017,087,Retinal detachments; defects; vascular occlusion; and retinopathy,193,DX ULTRASOUND HEART,082,Eye disorders except major infections,02,Diseases and Disorders of the Eye,1,Minor,Minor,Medical,Private Health Insurance,,,,N,Y,103609.93,29415.15
New York City,Manhattan,7002053,001463,NYU Langone Hospitals,50 to 69,OOS,F,Other Race,Spanish/Hispanic,1,Emergency,Home or Self Care,2017,087,Retinal detachments; defects; vascular occlusion; and retinopathy,193,DX ULTRASOUND HEART,082,Eye disorders except major infections,02,Diseases and Disorders of the Eye,2,Moderate,Minor,Medical,Medicare,,,,N,Y,34454.81,9722.02
New York City,Manhattan,7002053,001463,NYU Langone Hospitals,50 to 69,112,F,Other Race,Spanish/Hispanic,5,Emergency,Home w/ Home Health Services,2017,050,Diabetes mellitus with complications,004,DIAGNOSTIC SPINAL TAP,082,Eye disorders except major infections,02,Diseases and Disorders of the Eye,3,Major,Moderate,Medical,Medicare,,,,N,Y,84114.89,25062.64
New York City,Manhattan,7002053,001463,NYU Langone Hospitals,30 to 49,OOS,F,Other Race,Not Span/Hispanic,4,Emergency,Home or Self Care,2017,090,Inflammation; infection of eye (except that caused by tuberculosis or sexually transmitteddisease),004,DIAGNOSTIC SPINAL TAP,082,Eye disorders except major infections,02,Diseases and Disorders of the Eye,2,Moderate,Minor,Medical,Self-Pay,,,,N,Y,73390.76,13932.05
New York City,Manhattan,7002053,001463,NYU Langone Hospitals,50 to 69,101,M,Black/African American,Not Span/Hispanic,2,Emergency,Home or Self Care,2017,089,Blindness and vision defects,000,NO PROC,082,Eye disorders except major infections,02,Diseases and Disorders of the Eye,3,Major,Major,Medical,Medicaid,,,,N,Y,69724.98,14652.31
New York City,Manhattan,7002053,001463,NYU Langone Hospitals,30 to 49,112,M,White,Not Span/Hispanic,2,Emergency,Home or Self Care,2017,090,Inflammation; infection of eye (except that caused by tuberculosis or sexually transmitteddisease),000,NO PROC,082,Eye disorders except major infections,02,Diseases and Disorders of the Eye,1,Minor,Minor,Medical,Medicaid,,,,N,Y,32472.49,10674.15
New York City,Manhattan,7002053,001463,NYU Langone Hospitals,30 to 49,100,F,Other Race,Unknown,4,Emergency,Home w/ Home Health Services,2017,090,Inflammation; infection of eye (except that caused by tuberculosis or sexually transmitteddisease),000,NO PROC,082,Eye disorders except major infections,02,Diseases and Disorders of the Eye,3,Major,Minor,Medical,Medicaid,,,,N,Y,62551.04,22356.42
New York City,Manhattan,7002053,001463,NYU Langone Hospitals,0 to 17,,M,Black/African American,Unknown,2,Elective,Home or Self Care,2017,041,Cancer; other and unspecified primary,174,OT NON-OR THER PRC SKIN,082,Eye disorders except major infections,02,Diseases and Disorders of the Eye,2,Moderate,Minor,Medical,Medicaid,,,,N,N,40207.59,11617.53
New York City,Manhattan,7002053,001463,NYU Langone Hospitals,70 or Older,100,F,White,Not Span/Hispanic,1,Emergency,Home or Self Care,2017,112,Transient cerebral ischemia,000,NO PROC,082,Eye disorders except major infections,02,Diseases and Disorders of the Eye,2,Moderate,Moderate,Medical,Medicare,,,,N,Y,28702.37,11241.27
New York City,Manhattan,7002053,001463,NYU Langone Hospitals,70 or Older,112,M,White,Unknown,2,Emergency,Home w/ Home Health Services,2017,088,Glaucoma,000,NO PROC,082,Eye disorders except major infections,02,Diseases and Disorders of the Eye,3,Major,Major,Medical,Medicaid,,,,N,Y,81163.10,25971.31
New York City,Manhattan,7002053,001463,NYU Langone Hospitals,50 to 69,125,F,White,Not Span/Hispanic,2,Emergency,Home or Self Care,2017,091,Other eye disorders,231,OTHER THERAPEUTIC PRCS,082,Eye disorders except major infections,02,Diseases and Disorders of the Eye,2,Moderate,Minor,Medical,Private Health Insurance,,,,N,Y,53971.79,13100.57
New York City,Manhattan,7002053,001463,NYU Langone Hospitals,0 to 17,103,F,White,Not Span/Hispanic,1,Emergency,Home or Self Care,2017,089,Blindness and vision defects,199,ELECTROENCEPHALOGRAM,082,Eye disorders except major infections,02,Diseases and Disorders of the Eye,1,Minor,Minor,Medical,Private Health Insurance,,,,N,Y,59145.08,5379.37
New York City,Manhattan,7002053,001463,NYU Langone Hospitals,70 or Older,112,F,White,Not Span/Hispanic,3,Emergency,Home w/ Home Health Services,2017,087,Retinal detachments; defects; vascular occlusion; and retinopathy,062,OT DX CARDIOVASC PRCS,082,Eye disorders except major infections,02,Diseases and Disorders of the Eye,1,Minor,Moderate,Medical,Medicare,,,,N,Y,69155.73,19821.50
New York City,Manhattan,7002053,001463,NYU Langone Hospitals,0 to 17,,F,White,Spanish/Hispanic,3,Emergency,Home or Self Care,2017,089,Blindness and vision defects,139,FETAL MONITORING,082,Eye disorders except major infections,02,Diseases and Disorders of the Eye,1,Minor,Minor,Medical,Blue Cross/Blue Shield,,,,N,Y,138537.39,20880.73
