Hospital Service Area,Hospital County,Operating Certificate Number,Permanent Facility Id,Facility Name,Age Group,Zip Code - 3 digits,Gender,Race,Ethnicity,Length of Stay,Type of Admission,Patient Disposition,Discharge Year,CCS Diagnosis Code,CCS Diagnosis Description,CCS Procedure Code,CCS Procedure Description,APR DRG Code,APR DRG Description,APR MDC Code,APR MDC Description,APR Severity of Illness Code,APR Severity of Illness Description,APR Risk of Mortality,APR Medical Surgical Description,Payment Typology 1,Payment Typology 2,Payment Typology 3,Birth Weight,Abortion Edit Indicator,Emergency Department Indicator,Total Charges,Total Costs
New York City,Bronx,7000006,001169,Montefiore Medical Center - Henry & Lucy Moses Div,70 or Older,104,F,Other Race,Spanish/Hispanic,6,Emergency,Home w/ Home Health Services,2020,INJ001,"FRACTURE OF HEAD AND NECK, INITIAL ENCOUNTER",,,082,EYE INFECTIONS & OTHER EYE DISORDERS,02,DISEASES AND DISORDERS OF THE EYE,1,Minor,Minor,Medical,Medicare,Medicaid,,,,Y,73025.68,13101.2
New York City,Bronx,7000006,001169,Montefiore Medical Center - Henry & Lucy Moses Div,50 to 69,104,F,White,Spanish/Hispanic,7,Emergency,Home or Self Care,2020,NVS012,TRANSIENT CEREBRAL ISCHEMIA,IMG008,ULTRASONOGRAPHY,082,EYE INFECTIONS & OTHER EYE DISORDERS,02,DISEASES AND DISORDERS OF THE EYE,1,Minor,Minor,Medical,Medicaid,,,,,Y,108755.24,17936.55
New York City,Bronx,7000006,001169,Montefiore Medical Center - Henry & Lucy Moses Div,50 to 69,104,F,Other Race,Spanish/Hispanic,1,Emergency,Home w/ Home Health Services,2020,INJ017,"SUPERFICIAL INJURY; CONTUSION, INITIAL ENCOUNTER",,,082,EYE INFECTIONS & OTHER EYE DISORDERS,02,DISEASES AND DISORDERS OF THE EYE,1,Minor,Minor,Medical,Medicare,Medicaid,,,,Y,23351.69,3065.6
New York City,Bronx,7000006,001169,Montefiore Medical Center - Henry & Lucy Moses Div,50 to 69,104,M,Other Race,Spanish/Hispanic,4,Emergency,Home or Self Care,2020,EYE006,NEURO-OPHTHALMOLOGY,,,082,EYE INFECTIONS & OTHER EYE DISORDERS,02,DISEASES AND DISORDERS OF THE EYE,1,Minor,Minor,Medical,Medicare,,,,,Y,78219.79,9869.6
Hudson Valley,Westchester,5903001,001061,Montefiore Mount Vernon Hospital,50 to 69,105,M,Black/African American,Unknown,4,Emergency,Home or Self Care,2020,EYE012,OTHER SPECIFIED EYE DISORDERS,,,082,EYE INFECTIONS & OTHER EYE DISORDERS,02,DISEASES AND DISORDERS OF THE EYE,1,Minor,Minor,Medical,Medicaid,Medicaid,Self-Pay,,,Y,28272.59,10312.88
New York City,Bronx,7000006,001168,Montefiore Medical Center-Wakefield Hospital,50 to 69,115,M,Black/African American,Not Span/Hispanic,1,Emergency,Home or Self Care,2020,EYE006,NEURO-OPHTHALMOLOGY,IMG005,MAGNETIC RESONANCE IMAGING (MRI),082,EYE INFECTIONS & OTHER EYE DISORDERS,02,DISEASES AND DISORDERS OF THE EYE,1,Minor,Minor,Medical,Blue Cross/Blue Shield,,,,,Y,24174.09,3762.15
New York City,Bronx,7000006,001169,Montefiore Medical Center - Henry & Lucy Moses Div,30 to 49,100,M,Black/African American,Not Span/Hispanic,2,Emergency,Home or Self Care,2020,EYE001,CORNEA AND EXTERNAL DISEASE,ADM021,"ADMINISTRATION OF THERAPEUTIC SUBSTANCES, NEC",082,EYE INFECTIONS & OTHER EYE DISORDERS,02,DISEASES AND DISORDERS OF THE EYE,2,Moderate,Minor,Medical,Medicaid,,,,,Y,23354.66,3414.95
New York City,Bronx,7000006,001169,Montefiore Medical Center - Henry & Lucy Moses Div,50 to 69,104,F,Other Race,Spanish/Hispanic,12,Emergency,Home or Self Care,2020,NVS012,TRANSIENT CEREBRAL ISCHEMIA,CAR024,VENOUS AND ARTERIAL CATHETER PLACEMENT,082,EYE INFECTIONS & OTHER EYE DISORDERS,02,DISEASES AND DISORDERS OF THE EYE,3,Major,Major,Medical,Private Health Insurance,,,,,Y,197663.93,35195.32
New York City,Manhattan,7002032,001466,Mount Sinai West,30 to 49,OOS,M,Other Race,Spanish/Hispanic,3,Emergency,Home or Self Care,2020,EYE005,RETINAL AND VITREOUS CONDITIONS,ADM005,ADMINISTRATION OF THROMBOLYTICS AND PLATELET INHIBITORS,082,EYE INFECTIONS & OTHER EYE DISORDERS,02,DISEASES AND DISORDERS OF THE EYE,2,Moderate,Minor,Medical,Blue Cross/Blue Shield,Self-Pay,,,,Y,104524.81,24660.96
New York City,Bronx,7000006,001169,Montefiore Medical Center - Henry & Lucy Moses Div,0 to 17,104,M,Other Race,Unknown,3,Emergency,Home or Self Care,2020,EYE008,OCULOFACIAL PLASTICS AND ORBITAL CONDITIONS,ENT001,LARYNGOSCOPY (DIAGNOSTIC),082,EYE INFECTIONS & OTHER EYE DISORDERS,02,DISEASES AND DISORDERS OF THE EYE,1,Minor,Minor,Medical,Medicaid,,,,,Y,42431.97,9639.59
New York City,Manhattan,7002024,001456,Mount Sinai Hospital,18 to 29,104,F,Black/African American,Not Span/Hispanic,2,Emergency,Home or Self Care,2020,EYE006,NEURO-OPHTHALMOLOGY,,,082,EYE INFECTIONS & OTHER EYE DISORDERS,02,DISEASES AND DISORDERS OF THE EYE,1,Minor,Minor,Medical,Private Health Insurance,Self-Pay,,,,Y,39091.5,7071.06
New York City,Bronx,7000006,001168,Montefiore Medical Center-Wakefield Hospital,70 or Older,100,F,Other Race,Spanish/Hispanic,2,Emergency,Home w/ Home Health Services,2020,END003,DIABETES MELLITUS WITH COMPLICATION,IMG007,COMPUTERIZED TOMOGRAPHY (CT) WITHOUT CONTRAST,082,EYE INFECTIONS & OTHER EYE DISORDERS,02,DISEASES AND DISORDERS OF THE EYE,2,Moderate,Minor,Medical,Medicare,Medicaid,,,,Y,51787.37,6758.36
New York City,Bronx,7000006,001169,Montefiore Medical Center - Henry & Lucy Moses Div,30 to 49,104,F,Other Race,Not Span/Hispanic,1,Emergency,Home or Self Care,2020,EYE001,CORNEA AND EXTERNAL DISEASE,,,082,EYE INFECTIONS & OTHER EYE DISORDERS,02,DISEASES AND DISORDERS OF THE EYE,1,Minor,Minor,Medical,Private Health Insurance,,,,,Y,20511.26,3004.03
New York City,Manhattan,7002054,001464,New York-Presbyterian Hospital - Columbia Presbyterian Center,30 to 49,104,F,White,Spanish/Hispanic,1,Emergency,Home or Self Care,2020,EYE010,BLINDNESS AND VISION DEFECTS,,,082,EYE INFECTIONS & OTHER EYE DISORDERS,02,DISEASES AND DISORDERS OF THE EYE,1,Minor,Minor,Medical,Private Health Insurance,Self-Pay,,,,Y,35090.47,6554.56
New York City,Manhattan,7002054,001464,New York-Presbyterian Hospital - Columbia Presbyterian Center,50 to 69,OOS,M,White,Not Span/Hispanic,1,Elective,Home or Self Care,2020,NEO001,HEAD AND NECK CANCERS - EYE,ADM012,CHEMOTHERAPY,082,EYE INFECTIONS & OTHER EYE DISORDERS,02,DISEASES AND DISORDERS OF THE EYE,2,Moderate,Moderate,Medical,Self-Pay,Self-Pay,,,,N,17849.82,3562.2
New York City,Manhattan,7002054,001464,New York-Presbyterian Hospital - Columbia Presbyterian Center,18 to 29,104,M,Black/African American,Spanish/Hispanic,1,Emergency,Home or Self Care,2020,EYE005,RETINAL AND VITREOUS CONDITIONS,,,082,EYE INFECTIONS & OTHER EYE DISORDERS,02,DISEASES AND DISORDERS OF THE EYE,2,Moderate,Minor,Medical,Medicaid,Self-Pay,,,,Y,15298.04,3493.06
New York City,Manhattan,7002054,001464,New York-Presbyterian Hospital - Columbia Presbyterian Center,70 or Older,100,F,Other Race,Not Span/Hispanic,6,Emergency,Skilled Nursing Home,2020,EYE005,RETINAL AND VITREOUS CONDITIONS,,,082,EYE INFECTIONS & OTHER EYE DISORDERS,02,DISEASES AND DISORDERS OF THE EYE,2,Moderate,Moderate,Medical,Medicare,Medicare,Self-Pay,,,Y,71058.33,15432.3
New York City,Manhattan,7002054,001464,New York-Presbyterian Hospital - Columbia Presbyterian Center,70 or Older,100,F,Multi-racial,Not Span/Hispanic,2,Emergency,Home w/ Home Health Services,2020,EYE005,RETINAL AND VITREOUS CONDITIONS,,,082,EYE INFECTIONS & OTHER EYE DISORDERS,02,DISEASES AND DISORDERS OF THE EYE,2,Moderate,Minor,Medical,Medicare,Medicare,Self-Pay,,,Y,31415.83,7082.2
New York City,Manhattan,7002054,001464,New York-Presbyterian Hospital - Columbia Presbyterian Center,0 to 17,109,F,White,Not Span/Hispanic,1,Emergency,Home or Self Care,2020,INJ017,"SUPERFICIAL INJURY; CONTUSION, INITIAL ENCOUNTER",IMG005,MAGNETIC RESONANCE IMAGING (MRI),082,EYE INFECTIONS & OTHER EYE DISORDERS,02,DISEASES AND DISORDERS OF THE EYE,1,Minor,Minor,Medical,Private Health Insurance,Self-Pay,,,,Y,30511.8,6202.1
New York City,Manhattan,7002054,001464,New York-Presbyterian Hospital - Columbia Presbyterian Center,0 to 17,104,F,Multi-racial,Spanish/Hispanic,4,Emergency,Home or Self Care,2020,EYE005,RETINAL AND VITREOUS CONDITIONS,CNS002,LUMBAR PUNCTURE,082,EYE INFECTIONS & OTHER EYE DISORDERS,02,DISEASES AND DISORDERS OF THE EYE,3,Major,Minor,Medical,Medicaid,Self-Pay,,,,Y,71022.19,16210.92
New York City,Queens,7003010,001637,New York - Presbyterian/Queens,70 or Older,111,F,Other Race,Not Span/Hispanic,1,Emergency,Home or Self Care,2020,NVS012,TRANSIENT CEREBRAL ISCHEMIA,ADM010,VACCINATIONS,082,EYE INFECTIONS & OTHER EYE DISORDERS,02,DISEASES AND DISORDERS OF THE EYE,2,Moderate,Moderate,Medical,Medicare,Medicaid,Self-Pay,,,Y,27517.89,4616.33
New York City,Kings,7002053,001304,NYU Langone Hospital-Brooklyn,70 or Older,112,F,Other Race,Not Span/Hispanic,4,Emergency,Home w/ Home Health Services,2020,EYE012,OTHER SPECIFIED EYE DISORDERS,OTR004,ISOLATION PROCEDURES,082,EYE INFECTIONS & OTHER EYE DISORDERS,02,DISEASES AND DISORDERS OF THE EYE,2,Moderate,Moderate,Medical,Medicare,Medicaid,,,,Y,60196.1,14693.35
New York City,Manhattan,7002054,001437,New York-Presbyterian/Lower Manhattan Hospital,18 to 29,,M,Black/African American,Not Span/Hispanic,2,Emergency,Court/Law Enforcement,2020,EYE012,OTHER SPECIFIED EYE DISORDERS,ADM021,"ADMINISTRATION OF THERAPEUTIC SUBSTANCES, NEC",082,EYE INFECTIONS & OTHER EYE DISORDERS,02,DISEASES AND DISORDERS OF THE EYE,2,Moderate,Minor,Medical,"Managed Care, Unspecified",Medicaid,Self-Pay,,,Y,45055.76,22594.38
New York City,Manhattan,7002054,001458,New York-Presbyterian Hospital - New York Weill Cornell Center,0 to 17,112,F,Other Race,Not Span/Hispanic,1,Emergency,Home or Self Care,2020,NEO001,HEAD AND NECK CANCERS - EYE,ADM012,CHEMOTHERAPY,082,EYE INFECTIONS & OTHER EYE DISORDERS,02,DISEASES AND DISORDERS OF THE EYE,2,Moderate,Minor,Medical,"Managed Care, Unspecified",Medicaid,Self-Pay,,,N,40477.83,15264.87
New York City,Kings,7001037,001320,University Hospital of Brooklyn,70 or Older,112,F,Other Race,Not Span/Hispanic,8,Urgent,Home or Self Care,2020,EYE004,UVEITIS AND OCULAR INFLAMMATION,ESA004,NON-INVASIVE VENTILATION,082,EYE INFECTIONS & OTHER EYE DISORDERS,02,DISEASES AND DISORDERS OF THE EYE,3,Major,Moderate,Medical,Medicare,Medicaid,Self-Pay,,,N,46856,34878.16
New York City,Kings,7001021,001306,New York - Presbyterian Brooklyn Methodist Hospital,70 or Older,112,F,Black/African American,Not Span/Hispanic,2,Emergency,Home w/ Home Health Services,2020,EYE012,OTHER SPECIFIED EYE DISORDERS,,,082,EYE INFECTIONS & OTHER EYE DISORDERS,02,DISEASES AND DISORDERS OF THE EYE,3,Major,Major,Medical,Medicare,Private Health Insurance,Self-Pay,,,Y,16388.55,3847.32
New York City,Manhattan,7002054,001458,New York-Presbyterian Hospital - New York Weill Cornell Center,0 to 17,112,F,Other Race,Not Span/Hispanic,2,Emergency,Home or Self Care,2020,INJ019,"BURN AND CORROSION, INITIAL ENCOUNTER",,,082,EYE INFECTIONS & OTHER EYE DISORDERS,02,DISEASES AND DISORDERS OF THE EYE,1,Minor,Minor,Medical,"Managed Care, Unspecified",Medicaid,Self-Pay,,,Y,45716.32,22903.51
New York City,Kings,7001021,001306,New York - Presbyterian Brooklyn Methodist Hospital,50 to 69,112,M,Other Race,Not Span/Hispanic,1,Emergency,Home or Self Care,2020,EYE005,RETINAL AND VITREOUS CONDITIONS,,,082,EYE INFECTIONS & OTHER EYE DISORDERS,02,DISEASES AND DISORDERS OF THE EYE,2,Moderate,Minor,Medical,"Managed Care, Unspecified",Medicaid,Self-Pay,,,Y,29061.7,3828.34
New York City,Kings,7001021,001306,New York - Presbyterian Brooklyn Methodist Hospital,30 to 49,112,F,White,Not Span/Hispanic,1,Emergency,Home or Self Care,2020,EYE008,OCULOFACIAL PLASTICS AND ORBITAL CONDITIONS,,,082,EYE INFECTIONS & OTHER EYE DISORDERS,02,DISEASES AND DISORDERS OF THE EYE,1,Minor,Minor,Medical,Private Health Insurance,,,,,Y,14092.76,2502.68
New York City,Kings,7001021,001306,New York - Presbyterian Brooklyn Methodist Hospital,70 or Older,112,F,White,Spanish/Hispanic,1,Emergency,Home or Self Care,2020,END003,DIABETES MELLITUS WITH COMPLICATION,,,082,EYE INFECTIONS & OTHER EYE DISORDERS,02,DISEASES AND DISORDERS OF THE EYE,2,Moderate,Moderate,Medical,Medicare,Medicaid,Self-Pay,,,Y,12307.29,2505.74
New York City,Manhattan,7002024,001456,Mount Sinai Hospital,50 to 69,105,F,Black/African American,Not Span/Hispanic,2,Urgent,Home w/ Home Health Services,2020,EYE012,OTHER SPECIFIED EYE DISORDERS,,,082,EYE INFECTIONS & OTHER EYE DISORDERS,02,DISEASES AND DISORDERS OF THE EYE,2,Moderate,Moderate,Medical,Medicare,Blue Cross/Blue Shield,Private Health Insurance,,,N,23829.62,6083.62
New York City,Bronx,7000006,001169,Montefiore Medical Center - Henry & Lucy Moses Div,50 to 69,104,F,Other Race,Spanish/Hispanic,6,Emergency,Home or Self Care,2020,SYM015,GENERAL SENSATION/PERCEPTION SIGNS AND SYMPTOMS,,,082,EYE INFECTIONS & OTHER EYE DISORDERS,02,DISEASES AND DISORDERS OF THE EYE,3,Major,Major,Medical,Medicare,Medicaid,,,,Y,75452.87,12783.35
Long Island,Nassau,2950002,000528,Nassau University Medical Center,70 or Older,115,F,White,Not Span/Hispanic,3,Emergency,Skilled Nursing Home,2020,EYE010,BLINDNESS AND VISION DEFECTS,MAM007,ELECTROCARDIOGRAM (ECG),082,EYE INFECTIONS & OTHER EYE DISORDERS,02,DISEASES AND DISORDERS OF THE EYE,2,Moderate,Minor,Medical,Medicare,Medicare,Self-Pay,,,N,34900.97,9263.54
Western NY,Erie,1401005,000210,Erie County Medical Center,50 to 69,147,F,White,Not Span/Hispanic,5,Emergency,Home or Self Care,2020,EYE001,CORNEA AND EXTERNAL DISEASE,,,082,EYE INFECTIONS & OTHER EYE DISORDERS,02,DISEASES AND DISORDERS OF THE EYE,2,Moderate,Minor,Medical,Medicare,Medicaid,,,,Y,12936.34,8166.01
Western NY,Erie,1401005,000210,Erie County Medical Center,30 to 49,142,F,Black/African American,Not Span/Hispanic,8,Emergency,Short-term Hospital,2020,EYE006,NEURO-OPHTHALMOLOGY,CNS002,LUMBAR PUNCTURE,082,EYE INFECTIONS & OTHER EYE DISORDERS,02,DISEASES AND DISORDERS OF THE EYE,2,Moderate,Minor,Medical,Private Health Insurance,,,,,Y,34880.57,17163.24
Western NY,Erie,1401005,000210,Erie County Medical Center,18 to 29,142,F,Black/African American,Not Span/Hispanic,1,Emergency,Left Against Medical Advice,2020,EYE005,RETINAL AND VITREOUS CONDITIONS,,,082,EYE INFECTIONS & OTHER EYE DISORDERS,02,DISEASES AND DISORDERS OF THE EYE,2,Moderate,Minor,Medical,Medicaid,Medicaid,,,,Y,19700.67,4552.55
Western NY,Erie,1401005,000210,Erie County Medical Center,18 to 29,142,F,Black/African American,Not Span/Hispanic,2,Emergency,Left Against Medical Advice,2020,EYE004,UVEITIS AND OCULAR INFLAMMATION,,,082,EYE INFECTIONS & OTHER EYE DISORDERS,02,DISEASES AND DISORDERS OF THE EYE,2,Moderate,Minor,Medical,Medicaid,Medicaid,,,,Y,8431.93,4204.3
Western NY,Erie,1401005,000210,Erie County Medical Center,70 or Older,141,F,White,Not Span/Hispanic,5,Emergency,Home or Self Care,2020,EYE004,UVEITIS AND OCULAR INFLAMMATION,ADM015,ADMINISTRATION OF ANTIBIOTICS,082,EYE INFECTIONS & OTHER EYE DISORDERS,02,DISEASES AND DISORDERS OF THE EYE,3,Major,Major,Medical,Medicare,Medicare,,,,Y,42862.02,26947.96
New York City,Manhattan,7002002,001439,Mount Sinai Beth Israel,18 to 29,111,M,Other Race,Unknown,1,Emergency,Home or Self Care,2020,EYE005,RETINAL AND VITREOUS CONDITIONS,IMG005,MAGNETIC RESONANCE IMAGING (MRI),082,EYE INFECTIONS & OTHER EYE DISORDERS,02,DISEASES AND DISORDERS OF THE EYE,3,Major,Major,Medical,Private Health Insurance,Medicaid,Self-Pay,,,Y,30254.58,3981.78
New York City,Manhattan,7002032,001466,Mount Sinai West,50 to 69,100,M,Black/African American,Not Span/Hispanic,3,Emergency,Left Against Medical Advice,2020,INJ017,"SUPERFICIAL INJURY; CONTUSION, INITIAL ENCOUNTER",ADM015,ADMINISTRATION OF ANTIBIOTICS,082,EYE INFECTIONS & OTHER EYE DISORDERS,02,DISEASES AND DISORDERS OF THE EYE,1,Minor,Minor,Medical,Medicare,Medicare,Medicaid,,,Y,37921.09,7996.26
New York City,Bronx,7000006,001169,Montefiore Medical Center - Henry & Lucy Moses Div,50 to 69,104,M,White,Spanish/Hispanic,3,Emergency,Home or Self Care,2020,END003,DIABETES MELLITUS WITH COMPLICATION,ADM021,"ADMINISTRATION OF THERAPEUTIC SUBSTANCES, NEC",082,EYE INFECTIONS & OTHER EYE DISORDERS,02,DISEASES AND DISORDERS OF THE EYE,2,Moderate,Moderate,Medical,Medicare,,,,,Y,66096.26,8460.88
New York City,Bronx,7000006,001169,Montefiore Medical Center - Henry & Lucy Moses Div,18 to 29,104,M,Black/African American,Not Span/Hispanic,5,Emergency,Home or Self Care,2020,EYE005,RETINAL AND VITREOUS CONDITIONS,IMG008,ULTRASONOGRAPHY,082,EYE INFECTIONS & OTHER EYE DISORDERS,02,DISEASES AND DISORDERS OF THE EYE,2,Moderate,Minor,Medical,Private Health Insurance,,,,,Y,95647.87,15052.47
New York City,Bronx,7000006,001169,Montefiore Medical Center - Henry & Lucy Moses Div,70 or Older,104,F,Black/African American,Not Span/Hispanic,3,Emergency,Home w/ Home Health Services,2020,SYM015,GENERAL SENSATION/PERCEPTION SIGNS AND SYMPTOMS,ADM017,ADMINISTRATION OF NUTRITIONAL AND ELECTROLYTIC SUBSTANCES,082,EYE INFECTIONS & OTHER EYE DISORDERS,02,DISEASES AND DISORDERS OF THE EYE,2,Moderate,Major,Medical,Medicare,Medicaid,,,,Y,40196.45,7132.97
New York City,Bronx,7000006,001169,Montefiore Medical Center - Henry & Lucy Moses Div,70 or Older,105,M,Black/African American,Not Span/Hispanic,4,Emergency,Home or Self Care,2020,EYE001,CORNEA AND EXTERNAL DISEASE,ADM021,"ADMINISTRATION OF THERAPEUTIC SUBSTANCES, NEC",082,EYE INFECTIONS & OTHER EYE DISORDERS,02,DISEASES AND DISORDERS OF THE EYE,1,Minor,Minor,Medical,Medicare,,,,,Y,68106.87,12700.64
New York City,Bronx,7000006,001168,Montefiore Medical Center-Wakefield Hospital,30 to 49,104,M,Other Race,Spanish/Hispanic,3,Emergency,Home or Self Care,2020,EYE008,OCULOFACIAL PLASTICS AND ORBITAL CONDITIONS,ENT001,LARYNGOSCOPY (DIAGNOSTIC),082,EYE INFECTIONS & OTHER EYE DISORDERS,02,DISEASES AND DISORDERS OF THE EYE,2,Moderate,Minor,Medical,Medicaid,,,,,Y,48378.96,7535.14
New York City,Bronx,7000006,001169,Montefiore Medical Center - Henry & Lucy Moses Div,50 to 69,104,M,Other Race,Not Span/Hispanic,5,Emergency,Home w/ Home Health Services,2020,EYE008,OCULOFACIAL PLASTICS AND ORBITAL CONDITIONS,CAR024,VENOUS AND ARTERIAL CATHETER PLACEMENT,082,EYE INFECTIONS & OTHER EYE DISORDERS,02,DISEASES AND DISORDERS OF THE EYE,2,Moderate,Minor,Medical,Private Health Insurance,,,,,Y,78901.39,12635.07
New York City,Kings,7002053,001304,NYU Langone Hospital-Brooklyn,70 or Older,112,F,Other Race,Not Span/Hispanic,6,Emergency,Home or Self Care,2020,EYE012,OTHER SPECIFIED EYE DISORDERS,OTR004,ISOLATION PROCEDURES,082,EYE INFECTIONS & OTHER EYE DISORDERS,02,DISEASES AND DISORDERS OF THE EYE,1,Minor,Moderate,Medical,Medicaid,,,,,Y,72008.16,21011.39
New York City,Manhattan,7002053,001463,NYU Langone Hospitals,0 to 17,117,F,White,Not Span/Hispanic,3,Emergency,Home or Self Care,2020,EYE008,OCULOFACIAL PLASTICS AND ORBITAL CONDITIONS,,,082,EYE INFECTIONS & OTHER EYE DISORDERS,02,DISEASES AND DISORDERS OF THE EYE,1,Minor,Minor,Medical,Blue Cross/Blue Shield,,,,,Y,33987.8,8132.36
New York City,Bronx,7000006,001169,Montefiore Medical Center - Henry & Lucy Moses Div,70 or Older,104,F,Other Race,Spanish/Hispanic,11,Emergency,Home w/ Home Health Services,2020,EYE001,CORNEA AND EXTERNAL DISEASE,OTR004,ISOLATION PROCEDURES,082,EYE INFECTIONS & OTHER EYE DISORDERS,02,DISEASES AND DISORDERS OF THE EYE,2,Moderate,Moderate,Medical,Medicare,,,,,Y,137137.49,24867.11
New York City,Bronx,7000006,001169,Montefiore Medical Center - Henry & Lucy Moses Div,0 to 17,104,M,Other Race,Spanish/Hispanic,2,Emergency,Home or Self Care,2020,EYE008,OCULOFACIAL PLASTICS AND ORBITAL CONDITIONS,MAM011,ELECTROENCEPHALOGRAM (EEG),082,EYE INFECTIONS & OTHER EYE DISORDERS,02,DISEASES AND DISORDERS OF THE EYE,1,Minor,Minor,Medical,Private Health Insurance,,,,,Y,46851.24,7535.79
New York City,Manhattan,7002024,001456,Mount Sinai Hospital,0 to 17,100,M,Black/African American,Not Span/Hispanic,5,Emergency,Home or Self Care,2020,EYE008,OCULOFACIAL PLASTICS AND ORBITAL CONDITIONS,OTR004,ISOLATION PROCEDURES,082,EYE INFECTIONS & OTHER EYE DISORDERS,02,DISEASES AND DISORDERS OF THE EYE,1,Minor,Minor,Medical,Medicaid,Medicaid,Self-Pay,,,Y,51304.4,32785.06
Finger Lakes,Monroe,2701005,000413,Strong Memorial Hospital,30 to 49,144,F,White,Not Span/Hispanic,2,Emergency,Home or Self Care,2020,EYE006,NEURO-OPHTHALMOLOGY,CNS002,LUMBAR PUNCTURE,082,EYE INFECTIONS & OTHER EYE DISORDERS,02,DISEASES AND DISORDERS OF THE EYE,1,Minor,Minor,Medical,Private Health Insurance,,,,,Y,26549.6,7142.73
Finger Lakes,Monroe,2701005,000413,Strong Memorial Hospital,50 to 69,148,M,White,Not Span/Hispanic,1,Emergency,Home or Self Care,2020,EYE010,BLINDNESS AND VISION DEFECTS,,,082,EYE INFECTIONS & OTHER EYE DISORDERS,02,DISEASES AND DISORDERS OF THE EYE,2,Moderate,Minor,Medical,Medicare,Blue Cross/Blue Shield,,,,Y,14745.51,3919.8
New York City,Bronx,7000001,001178,BronxCare Hospital Center,30 to 49,104,F,Other Race,Spanish/Hispanic,7,Emergency,Left Against Medical Advice,2020,EYE010,BLINDNESS AND VISION DEFECTS,,,082,EYE INFECTIONS & OTHER EYE DISORDERS,02,DISEASES AND DISORDERS OF THE EYE,2,Moderate,Minor,Medical,Medicaid,Medicaid,,,,Y,24876.1,37140.37
New York City,Bronx,7000001,001178,BronxCare Hospital Center,70 or Older,100,F,Other Race,Spanish/Hispanic,5,Emergency,Left Against Medical Advice,2020,EYE006,NEURO-OPHTHALMOLOGY,CNS002,LUMBAR PUNCTURE,082,EYE INFECTIONS & OTHER EYE DISORDERS,02,DISEASES AND DISORDERS OF THE EYE,1,Minor,Minor,Medical,Medicare,Medicare,,,,Y,22503.7,28796.06
New York City,Bronx,7000001,001178,BronxCare Hospital Center,30 to 49,104,M,Other Race,Spanish/Hispanic,2,Emergency,Home or Self Care,2020,INJ017,"SUPERFICIAL INJURY; CONTUSION, INITIAL ENCOUNTER",,,082,EYE INFECTIONS & OTHER EYE DISORDERS,02,DISEASES AND DISORDERS OF THE EYE,2,Moderate,Moderate,Medical,Medicaid,,,,,Y,9046.18,11379.87
New York City,Bronx,7000001,001178,BronxCare Hospital Center,70 or Older,104,F,Other Race,Spanish/Hispanic,7,Emergency,Home w/ Home Health Services,2020,EYE005,RETINAL AND VITREOUS CONDITIONS,,,082,EYE INFECTIONS & OTHER EYE DISORDERS,02,DISEASES AND DISORDERS OF THE EYE,2,Moderate,Minor,Medical,Medicare,Medicare,Medicaid,,,Y,28778.95,39637.47
Finger Lakes,Monroe,2701001,000409,Highland Hospital,70 or Older,144,F,White,Not Span/Hispanic,1,Emergency,Short-term Hospital,2020,EYE010,BLINDNESS AND VISION DEFECTS,,,082,EYE INFECTIONS & OTHER EYE DISORDERS,02,DISEASES AND DISORDERS OF THE EYE,3,Major,Moderate,Medical,Medicare,,,,,Y,7909.84,2381.9
New York City,Bronx,7000006,001169,Montefiore Medical Center - Henry & Lucy Moses Div,50 to 69,104,M,Other Race,Spanish/Hispanic,17,Emergency,Home or Self Care,2020,EYE008,OCULOFACIAL PLASTICS AND ORBITAL CONDITIONS,,,082,EYE INFECTIONS & OTHER EYE DISORDERS,02,DISEASES AND DISORDERS OF THE EYE,3,Major,Moderate,Medical,Private Health Insurance,,,,,Y,202973.1,37389.26
Capital/Adirond,Albany,0101000,000001,Albany Medical Center Hospital,70 or Older,121,F,White,Not Span/Hispanic,3,Emergency,Home or Self Care,2020,NVS012,TRANSIENT CEREBRAL ISCHEMIA,,,082,EYE INFECTIONS & OTHER EYE DISORDERS,02,DISEASES AND DISORDERS OF THE EYE,2,Moderate,Minor,Medical,Medicare,Blue Cross/Blue Shield,,,,Y,30367.98,5305.43
Capital/Adirond,Albany,0101000,000001,Albany Medical Center Hospital,0 to 17,120,F,White,Not Span/Hispanic,16,Emergency,Home w/ Home Health Services,2020,EYE001,CORNEA AND EXTERNAL DISEASE,IMG008,ULTRASONOGRAPHY,082,EYE INFECTIONS & OTHER EYE DISORDERS,02,DISEASES AND DISORDERS OF THE EYE,2,Moderate,Minor,Medical,"Managed Care, Unspecified",Medicaid,,,,Y,72612.81,22056.75
Capital/Adirond,Albany,0101000,000001,Albany Medical Center Hospital,50 to 69,123,M,White,Not Span/Hispanic,3,Emergency,Home or Self Care,2020,EYE006,NEURO-OPHTHALMOLOGY,CAR024,VENOUS AND ARTERIAL CATHETER PLACEMENT,082,EYE INFECTIONS & OTHER EYE DISORDERS,02,DISEASES AND DISORDERS OF THE EYE,1,Minor,Minor,Medical,Blue Cross/Blue Shield,,,,,Y,33596.72,9781.07