Hospital Service Area,Hospital County,Operating Certificate Number,Permanent Facility Id,Facility Name,Age Group,Zip Code - 3 digits,Gender,Race,Ethnicity,Length of Stay,Type of Admission,Patient Disposition,Discharge Year,CCS Diagnosis Code,CCS Diagnosis Description,CCS Procedure Code,CCS Procedure Description,APR DRG Code,APR DRG Description,APR MDC Code,APR MDC Description,APR Severity of Illness Code,APR Severity of Illness Description,APR Risk of Mortality,APR Medical Surgical Description,Payment Typology 1,Payment Typology 2,Payment Typology 3,Birth Weight,Abortion Edit Indicator,Emergency Department Indicator,Total Charges,Total Costs
Long Island,Suffolk,5123000,000885,Long Island Community Hospital,30 to 49,119,M,Other Race,Not Span/Hispanic,3,Emergency,Home or Self Care,2020,EYE006,NEURO-OPHTHALMOLOGY,,,082,EYE INFECTIONS & OTHER EYE DISORDERS,02,DISEASES AND DISORDERS OF THE EYE,1,Minor,Minor,Medical,Private Health Insurance,,,,,Y,44265.17,8752.68
Long Island,Suffolk,5123000,000885,Long Island Community Hospital,50 to 69,119,M,White,Not Span/Hispanic,1,Emergency,Home or Self Care,2020,EYE005,RETINAL AND VITREOUS CONDITIONS,,,082,EYE INFECTIONS & OTHER EYE DISORDERS,02,DISEASES AND DISORDERS OF THE EYE,2,Moderate,Major,Medical,Blue Cross/Blue Shield,,,,,Y,39430.72,4298.63
Long Island,Suffolk,5123000,000885,Long Island Community Hospital,30 to 49,117,M,White,Not Span/Hispanic,1,Emergency,Home or Self Care,2020,INJ011,"OPEN WOUNDS OF HEAD AND NECK, INITIAL ENCOUNTER",PLC001,IMMOBILIZATION BY SPLINT OR OTHER EXTERNAL DEVICE,082,EYE INFECTIONS & OTHER EYE DISORDERS,02,DISEASES AND DISORDERS OF THE EYE,2,Moderate,Minor,Medical,Blue Cross/Blue Shield,,,,,Y,34223.76,6239.93
Long Island,Suffolk,5123000,000885,Long Island Community Hospital,18 to 29,119,M,Black/African American,Not Span/Hispanic,4,Urgent,Psychiatric Hospital or Unit of Hosp,2020,INJ011,"OPEN WOUNDS OF HEAD AND NECK, INITIAL ENCOUNTER",SKB006,SKIN LACERATION REPAIR (EXCLUDING PERINEUM),082,EYE INFECTIONS & OTHER EYE DISORDERS,02,DISEASES AND DISORDERS OF THE EYE,2,Moderate,Minor,Medical,Private Health Insurance,Medicaid,,,,N,17855.58,4889.77
Long Island,Suffolk,5123000,000885,Long Island Community Hospital,50 to 69,117,F,White,Not Span/Hispanic,7,Emergency,Home or Self Care,2020,EYE008,OCULOFACIAL PLASTICS AND ORBITAL CONDITIONS,CAR024,VENOUS AND ARTERIAL CATHETER PLACEMENT,082,EYE INFECTIONS & OTHER EYE DISORDERS,02,DISEASES AND DISORDERS OF THE EYE,1,Minor,Minor,Medical,Medicare,,,,,Y,50727.51,9792.36
Long Island,Suffolk,5123000,000885,Long Island Community Hospital,50 to 69,119,M,White,Not Span/Hispanic,1,Emergency,Home or Self Care,2020,EYE005,RETINAL AND VITREOUS CONDITIONS,,,082,EYE INFECTIONS & OTHER EYE DISORDERS,02,DISEASES AND DISORDERS OF THE EYE,1,Minor,Minor,Medical,Medicare,Medicare,Blue Cross/Blue Shield,,,Y,37697.38,4254.93
Long Island,Suffolk,5123000,000885,Long Island Community Hospital,50 to 69,117,M,White,Not Span/Hispanic,1,Emergency,Home or Self Care,2020,EYE010,BLINDNESS AND VISION DEFECTS,OTR004,ISOLATION PROCEDURES,082,EYE INFECTIONS & OTHER EYE DISORDERS,02,DISEASES AND DISORDERS OF THE EYE,1,Minor,Minor,Medical,Blue Cross/Blue Shield,,,,,Y,33273.95,3091.56
Long Island,Suffolk,5123000,000885,Long Island Community Hospital,30 to 49,117,F,White,Not Span/Hispanic,6,Emergency,Home or Self Care,2020,EYE008,OCULOFACIAL PLASTICS AND ORBITAL CONDITIONS,,,082,EYE INFECTIONS & OTHER EYE DISORDERS,02,DISEASES AND DISORDERS OF THE EYE,2,Moderate,Minor,Medical,Blue Cross/Blue Shield,Private Health Insurance,,,,Y,52656.46,10213.01
