Hospital Service Area,Hospital County,Operating Certificate Number,Permanent Facility Id,Facility Name,Age Group,Zip Code - 3 digits,Gender,Race,Ethnicity,Length of Stay,Type of Admission,Patient Disposition,Discharge Year,CCS Diagnosis Code,CCS Diagnosis Description,CCS Procedure Code,CCS Procedure Description,APR DRG Code,APR DRG Description,APR MDC Code,APR MDC Description,APR Severity of Illness Code,APR Severity of Illness Description,APR Risk of Mortality,APR Medical Surgical Description,Payment Typology 1,Payment Typology 2,Payment Typology 3,Birth Weight,Abortion Edit Indicator,Emergency Department Indicator,Total Charges,Total Costs
New York City,Bronx,7000002,001165,Jacobi Medical Center,30 to 49,126,M,Other Race,Unknown,69,Emergency,Inpatient Rehabilitation Facility,2020,INJ019,"BURN AND CORROSION, INITIAL ENCOUNTER",ESA003,MECHANICAL VENTILATION,841,EXTENSIVE 3RD DEGREE BURNS W SKIN GRAFT,22,BURNS,4,Extreme,Extreme,Surgical,Medicare,Medicaid,,,,Y,1098370.69,651924.74
Hudson Valley,Westchester,5957001,001139,Westchester Medical Center,0 to 17,109,F,White,Not Span/Hispanic,25,Emergency,Home or Self Care,2020,INJ019,"BURN AND CORROSION, INITIAL ENCOUNTER",SKB007,SKIN GRAFT,841,EXTENSIVE 3RD DEGREE BURNS W SKIN GRAFT,22,BURNS,3,Major,Moderate,Surgical,Medicaid,Medicaid,,,,Y,610691.28,107562.22
New York City,Manhattan,7002054,001458,New York-Presbyterian Hospital - New York Weill Cornell Center,30 to 49,113,M,Other Race,Not Span/Hispanic,14,Emergency,Home or Self Care,2020,INJ019,"BURN AND CORROSION, INITIAL ENCOUNTER",MAM002,PERIPHERAL ARTERIAL PRESSURE MONITORING,841,EXTENSIVE 3RD DEGREE BURNS W SKIN GRAFT,22,BURNS,3,Major,Moderate,Surgical,"Managed Care, Unspecified",Medicaid,Self-Pay,,,Y,358468.67,83687.16
New York City,Manhattan,7002054,001458,New York-Presbyterian Hospital - New York Weill Cornell Center,50 to 69,112,F,White,Not Span/Hispanic,85,Emergency,Psychiatric Hospital or Unit of Hosp,2020,INJ019,"BURN AND CORROSION, INITIAL ENCOUNTER",SKB007,SKIN GRAFT,841,EXTENSIVE 3RD DEGREE BURNS W SKIN GRAFT,22,BURNS,4,Extreme,Extreme,Surgical,Medicare,Medicare,Medicaid,,,Y,2247686.95,520454.25
Western NY,Erie,1401005,000210,Erie County Medical Center,50 to 69,141,M,White,Not Span/Hispanic,29,Emergency,Home w/ Home Health Services,2020,INJ019,"BURN AND CORROSION, INITIAL ENCOUNTER",SKB008,SKIN EXCISION AND DEBRIDEMENT,841,EXTENSIVE 3RD DEGREE BURNS W SKIN GRAFT,22,BURNS,3,Major,Moderate,Surgical,Medicaid,Medicaid,,,,Y,176624.61,113039.2
Central NY,Onondaga,3301007,000635,University Hospital SUNY Health Science Center,70 or Older,120,M,White,Not Span/Hispanic,14,Trauma,Expired,2020,INJ019,"BURN AND CORROSION, INITIAL ENCOUNTER",SKB007,SKIN GRAFT,841,EXTENSIVE 3RD DEGREE BURNS W SKIN GRAFT,22,BURNS,4,Extreme,Major,Surgical,Medicare,Federal/State/Local/VA,,,,Y,422108.82,109883.56
Central NY,Onondaga,3301007,000635,University Hospital SUNY Health Science Center,30 to 49,131,M,White,Not Span/Hispanic,95,Emergency,Inpatient Rehabilitation Facility,2020,INJ019,"BURN AND CORROSION, INITIAL ENCOUNTER",SKB007,SKIN GRAFT,841,EXTENSIVE 3RD DEGREE BURNS W SKIN GRAFT,22,BURNS,4,Extreme,Extreme,Surgical,Medicaid,,,,,Y,2728486.52,814115.41
New York City,Bronx,7000002,001165,Jacobi Medical Center,50 to 69,108,M,Other Race,Unknown,29,Emergency,Inpatient Rehabilitation Facility,2020,INJ019,"BURN AND CORROSION, INITIAL ENCOUNTER",ESA003,MECHANICAL VENTILATION,841,EXTENSIVE 3RD DEGREE BURNS W SKIN GRAFT,22,BURNS,4,Extreme,Extreme,Surgical,Medicaid,,,,,Y,513748.52,304929.27
Finger Lakes,Monroe,2701005,000413,Strong Memorial Hospital,50 to 69,,M,Other Race,Not Span/Hispanic,14,Emergency,Home w/ Home Health Services,2020,INJ019,"BURN AND CORROSION, INITIAL ENCOUNTER",SKB007,SKIN GRAFT,841,EXTENSIVE 3RD DEGREE BURNS W SKIN GRAFT,22,BURNS,3,Major,Moderate,Surgical,Medicaid,,,,,Y,82327.74,48050.86
New York City,Manhattan,7002054,001458,New York-Presbyterian Hospital - New York Weill Cornell Center,0 to 17,112,F,White,Not Span/Hispanic,24,Emergency,Home w/ Home Health Services,2020,INJ019,"BURN AND CORROSION, INITIAL ENCOUNTER",SKB007,SKIN GRAFT,841,EXTENSIVE 3RD DEGREE BURNS W SKIN GRAFT,22,BURNS,3,Major,Minor,Surgical,"Managed Care, Unspecified",Medicaid,Self-Pay,,,Y,596091.95,139765.12
New York City,Manhattan,7002054,001458,New York-Presbyterian Hospital - New York Weill Cornell Center,0 to 17,114,F,Multi-racial,Not Span/Hispanic,70,Emergency,Cancer Center or Children's Hospital,2020,INJ019,"BURN AND CORROSION, INITIAL ENCOUNTER",SKB007,SKIN GRAFT,841,EXTENSIVE 3RD DEGREE BURNS W SKIN GRAFT,22,BURNS,4,Extreme,Extreme,Surgical,Medicaid,Self-Pay,,,,Y,2051236.61,865456.93
New York City,Bronx,7000002,001165,Jacobi Medical Center,50 to 69,108,M,Other Race,Unknown,5,Urgent,Inpatient Rehabilitation Facility,2020,INJ019,"BURN AND CORROSION, INITIAL ENCOUNTER",SKB007,SKIN GRAFT,841,EXTENSIVE 3RD DEGREE BURNS W SKIN GRAFT,22,BURNS,3,Major,Moderate,Surgical,Medicaid,,,,,N,47677.09,28298.16
Hudson Valley,Westchester,5957001,001139,Westchester Medical Center,30 to 49,124,F,White,Not Span/Hispanic,61,Emergency,Inpatient Rehabilitation Facility,2020,INJ019,"BURN AND CORROSION, INITIAL ENCOUNTER",SKB008,SKIN EXCISION AND DEBRIDEMENT,841,EXTENSIVE 3RD DEGREE BURNS W SKIN GRAFT,22,BURNS,4,Extreme,Extreme,Surgical,Private Health Insurance,,,,,Y,2545183.1,440780.92
Long Island,Nassau,2950002,000528,Nassau University Medical Center,50 to 69,115,F,Other Race,Unknown,15,Trauma,Home w/ Home Health Services,2020,INJ019,"BURN AND CORROSION, INITIAL ENCOUNTER",SKB007,SKIN GRAFT,841,EXTENSIVE 3RD DEGREE BURNS W SKIN GRAFT,22,BURNS,4,Extreme,Extreme,Surgical,Private Health Insurance,Self-Pay,,,,N,180333.64,88775.34
New York City,Manhattan,7002054,001458,New York-Presbyterian Hospital - New York Weill Cornell Center,18 to 29,112,M,White,Spanish/Hispanic,25,Emergency,Home or Self Care,2020,INJ019,"BURN AND CORROSION, INITIAL ENCOUNTER",SKB007,SKIN GRAFT,841,EXTENSIVE 3RD DEGREE BURNS W SKIN GRAFT,22,BURNS,4,Extreme,Major,Surgical,Medicaid,Self-Pay,,,,N,668377.74,162065.44
Finger Lakes,Monroe,2701005,000413,Strong Memorial Hospital,30 to 49,141,F,White,Not Span/Hispanic,13,Emergency,Home or Self Care,2020,INJ019,"BURN AND CORROSION, INITIAL ENCOUNTER",SKB007,SKIN GRAFT,841,EXTENSIVE 3RD DEGREE BURNS W SKIN GRAFT,22,BURNS,3,Major,Moderate,Surgical,Private Health Insurance,,,,,Y,101245.64,52047.84
New York City,Richmond,7004003,001740,Staten Island University Hosp-North,70 or Older,115,M,Other Race,Not Span/Hispanic,25,Emergency,Home w/ Home Health Services,2020,INJ019,"BURN AND CORROSION, INITIAL ENCOUNTER",SKB007,SKIN GRAFT,841,EXTENSIVE 3RD DEGREE BURNS W SKIN GRAFT,22,BURNS,3,Major,Major,Surgical,Medicare,Medicare,,,,Y,413584.39,130564.26
Western NY,Erie,1401005,000210,Erie County Medical Center,50 to 69,140,M,White,Not Span/Hispanic,16,Emergency,Inpatient Rehabilitation Facility,2020,INJ019,"BURN AND CORROSION, INITIAL ENCOUNTER",SKB007,SKIN GRAFT,841,EXTENSIVE 3RD DEGREE BURNS W SKIN GRAFT,22,BURNS,3,Major,Major,Surgical,Miscellaneous/Other,Blue Cross/Blue Shield,,,,Y,114906.7,70135.41
Long Island,Suffolk,5151001,000245,Stony Brook University Hospital,30 to 49,117,M,White,Not Span/Hispanic,16,Emergency,Home w/ Home Health Services,2020,INJ019,"BURN AND CORROSION, INITIAL ENCOUNTER",SKB008,SKIN EXCISION AND DEBRIDEMENT,841,EXTENSIVE 3RD DEGREE BURNS W SKIN GRAFT,22,BURNS,3,Major,Moderate,Surgical,Miscellaneous/Other,Private Health Insurance,,,,Y,210753.81,66618.97
Long Island,Suffolk,5151001,000245,Stony Brook University Hospital,18 to 29,117,M,Black/African American,Not Span/Hispanic,8,Urgent,Home or Self Care,2020,INJ019,"BURN AND CORROSION, INITIAL ENCOUNTER",SKB008,SKIN EXCISION AND DEBRIDEMENT,841,EXTENSIVE 3RD DEGREE BURNS W SKIN GRAFT,22,BURNS,1,Minor,Minor,Surgical,Medicaid,,,,,N,128753.34,48435.33
Long Island,Nassau,2950002,000528,Nassau University Medical Center,18 to 29,115,M,Other Race,Not Span/Hispanic,12,Trauma,Home w/ Home Health Services,2020,INJ019,"BURN AND CORROSION, INITIAL ENCOUNTER",SKB007,SKIN GRAFT,841,EXTENSIVE 3RD DEGREE BURNS W SKIN GRAFT,22,BURNS,3,Major,Moderate,Surgical,Miscellaneous/Other,Medicaid,Self-Pay,,,N,136628.27,39139.42
Finger Lakes,Monroe,2701005,000413,Strong Memorial Hospital,30 to 49,148,F,White,Not Span/Hispanic,15,Emergency,Home w/ Home Health Services,2020,INJ019,"BURN AND CORROSION, INITIAL ENCOUNTER",SKB007,SKIN GRAFT,841,EXTENSIVE 3RD DEGREE BURNS W SKIN GRAFT,22,BURNS,3,Major,Moderate,Surgical,Private Health Insurance,,,,,Y,134067.14,67179.59
New York City,Manhattan,7002009,001445,Harlem Hospital Center,70 or Older,100,M,Other Race,Not Span/Hispanic,21,Emergency,Expired,2020,INJ019,"BURN AND CORROSION, INITIAL ENCOUNTER",MST020,SUBCUTANEOUS TISSUE AND FASCIA EXCISION,841,EXTENSIVE 3RD DEGREE BURNS W SKIN GRAFT,22,BURNS,4,Extreme,Extreme,Surgical,Medicare,,,,,Y,538086.24,412831.6
New York City,Richmond,7004003,001740,Staten Island University Hosp-North,30 to 49,103,M,White,Not Span/Hispanic,19,Emergency,Inpatient Rehabilitation Facility,2020,INJ019,"BURN AND CORROSION, INITIAL ENCOUNTER",SKB008,SKIN EXCISION AND DEBRIDEMENT,841,EXTENSIVE 3RD DEGREE BURNS W SKIN GRAFT,22,BURNS,4,Extreme,Extreme,Surgical,Miscellaneous/Other,Medicare,Blue Cross/Blue Shield,,,Y,427999.39,122338.88
Central NY,Onondaga,3301007,000635,University Hospital SUNY Health Science Center,50 to 69,123,M,White,Not Span/Hispanic,8,Emergency,Expired,2020,INJ019,"BURN AND CORROSION, INITIAL ENCOUNTER",SKB007,SKIN GRAFT,841,EXTENSIVE 3RD DEGREE BURNS W SKIN GRAFT,22,BURNS,4,Extreme,Extreme,Surgical,Private Health Insurance,,,,,N,380124.41,105887.99
Hudson Valley,Westchester,5957001,001139,Westchester Medical Center,70 or Older,100,M,White,Not Span/Hispanic,49,Emergency,Inpatient Rehabilitation Facility,2020,INJ019,"BURN AND CORROSION, INITIAL ENCOUNTER",SKB007,SKIN GRAFT,841,EXTENSIVE 3RD DEGREE BURNS W SKIN GRAFT,22,BURNS,3,Major,Major,Surgical,Blue Cross/Blue Shield,Medicare,,,,Y,2232548.34,384511.12
Western NY,Erie,1401005,000210,Erie County Medical Center,30 to 49,142,M,White,Not Span/Hispanic,33,Emergency,Inpatient Rehabilitation Facility,2020,INJ019,"BURN AND CORROSION, INITIAL ENCOUNTER",SKB008,SKIN EXCISION AND DEBRIDEMENT,841,EXTENSIVE 3RD DEGREE BURNS W SKIN GRAFT,22,BURNS,4,Extreme,Extreme,Surgical,Medicaid,,,,,Y,312014.25,168384.61
New York City,Manhattan,7002009,001445,Harlem Hospital Center,18 to 29,100,F,White,Not Span/Hispanic,21,Emergency,Another Type Not Listed,2020,INJ019,"BURN AND CORROSION, INITIAL ENCOUNTER",ESA007,CARDIAC PACING,841,EXTENSIVE 3RD DEGREE BURNS W SKIN GRAFT,22,BURNS,4,Extreme,Major,Surgical,Private Health Insurance,,,,,Y,293681.77,225319.11
New York City,Richmond,7004003,001740,Staten Island University Hosp-North,18 to 29,112,M,Other Race,Not Span/Hispanic,15,Emergency,Home w/ Home Health Services,2020,INJ019,"BURN AND CORROSION, INITIAL ENCOUNTER",SKB008,SKIN EXCISION AND DEBRIDEMENT,841,EXTENSIVE 3RD DEGREE BURNS W SKIN GRAFT,22,BURNS,3,Major,Moderate,Surgical,Medicaid,,,,,Y,223701.99,61313.02
Long Island,Suffolk,5151001,000245,Stony Brook University Hospital,50 to 69,119,M,White,Not Span/Hispanic,1,Emergency,Expired,2020,INJ019,"BURN AND CORROSION, INITIAL ENCOUNTER",RES007,AIRWAY INTUBATION,841,EXTENSIVE 3RD DEGREE BURNS W SKIN GRAFT,22,BURNS,4,Extreme,Extreme,Surgical,Blue Cross/Blue Shield,,,,,Y,60607.8,15529.59
Hudson Valley,Westchester,5957001,001139,Westchester Medical Center,30 to 49,125,F,White,Not Span/Hispanic,20,Emergency,Home w/ Home Health Services,2020,INJ019,"BURN AND CORROSION, INITIAL ENCOUNTER",SKB007,SKIN GRAFT,841,EXTENSIVE 3RD DEGREE BURNS W SKIN GRAFT,22,BURNS,3,Major,Moderate,Surgical,Blue Cross/Blue Shield,,,,,Y,740834.44,129508.71
Long Island,Nassau,2950002,000528,Nassau University Medical Center,18 to 29,114,M,Black/African American,Not Span/Hispanic,20,Trauma,Home or Self Care,2020,INJ019,"BURN AND CORROSION, INITIAL ENCOUNTER",SKB007,SKIN GRAFT,841,EXTENSIVE 3RD DEGREE BURNS W SKIN GRAFT,22,BURNS,3,Major,Moderate,Surgical,Medicaid,Medicaid,Self-Pay,,,N,262057.13,143927.49
Long Island,Nassau,2950002,000528,Nassau University Medical Center,50 to 69,117,F,Black/African American,Not Span/Hispanic,18,Emergency,Skilled Nursing Home,2020,INJ019,"BURN AND CORROSION, INITIAL ENCOUNTER",SKB007,SKIN GRAFT,841,EXTENSIVE 3RD DEGREE BURNS W SKIN GRAFT,22,BURNS,3,Major,Moderate,Surgical,Medicaid,Medicaid,Self-Pay,,,Y,202074.44,58167.9
Long Island,Nassau,2950002,000528,Nassau University Medical Center,50 to 69,116,M,Black/African American,Not Span/Hispanic,95,Trauma,Skilled Nursing Home,2020,INJ019,"BURN AND CORROSION, INITIAL ENCOUNTER",SKB008,SKIN EXCISION AND DEBRIDEMENT,841,EXTENSIVE 3RD DEGREE BURNS W SKIN GRAFT,22,BURNS,4,Extreme,Moderate,Surgical,Medicaid,Self-Pay,,,,Y,1196530.14,471821.25
Finger Lakes,Monroe,2701005,000413,Strong Memorial Hospital,18 to 29,144,M,White,Not Span/Hispanic,55,Emergency,Inpatient Rehabilitation Facility,2020,INJ019,"BURN AND CORROSION, INITIAL ENCOUNTER",SKB008,SKIN EXCISION AND DEBRIDEMENT,841,EXTENSIVE 3RD DEGREE BURNS W SKIN GRAFT,22,BURNS,4,Extreme,Extreme,Surgical,Blue Cross/Blue Shield,Medicaid,,,,Y,532105.22,231620.94
Finger Lakes,Monroe,2701005,000413,Strong Memorial Hospital,50 to 69,145,M,White,Not Span/Hispanic,25,Emergency,Home w/ Home Health Services,2020,INJ019,"BURN AND CORROSION, INITIAL ENCOUNTER",SKB007,SKIN GRAFT,841,EXTENSIVE 3RD DEGREE BURNS W SKIN GRAFT,22,BURNS,3,Major,Major,Surgical,Medicaid,,,,,Y,126019.11,69196.97
Hudson Valley,Westchester,5957001,001139,Westchester Medical Center,30 to 49,,M,Other Race,Unknown,3,Emergency,Expired,2020,INJ019,"BURN AND CORROSION, INITIAL ENCOUNTER",MST030,"MUSCULOSKELETAL PROCEDURES, NEC",841,EXTENSIVE 3RD DEGREE BURNS W SKIN GRAFT,22,BURNS,4,Extreme,Extreme,Surgical,Department of Corrections,,,,,Y,205788,35366.78
Finger Lakes,Monroe,2701005,000413,Strong Memorial Hospital,0 to 17,146,M,Black/African American,Not Span/Hispanic,31,Emergency,Home w/ Home Health Services,2020,INJ019,"BURN AND CORROSION, INITIAL ENCOUNTER",CAR024,VENOUS AND ARTERIAL CATHETER PLACEMENT,841,EXTENSIVE 3RD DEGREE BURNS W SKIN GRAFT,22,BURNS,3,Major,Minor,Surgical,Medicaid,,,,,Y,108465.69,58181.28
New York City,Manhattan,7002054,001458,New York-Presbyterian Hospital - New York Weill Cornell Center,0 to 17,100,M,Other Race,Unknown,73,Emergency,Inpatient Rehabilitation Facility,2020,INJ019,"BURN AND CORROSION, INITIAL ENCOUNTER",RES007,AIRWAY INTUBATION,841,EXTENSIVE 3RD DEGREE BURNS W SKIN GRAFT,22,BURNS,4,Extreme,Extreme,Surgical,Medicaid,,,,,Y,2405620.64,1032320.36
