Hospital Service Area,Hospital County,Operating Certificate Number,Permanent Facility Id,Facility Name,Age Group,Zip Code - 3 digits,Gender,Race,Ethnicity,Length of Stay,Type of Admission,Patient Disposition,Discharge Year,CCS Diagnosis Code,CCS Diagnosis Description,CCS Procedure Code,CCS Procedure Description,APR DRG Code,APR DRG Description,APR MDC Code,APR MDC Description,APR Severity of Illness Code,APR Severity of Illness Description,APR Risk of Mortality,APR Medical Surgical Description,Payment Typology 1,Payment Typology 2,Payment Typology 3,Birth Weight,Abortion Edit Indicator,Emergency Department Indicator,Total Charges,Total Costs
New York City,Bronx,7000002,001165,Jacobi Medical Center,18 to 29,104,M,Other Race,Not Span/Hispanic,8,Emergency,Short-term Hospital,2019,INJ019,"BURN AND CORROSION, INITIAL ENCOUNTER",ESA003,MECHANICAL VENTILATION,844,PARTIAL THICKNESS BURNS W/O SKIN GRAFT,22,BURNS,4,Extreme,Extreme,Medical,Medicaid,Medicaid,,,,true,70976.9,41993.48
New York City,Kings,7002053,001304,NYU Langone Hospital-Brooklyn,50 to 69,112,F,White,Spanish/Hispanic,1,Emergency,Home w/ Home Health Services,2019,INJ019,"BURN AND CORROSION, INITIAL ENCOUNTER",MST020,SUBCUTANEOUS TISSUE AND FASCIA EXCISION,844,PARTIAL THICKNESS BURNS W/O SKIN GRAFT,22,BURNS,2,Moderate,Moderate,Medical,Medicare,Blue Cross/Blue Shield,,,,true,30257.24,6598.94
Hudson Valley,Westchester,5957001,001139,Westchester Medical Center,0 to 17,,M,White,Not Span/Hispanic,1,Emergency,Home or Self Care,2019,INJ019,"BURN AND CORROSION, INITIAL ENCOUNTER",,,844,PARTIAL THICKNESS BURNS W/O SKIN GRAFT,22,BURNS,1,Minor,Minor,Medical,Medicaid,Medicaid,,,,true,17302.6,2856.31
Hudson Valley,Westchester,5957001,001139,Westchester Medical Center,30 to 49,107,M,Other Race,Unknown,3,Emergency,Home or Self Care,2019,INJ019,"BURN AND CORROSION, INITIAL ENCOUNTER",SKB008,SKIN EXCISION AND DEBRIDEMENT,844,PARTIAL THICKNESS BURNS W/O SKIN GRAFT,22,BURNS,1,Minor,Minor,Medical,Medicaid,,,,,true,81121.32,14401.34
Hudson Valley,Westchester,5957001,001139,Westchester Medical Center,0 to 17,105,F,White,Not Span/Hispanic,5,Emergency,Home or Self Care,2019,INJ019,"BURN AND CORROSION, INITIAL ENCOUNTER",SKB008,SKIN EXCISION AND DEBRIDEMENT,844,PARTIAL THICKNESS BURNS W/O SKIN GRAFT,22,BURNS,1,Minor,Minor,Medical,Private Health Insurance,,,,,true,74160.15,12894.26
Hudson Valley,Westchester,5957001,001139,Westchester Medical Center,50 to 69,105,F,Other Race,Unknown,1,Emergency,Home or Self Care,2019,INJ019,"BURN AND CORROSION, INITIAL ENCOUNTER",,,844,PARTIAL THICKNESS BURNS W/O SKIN GRAFT,22,BURNS,1,Minor,Minor,Medical,Blue Cross/Blue Shield,,,,,true,29541.02,4999.06
Hudson Valley,Westchester,5957001,001139,Westchester Medical Center,70 or Older,109,M,Other Race,Spanish/Hispanic,3,Emergency,Home or Self Care,2019,INJ019,"BURN AND CORROSION, INITIAL ENCOUNTER",,,844,PARTIAL THICKNESS BURNS W/O SKIN GRAFT,22,BURNS,2,Moderate,Minor,Medical,Medicare,Medicare,,,,true,80394.85,14109.32
New York City,Richmond,7004003,001740,Staten Island University Hosp-North,50 to 69,112,F,Other Race,Unknown,26,Trauma,Inpatient Rehabilitation Facility,2019,INJ019,"BURN AND CORROSION, INITIAL ENCOUNTER",GIS017,GASTROSTOMY,844,PARTIAL THICKNESS BURNS W/O SKIN GRAFT,22,BURNS,4,Extreme,Extreme,Medical,Medicaid,Medicaid,,,,true,326636.1,82598
Long Island,Suffolk,5151001,000245,Stony Brook University Hospital,50 to 69,117,F,White,Not Span/Hispanic,2,Not Available,Home w/ Home Health Services,2019,INJ019,"BURN AND CORROSION, INITIAL ENCOUNTER",,,844,PARTIAL THICKNESS BURNS W/O SKIN GRAFT,22,BURNS,1,Minor,Minor,Medical,Medicaid,Medicaid,,,,true,22361.66,6780.71
New York City,Richmond,7004003,001740,Staten Island University Hosp-North,30 to 49,103,M,Other Race,Spanish/Hispanic,8,Urgent,Home w/ Home Health Services,2019,INJ019,"BURN AND CORROSION, INITIAL ENCOUNTER",,,844,PARTIAL THICKNESS BURNS W/O SKIN GRAFT,22,BURNS,3,Major,Minor,Medical,Blue Cross/Blue Shield,,,,,false,67773.5,19076.2
Finger Lakes,Monroe,2701005,000413,Strong Memorial Hospital,30 to 49,144,M,Black/African American,Not Span/Hispanic,3,Urgent,Home or Self Care,2019,INJ019,"BURN AND CORROSION, INITIAL ENCOUNTER",SKB008,SKIN EXCISION AND DEBRIDEMENT,844,PARTIAL THICKNESS BURNS W/O SKIN GRAFT,22,BURNS,2,Moderate,Minor,Medical,Self-Pay,,,,,false,6171.9,3573.9
Finger Lakes,Monroe,2754001,000471,The Unity Hospital of Rochester,70 or Older,146,M,White,Not Span/Hispanic,27,Emergency,Expired,2019,INJ019,"BURN AND CORROSION, INITIAL ENCOUNTER",MST005,INCISION AND DRAINAGE OF SUBCUTANEOUS TISSUE AND FASCIA,844,PARTIAL THICKNESS BURNS W/O SKIN GRAFT,22,BURNS,4,Extreme,Extreme,Medical,Medicare,Medicaid,,,,true,98603.32,74657
New York City,Bronx,7000002,001165,Jacobi Medical Center,70 or Older,113,M,White,Not Span/Hispanic,16,Emergency,Expired,2019,INJ019,"BURN AND CORROSION, INITIAL ENCOUNTER",RES007,AIRWAY INTUBATION,844,PARTIAL THICKNESS BURNS W/O SKIN GRAFT,22,BURNS,4,Extreme,Extreme,Medical,Medicare,Medicare,,,,true,125568.44,74292.57
New York City,Manhattan,7002054,001458,New York-Presbyterian Hospital - New York Weill Cornell Center,0 to 17,112,M,Other Race,Spanish/Hispanic,1,Emergency,Home or Self Care,2019,INJ019,"BURN AND CORROSION, INITIAL ENCOUNTER",PLC002,PACKING AND DRESSING PROCEDURES,844,PARTIAL THICKNESS BURNS W/O SKIN GRAFT,22,BURNS,1,Minor,Minor,Medical,"Managed Care, Unspecified",Medicaid,Self-Pay,,,false,20460.5,4571.89
New York City,Manhattan,7002054,001458,New York-Presbyterian Hospital - New York Weill Cornell Center,50 to 69,100,F,Black/African American,Not Span/Hispanic,2,Emergency,Home w/ Home Health Services,2019,INJ019,"BURN AND CORROSION, INITIAL ENCOUNTER",SKB008,SKIN EXCISION AND DEBRIDEMENT,844,PARTIAL THICKNESS BURNS W/O SKIN GRAFT,22,BURNS,2,Moderate,Major,Medical,Medicare,Medicaid,Self-Pay,,,false,57603.14,12340.65
New York City,Manhattan,7002054,001458,New York-Presbyterian Hospital - New York Weill Cornell Center,70 or Older,112,F,White,Not Span/Hispanic,2,Emergency,Home w/ Home Health Services,2019,INJ019,"BURN AND CORROSION, INITIAL ENCOUNTER",ADM015,ADMINISTRATION OF ANTIBIOTICS,844,PARTIAL THICKNESS BURNS W/O SKIN GRAFT,22,BURNS,2,Moderate,Moderate,Medical,Medicare,Self-Pay,,,,true,44898.54,10118.36
New York City,Manhattan,7002054,001458,New York-Presbyterian Hospital - New York Weill Cornell Center,30 to 49,104,F,Black/African American,Not Span/Hispanic,2,Emergency,Home or Self Care,2019,INJ019,"BURN AND CORROSION, INITIAL ENCOUNTER",ADM010,VACCINATIONS,844,PARTIAL THICKNESS BURNS W/O SKIN GRAFT,22,BURNS,2,Moderate,Minor,Medical,"Managed Care, Unspecified",Medicaid,Self-Pay,,,true,24244.56,5412.84
New York City,Manhattan,7002054,001458,New York-Presbyterian Hospital - New York Weill Cornell Center,30 to 49,100,F,White,Not Span/Hispanic,1,Emergency,Home or Self Care,2019,INJ019,"BURN AND CORROSION, INITIAL ENCOUNTER",PLC002,PACKING AND DRESSING PROCEDURES,844,PARTIAL THICKNESS BURNS W/O SKIN GRAFT,22,BURNS,1,Minor,Minor,Medical,"Managed Care, Unspecified",Medicaid,Self-Pay,,,true,23984.07,5389.77
New York City,Manhattan,7002054,001458,New York-Presbyterian Hospital - New York Weill Cornell Center,0 to 17,114,F,Other Race,Not Span/Hispanic,1,Emergency,Home or Self Care,2019,INJ019,"BURN AND CORROSION, INITIAL ENCOUNTER",,,844,PARTIAL THICKNESS BURNS W/O SKIN GRAFT,22,BURNS,1,Minor,Minor,Medical,"Managed Care, Unspecified",Medicaid,Self-Pay,,,true,23357.13,5337.86
New York City,Manhattan,7002054,001458,New York-Presbyterian Hospital - New York Weill Cornell Center,0 to 17,100,M,White,Not Span/Hispanic,1,Emergency,Home or Self Care,2019,INJ019,"BURN AND CORROSION, INITIAL ENCOUNTER",PLC002,PACKING AND DRESSING PROCEDURES,844,PARTIAL THICKNESS BURNS W/O SKIN GRAFT,22,BURNS,1,Minor,Minor,Medical,Private Health Insurance,Self-Pay,,,,true,23364.87,5342.38
New York City,Richmond,7004003,001740,Staten Island University Hosp-North,30 to 49,103,M,Other Race,Not Span/Hispanic,4,Emergency,Home or Self Care,2019,INJ019,"BURN AND CORROSION, INITIAL ENCOUNTER",,,844,PARTIAL THICKNESS BURNS W/O SKIN GRAFT,22,BURNS,2,Moderate,Minor,Medical,Medicaid,,,,,true,22998.9,6402.05
New York City,Manhattan,7002054,001458,New York-Presbyterian Hospital - New York Weill Cornell Center,0 to 17,112,M,Other Race,Spanish/Hispanic,2,Emergency,Home or Self Care,2019,INJ019,"BURN AND CORROSION, INITIAL ENCOUNTER",,,844,PARTIAL THICKNESS BURNS W/O SKIN GRAFT,22,BURNS,1,Minor,Minor,Medical,"Managed Care, Unspecified",Medicaid,Self-Pay,,,true,42723.87,9513.09
New York City,Manhattan,7002054,001458,New York-Presbyterian Hospital - New York Weill Cornell Center,70 or Older,100,M,Multi-racial,Not Span/Hispanic,1,Emergency,Home or Self Care,2019,INJ019,"BURN AND CORROSION, INITIAL ENCOUNTER",SKB008,SKIN EXCISION AND DEBRIDEMENT,844,PARTIAL THICKNESS BURNS W/O SKIN GRAFT,22,BURNS,1,Minor,Moderate,Medical,Medicare,Medicaid,Self-Pay,,,true,24816,5673.73
New York City,Manhattan,7002054,001458,New York-Presbyterian Hospital - New York Weill Cornell Center,50 to 69,112,F,Multi-racial,Not Span/Hispanic,1,Emergency,Home or Self Care,2019,INJ019,"BURN AND CORROSION, INITIAL ENCOUNTER",ADM010,VACCINATIONS,844,PARTIAL THICKNESS BURNS W/O SKIN GRAFT,22,BURNS,1,Minor,Minor,Medical,Medicare,Medicare,Self-Pay,,,true,23893.73,5404.97
New York City,Manhattan,7002054,001458,New York-Presbyterian Hospital - New York Weill Cornell Center,70 or Older,100,M,Other Race,Not Span/Hispanic,6,Emergency,Skilled Nursing Home,2019,INJ019,"BURN AND CORROSION, INITIAL ENCOUNTER",ADM015,ADMINISTRATION OF ANTIBIOTICS,844,PARTIAL THICKNESS BURNS W/O SKIN GRAFT,22,BURNS,2,Moderate,Moderate,Medical,Medicare,Self-Pay,,,,true,132788,29323.43
New York City,Manhattan,7002054,001458,New York-Presbyterian Hospital - New York Weill Cornell Center,0 to 17,112,M,Black/African American,Not Span/Hispanic,2,Emergency,Home or Self Care,2019,INJ019,"BURN AND CORROSION, INITIAL ENCOUNTER",PLC002,PACKING AND DRESSING PROCEDURES,844,PARTIAL THICKNESS BURNS W/O SKIN GRAFT,22,BURNS,1,Minor,Minor,Medical,"Managed Care, Unspecified",Medicaid,Self-Pay,,,true,43937.25,9941.57
Capital/Adirond,Albany,0101000,000001,Albany Medical Center Hospital,30 to 49,122,F,Black/African American,Not Span/Hispanic,2,Emergency,Home or Self Care,2019,INJ019,"BURN AND CORROSION, INITIAL ENCOUNTER",,,844,PARTIAL THICKNESS BURNS W/O SKIN GRAFT,22,BURNS,1,Minor,Minor,Medical,Medicare,Medicaid,,,,true,10959.1,3336.17
Hudson Valley,Westchester,5957001,001139,Westchester Medical Center,0 to 17,107,M,Black/African American,Not Span/Hispanic,2,Emergency,Home or Self Care,2019,INJ019,"BURN AND CORROSION, INITIAL ENCOUNTER",,,844,PARTIAL THICKNESS BURNS W/O SKIN GRAFT,22,BURNS,1,Minor,Minor,Medical,Medicaid,Medicaid,,,,true,39256.81,7042.2
Central NY,Onondaga,3301007,000635,University Hospital SUNY Health Science Center,0 to 17,132,F,Black/African American,Spanish/Hispanic,2,Emergency,Home or Self Care,2019,INJ019,"BURN AND CORROSION, INITIAL ENCOUNTER",,,844,PARTIAL THICKNESS BURNS W/O SKIN GRAFT,22,BURNS,1,Minor,Minor,Medical,Medicaid,,,,,true,15507.5,4626.43
Central NY,Onondaga,3301007,000635,University Hospital SUNY Health Science Center,50 to 69,136,F,White,Not Span/Hispanic,2,Emergency,Home or Self Care,2019,INJ019,"BURN AND CORROSION, INITIAL ENCOUNTER",ADM010,VACCINATIONS,844,PARTIAL THICKNESS BURNS W/O SKIN GRAFT,22,BURNS,2,Moderate,Minor,Medical,Medicare,Medicaid,,,,true,14839.75,4455.2
Central NY,Onondaga,3301007,000635,University Hospital SUNY Health Science Center,30 to 49,137,M,White,Not Span/Hispanic,7,Elective,Home w/ Home Health Services,2019,INJ019,"BURN AND CORROSION, INITIAL ENCOUNTER",RHB002,"PHYSICAL, OCCUPATIONAL, AND RESPIRATORY THERAPY TREATMENT",844,PARTIAL THICKNESS BURNS W/O SKIN GRAFT,22,BURNS,3,Major,Minor,Medical,Medicaid,,,,,false,54086.1,15371.5
Central NY,Onondaga,3301007,000635,University Hospital SUNY Health Science Center,50 to 69,134,M,White,Not Span/Hispanic,2,Trauma,Home or Self Care,2019,INJ019,"BURN AND CORROSION, INITIAL ENCOUNTER",ADM021,"ADMINISTRATION OF THERAPEUTIC SUBSTANCES, NEC",844,PARTIAL THICKNESS BURNS W/O SKIN GRAFT,22,BURNS,4,Extreme,Major,Medical,Medicaid,,,,,false,26981.86,7814.99
New York City,Manhattan,7002054,001458,New York-Presbyterian Hospital - New York Weill Cornell Center,0 to 17,114,F,Other Race,Not Span/Hispanic,1,Emergency,Home or Self Care,2019,INJ019,"BURN AND CORROSION, INITIAL ENCOUNTER",SKB008,SKIN EXCISION AND DEBRIDEMENT,844,PARTIAL THICKNESS BURNS W/O SKIN GRAFT,22,BURNS,3,Major,Minor,Medical,"Managed Care, Unspecified",Medicaid,Self-Pay,,,true,23489.66,5407.47
New York City,Manhattan,7002054,001458,New York-Presbyterian Hospital - New York Weill Cornell Center,30 to 49,104,M,White,Spanish/Hispanic,4,Emergency,Home or Self Care,2019,INJ019,"BURN AND CORROSION, INITIAL ENCOUNTER",MST020,SUBCUTANEOUS TISSUE AND FASCIA EXCISION,844,PARTIAL THICKNESS BURNS W/O SKIN GRAFT,22,BURNS,2,Moderate,Moderate,Medical,Medicare,Medicaid,Self-Pay,,,true,55970.18,13185.43
New York City,Manhattan,7002054,001458,New York-Presbyterian Hospital - New York Weill Cornell Center,0 to 17,112,M,Other Race,Not Span/Hispanic,3,Emergency,Home or Self Care,2019,INJ019,"BURN AND CORROSION, INITIAL ENCOUNTER",,,844,PARTIAL THICKNESS BURNS W/O SKIN GRAFT,22,BURNS,1,Minor,Minor,Medical,"Managed Care, Unspecified",Medicaid,Self-Pay,,,false,60196.58,13217.69
New York City,Manhattan,7002054,001458,New York-Presbyterian Hospital - New York Weill Cornell Center,50 to 69,114,M,Other Race,Not Span/Hispanic,1,Emergency,Home or Self Care,2019,INJ019,"BURN AND CORROSION, INITIAL ENCOUNTER",,,844,PARTIAL THICKNESS BURNS W/O SKIN GRAFT,22,BURNS,1,Minor,Minor,Medical,"Managed Care, Unspecified",Medicaid,Self-Pay,,,true,14713.51,3347.97
New York City,Manhattan,7002054,001458,New York-Presbyterian Hospital - New York Weill Cornell Center,30 to 49,116,M,Other Race,Spanish/Hispanic,1,Emergency,Home or Self Care,2019,INJ019,"BURN AND CORROSION, INITIAL ENCOUNTER",PLC002,PACKING AND DRESSING PROCEDURES,844,PARTIAL THICKNESS BURNS W/O SKIN GRAFT,22,BURNS,1,Minor,Minor,Medical,Miscellaneous/Other,Self-Pay,,,,true,12334.29,2849.39
New York City,Manhattan,7002054,001458,New York-Presbyterian Hospital - New York Weill Cornell Center,50 to 69,100,F,Other Race,Spanish/Hispanic,20,Emergency,Skilled Nursing Home,2019,INJ019,"BURN AND CORROSION, INITIAL ENCOUNTER",SKB007,SKIN GRAFT,844,PARTIAL THICKNESS BURNS W/O SKIN GRAFT,22,BURNS,3,Major,Moderate,Medical,Medicaid,Self-Pay,,,,true,518596.98,125474.13
New York City,Manhattan,7002054,001458,New York-Presbyterian Hospital - New York Weill Cornell Center,0 to 17,112,F,Other Race,Not Span/Hispanic,1,Emergency,Home or Self Care,2019,INJ019,"BURN AND CORROSION, INITIAL ENCOUNTER",PLC002,PACKING AND DRESSING PROCEDURES,844,PARTIAL THICKNESS BURNS W/O SKIN GRAFT,22,BURNS,1,Minor,Minor,Medical,"Managed Care, Unspecified",Medicaid,Self-Pay,,,true,23218.35,5256.86
New York City,Manhattan,7002054,001458,New York-Presbyterian Hospital - New York Weill Cornell Center,0 to 17,112,F,Other Race,Not Span/Hispanic,6,Emergency,Home or Self Care,2019,INJ019,"BURN AND CORROSION, INITIAL ENCOUNTER",SKB008,SKIN EXCISION AND DEBRIDEMENT,844,PARTIAL THICKNESS BURNS W/O SKIN GRAFT,22,BURNS,3,Major,Minor,Medical,Private Health Insurance,Self-Pay,,,,true,125349.27,28008.64
Hudson Valley,Westchester,5957001,001139,Westchester Medical Center,70 or Older,105,F,Black/African American,Not Span/Hispanic,1,Emergency,Home w/ Home Health Services,2019,INJ019,"BURN AND CORROSION, INITIAL ENCOUNTER",SKB008,SKIN EXCISION AND DEBRIDEMENT,844,PARTIAL THICKNESS BURNS W/O SKIN GRAFT,22,BURNS,2,Moderate,Moderate,Medical,Medicare,Medicare,,,,true,33089.89,5582.69
Central NY,Onondaga,3301007,000635,University Hospital SUNY Health Science Center,0 to 17,132,M,Black/African American,Spanish/Hispanic,2,Emergency,Home or Self Care,2019,INJ019,"BURN AND CORROSION, INITIAL ENCOUNTER",SKB008,SKIN EXCISION AND DEBRIDEMENT,844,PARTIAL THICKNESS BURNS W/O SKIN GRAFT,22,BURNS,1,Minor,Minor,Medical,Medicaid,,,,,true,16020.26,4797.06
Finger Lakes,Monroe,2701005,000413,Strong Memorial Hospital,30 to 49,146,F,Black/African American,Not Span/Hispanic,9,Emergency,Home w/ Home Health Services,2019,INJ019,"BURN AND CORROSION, INITIAL ENCOUNTER",SKB008,SKIN EXCISION AND DEBRIDEMENT,844,PARTIAL THICKNESS BURNS W/O SKIN GRAFT,22,BURNS,2,Moderate,Minor,Medical,Medicaid,,,,,true,39888.12,23971.01
New York City,Manhattan,7002054,001458,New York-Presbyterian Hospital - New York Weill Cornell Center,30 to 49,114,M,Multi-racial,Not Span/Hispanic,1,Emergency,Home or Self Care,2019,INJ019,"BURN AND CORROSION, INITIAL ENCOUNTER",PLC002,PACKING AND DRESSING PROCEDURES,844,PARTIAL THICKNESS BURNS W/O SKIN GRAFT,22,BURNS,2,Moderate,Minor,Medical,Private Health Insurance,Self-Pay,,,,true,26880.82,6139.65
New York City,Manhattan,7002054,001458,New York-Presbyterian Hospital - New York Weill Cornell Center,0 to 17,100,M,Other Race,Spanish/Hispanic,1,Emergency,Home or Self Care,2019,INJ019,"BURN AND CORROSION, INITIAL ENCOUNTER",ADM017,ADMINISTRATION OF NUTRITIONAL AND ELECTROLYTIC SUBSTANCES,844,PARTIAL THICKNESS BURNS W/O SKIN GRAFT,22,BURNS,1,Minor,Minor,Medical,Self-Pay,,,,,true,23380.36,5399.52
New York City,Manhattan,7002054,001458,New York-Presbyterian Hospital - New York Weill Cornell Center,30 to 49,113,M,Other Race,Not Span/Hispanic,1,Emergency,Home or Self Care,2019,INJ019,"BURN AND CORROSION, INITIAL ENCOUNTER",SKB008,SKIN EXCISION AND DEBRIDEMENT,844,PARTIAL THICKNESS BURNS W/O SKIN GRAFT,22,BURNS,1,Minor,Minor,Medical,Private Health Insurance,Self-Pay,,,,false,21191.49,4581.01
New York City,Manhattan,7002054,001458,New York-Presbyterian Hospital - New York Weill Cornell Center,0 to 17,112,M,Other Race,Not Span/Hispanic,1,Emergency,Home or Self Care,2019,INJ019,"BURN AND CORROSION, INITIAL ENCOUNTER",PLC002,PACKING AND DRESSING PROCEDURES,844,PARTIAL THICKNESS BURNS W/O SKIN GRAFT,22,BURNS,1,Minor,Minor,Medical,"Managed Care, Unspecified",Medicaid,Self-Pay,,,false,20369.17,4518.58
New York City,Manhattan,7002054,001458,New York-Presbyterian Hospital - New York Weill Cornell Center,50 to 69,112,F,Black/African American,Not Span/Hispanic,12,Emergency,Home or Self Care,2019,INJ019,"BURN AND CORROSION, INITIAL ENCOUNTER",,,844,PARTIAL THICKNESS BURNS W/O SKIN GRAFT,22,BURNS,2,Moderate,Minor,Medical,"Managed Care, Unspecified",Medicaid,Self-Pay,,,true,208725.2,47764.44
New York City,Manhattan,7002054,001458,New York-Presbyterian Hospital - New York Weill Cornell Center,30 to 49,112,M,White,Not Span/Hispanic,1,Emergency,Home or Self Care,2019,INJ019,"BURN AND CORROSION, INITIAL ENCOUNTER",PLC002,PACKING AND DRESSING PROCEDURES,844,PARTIAL THICKNESS BURNS W/O SKIN GRAFT,22,BURNS,1,Minor,Minor,Medical,Private Health Insurance,Self-Pay,,,,true,23928.75,5412.78
New York City,Manhattan,7002054,001458,New York-Presbyterian Hospital - New York Weill Cornell Center,0 to 17,112,M,White,Not Span/Hispanic,1,Emergency,Home or Self Care,2019,INJ019,"BURN AND CORROSION, INITIAL ENCOUNTER",PLC002,PACKING AND DRESSING PROCEDURES,844,PARTIAL THICKNESS BURNS W/O SKIN GRAFT,22,BURNS,1,Minor,Minor,Medical,"Managed Care, Unspecified",Medicaid,Self-Pay,,,false,20443.35,4513.77
New York City,Manhattan,7002054,001458,New York-Presbyterian Hospital - New York Weill Cornell Center,0 to 17,112,M,Black/African American,Not Span/Hispanic,1,Emergency,Home or Self Care,2019,INJ019,"BURN AND CORROSION, INITIAL ENCOUNTER",SKB008,SKIN EXCISION AND DEBRIDEMENT,844,PARTIAL THICKNESS BURNS W/O SKIN GRAFT,22,BURNS,1,Minor,Minor,Medical,Private Health Insurance,Self-Pay,,,,true,23230.51,5263.96
New York City,Manhattan,7002054,001458,New York-Presbyterian Hospital - New York Weill Cornell Center,30 to 49,100,F,Other Race,Not Span/Hispanic,1,Emergency,Home or Self Care,2019,INJ019,"BURN AND CORROSION, INITIAL ENCOUNTER",ADM017,ADMINISTRATION OF NUTRITIONAL AND ELECTROLYTIC SUBSTANCES,844,PARTIAL THICKNESS BURNS W/O SKIN GRAFT,22,BURNS,1,Minor,Minor,Medical,Medicaid,Self-Pay,,,,false,21237.27,4760.12
New York City,Manhattan,7002054,001458,New York-Presbyterian Hospital - New York Weill Cornell Center,50 to 69,115,F,Other Race,Not Span/Hispanic,4,Emergency,Home or Self Care,2019,INJ019,"BURN AND CORROSION, INITIAL ENCOUNTER",ADM021,"ADMINISTRATION OF THERAPEUTIC SUBSTANCES, NEC",844,PARTIAL THICKNESS BURNS W/O SKIN GRAFT,22,BURNS,1,Minor,Minor,Medical,Medicare,Medicare,Self-Pay,,,false,70184.98,15304.72
New York City,Kings,7001021,001306,New York - Presbyterian Brooklyn Methodist Hospital,70 or Older,112,F,Black/African American,Not Span/Hispanic,4,Emergency,Home or Self Care,2019,INJ019,"BURN AND CORROSION, INITIAL ENCOUNTER",,,844,PARTIAL THICKNESS BURNS W/O SKIN GRAFT,22,BURNS,1,Minor,Minor,Medical,Blue Cross/Blue Shield,Medicare,Self-Pay,,,true,31325.4,7501.22
Central NY,Onondaga,3301007,000635,University Hospital SUNY Health Science Center,70 or Older,136,F,White,Not Span/Hispanic,2,Emergency,Home w/ Home Health Services,2019,INJ019,"BURN AND CORROSION, INITIAL ENCOUNTER",SKB008,SKIN EXCISION AND DEBRIDEMENT,844,PARTIAL THICKNESS BURNS W/O SKIN GRAFT,22,BURNS,2,Moderate,Moderate,Medical,Medicare,,,,,true,13574.3,4377.88
New York City,Kings,7001046,001309,Interfaith Medical Center,70 or Older,112,M,Black/African American,Not Span/Hispanic,8,Emergency,Home or Self Care,2019,INJ019,"BURN AND CORROSION, INITIAL ENCOUNTER",,,844,PARTIAL THICKNESS BURNS W/O SKIN GRAFT,22,BURNS,3,Major,Major,Medical,Medicare,,,,,false,42266.83,19186.37
New York City,Richmond,7004003,001740,Staten Island University Hosp-North,0 to 17,112,F,Other Race,Unknown,2,Emergency,Home or Self Care,2019,INJ019,"BURN AND CORROSION, INITIAL ENCOUNTER",,,844,PARTIAL THICKNESS BURNS W/O SKIN GRAFT,22,BURNS,1,Minor,Minor,Medical,Medicaid,Medicaid,,,,true,14307,7182.82
Finger Lakes,Monroe,2701005,000413,Strong Memorial Hospital,70 or Older,144,M,White,Not Span/Hispanic,14,Emergency,Skilled Nursing Home,2019,INJ019,"BURN AND CORROSION, INITIAL ENCOUNTER",SKB008,SKIN EXCISION AND DEBRIDEMENT,844,PARTIAL THICKNESS BURNS W/O SKIN GRAFT,22,BURNS,3,Major,Major,Medical,Medicare,,,,,true,31808.77,17289.74
New York City,Richmond,7004003,001740,Staten Island University Hosp-North,0 to 17,112,M,White,Not Span/Hispanic,4,Emergency,Home or Self Care,2019,INJ019,"BURN AND CORROSION, INITIAL ENCOUNTER",,,844,PARTIAL THICKNESS BURNS W/O SKIN GRAFT,22,BURNS,1,Minor,Minor,Medical,Medicaid,Medicaid,,,,true,33354.65,9280.43
New York City,Richmond,7004003,001740,Staten Island University Hosp-North,0 to 17,112,F,White,Not Span/Hispanic,5,Emergency,Home or Self Care,2019,INJ019,"BURN AND CORROSION, INITIAL ENCOUNTER",,,844,PARTIAL THICKNESS BURNS W/O SKIN GRAFT,22,BURNS,2,Moderate,Minor,Medical,Medicaid,Medicaid,,,,true,28824.66,21999.4
Long Island,Suffolk,5151001,000245,Stony Brook University Hospital,70 or Older,117,M,Other Race,Spanish/Hispanic,3,Emergency,Home w/ Home Health Services,2019,INJ019,"BURN AND CORROSION, INITIAL ENCOUNTER",,,844,PARTIAL THICKNESS BURNS W/O SKIN GRAFT,22,BURNS,3,Major,Moderate,Medical,Medicare,Medicare,,,,true,31533.63,9902.85
Long Island,Suffolk,5151001,000889,Stony Brook Southampton Hospital,30 to 49,119,M,White,Not Span/Hispanic,3,Emergency,Home or Self Care,2019,INJ019,"BURN AND CORROSION, INITIAL ENCOUNTER",,,844,PARTIAL THICKNESS BURNS W/O SKIN GRAFT,22,BURNS,1,Minor,Minor,Medical,Private Health Insurance,,,,,true,23512.35,7056.59
Finger Lakes,Monroe,2701005,000413,Strong Memorial Hospital,70 or Older,145,M,White,Not Span/Hispanic,42,Emergency,Inpatient Rehabilitation Facility,2019,INJ019,"BURN AND CORROSION, INITIAL ENCOUNTER",SKB007,SKIN GRAFT,844,PARTIAL THICKNESS BURNS W/O SKIN GRAFT,22,BURNS,4,Extreme,Extreme,Medical,Medicare,,,,,true,287656.58,139050.83