Hospital Service Area,Hospital County,Operating Certificate Number,Permanent Facility Id,Facility Name,Age Group,Zip Code - 3 digits,Gender,Race,Ethnicity,Length of Stay,Type of Admission,Patient Disposition,Discharge Year,CCS Diagnosis Code,CCS Diagnosis Description,CCS Procedure Code,CCS Procedure Description,APR DRG Code,APR DRG Description,APR MDC Code,APR MDC Description,APR Severity of Illness Code,APR Severity of Illness Description,APR Risk of Mortality,APR Medical Surgical Description,Payment Typology 1,Payment Typology 2,Payment Typology 3,Birth Weight,Abortion Edit Indicator,Emergency Department Indicator,Total Charges,Total Costs
New York City,Manhattan,7002012,001447,Hospital for Special Surgery,50 to 69,100,F,White,Not Span/Hispanic,7,Elective,Home w/ Home Health Services,2019,MUS037,POSTPROCEDURAL OR POSTOPERATIVE MUSCULOSKELETAL SYSTEM COMPLICATION,MST013,SPINE FUSION,850,"PROCEDURE W DIAG OF REHAB, AFTERCARE OR OTH CONTACT W HEALTH SERVICE",23,FACTORS INFLUENCING HEALTH STATUS AND OTHER CONTACTS WITH HEALTH SERVICES,3,Major,Moderate,Surgical,Private Health Insurance,,,,,false,190836,79658.27
Southern Tier,Broome,0303001,000058,United Health Services Hospitals Inc. - Wilson Medical Center,50 to 69,138,F,White,Not Span/Hispanic,3,Elective,Home or Self Care,2019,MUS037,POSTPROCEDURAL OR POSTOPERATIVE MUSCULOSKELETAL SYSTEM COMPLICATION,MST013,SPINE FUSION,850,"PROCEDURE W DIAG OF REHAB, AFTERCARE OR OTH CONTACT W HEALTH SERVICE",23,FACTORS INFLUENCING HEALTH STATUS AND OTHER CONTACTS WITH HEALTH SERVICES,2,Moderate,Minor,Surgical,Private Health Insurance,Medicare,Medicare,,,false,38446,20180.9
Southern Tier,Broome,0303001,000058,United Health Services Hospitals Inc. - Wilson Medical Center,50 to 69,139,F,White,Not Span/Hispanic,1,Elective,Home or Self Care,2019,MUS037,POSTPROCEDURAL OR POSTOPERATIVE MUSCULOSKELETAL SYSTEM COMPLICATION,MST013,SPINE FUSION,850,"PROCEDURE W DIAG OF REHAB, AFTERCARE OR OTH CONTACT W HEALTH SERVICE",23,FACTORS INFLUENCING HEALTH STATUS AND OTHER CONTACTS WITH HEALTH SERVICES,2,Moderate,Minor,Surgical,Blue Cross/Blue Shield,Medicare,Medicare,,,false,27447.8,14072.72
New York City,Manhattan,7002053,001446,NYU Langone Orthopedic Hospital,70 or Older,113,F,Other Race,Not Span/Hispanic,5,Elective,Home w/ Home Health Services,2019,FAC010,OTHER AFTERCARE ENCOUNTER,MST006,KNEE ARTHROPLASTY,850,"PROCEDURE W DIAG OF REHAB, AFTERCARE OR OTH CONTACT W HEALTH SERVICE",23,FACTORS INFLUENCING HEALTH STATUS AND OTHER CONTACTS WITH HEALTH SERVICES,1,Minor,Minor,Surgical,Blue Cross/Blue Shield,Medicaid,,,,false,233155.26,44709.69
New York City,Manhattan,7002012,001447,Hospital for Special Surgery,50 to 69,104,F,Black/African American,Not Span/Hispanic,1,Elective,Home w/ Home Health Services,2019,INJ071,"COMPLICATION OF INTERNAL ORTHOPEDIC DEVICE OR IMPLANT, SUBSEQUENT ENCOUNTER",MST006,KNEE ARTHROPLASTY,850,"PROCEDURE W DIAG OF REHAB, AFTERCARE OR OTH CONTACT W HEALTH SERVICE",23,FACTORS INFLUENCING HEALTH STATUS AND OTHER CONTACTS WITH HEALTH SERVICES,1,Minor,Minor,Surgical,Medicaid,,,,,false,35237,13387.82
Long Island,Nassau,2908000,000511,NYU Langone Hospital-Long Island,50 to 69,110,F,Black/African American,Not Span/Hispanic,7,Emergency,Inpatient Rehabilitation Facility,2019,INJ042,"FRACTURE OF LOWER LIMB (EXCEPT HIP), SUBSEQUENT ENCOUNTER",MST011,FIXATION OF LEG AND FOOT BONES,850,"PROCEDURE W DIAG OF REHAB, AFTERCARE OR OTH CONTACT W HEALTH SERVICE",23,FACTORS INFLUENCING HEALTH STATUS AND OTHER CONTACTS WITH HEALTH SERVICES,3,Major,Moderate,Surgical,Medicare,Medicare,,,,true,176173.57,31082.46
Western NY,Erie,1401005,000210,Erie County Medical Center,18 to 29,141,F,White,Not Span/Hispanic,40,Elective,Home w/ Home Health Services,2019,INJ056,"BURNS AND CORROSION, SUBSEQUENT ENCOUNTER",RHB002,"PHYSICAL, OCCUPATIONAL, AND RESPIRATORY THERAPY TREATMENT",850,"PROCEDURE W DIAG OF REHAB, AFTERCARE OR OTH CONTACT W HEALTH SERVICE",23,FACTORS INFLUENCING HEALTH STATUS AND OTHER CONTACTS WITH HEALTH SERVICES,3,Major,Moderate,Surgical,Medicaid,,,,,false,124890.32,61086.88
Western NY,Erie,1401005,000210,Erie County Medical Center,50 to 69,142,F,White,Not Span/Hispanic,11,Emergency,Skilled Nursing Home,2019,INJ071,"COMPLICATION OF INTERNAL ORTHOPEDIC DEVICE OR IMPLANT, SUBSEQUENT ENCOUNTER",MST018,BONE EXCISION,850,"PROCEDURE W DIAG OF REHAB, AFTERCARE OR OTH CONTACT W HEALTH SERVICE",23,FACTORS INFLUENCING HEALTH STATUS AND OTHER CONTACTS WITH HEALTH SERVICES,1,Minor,Minor,Surgical,Miscellaneous/Other,Medicare,,,,true,39597.64,24026.8
Western NY,Erie,1401013,000292,Sisters of Charity Hospital - St. Joseph Campus,30 to 49,142,F,Black/African American,Not Span/Hispanic,2,Elective,Home or Self Care,2019,MUS037,POSTPROCEDURAL OR POSTOPERATIVE MUSCULOSKELETAL SYSTEM COMPLICATION,MST013,SPINE FUSION,850,"PROCEDURE W DIAG OF REHAB, AFTERCARE OR OTH CONTACT W HEALTH SERVICE",23,FACTORS INFLUENCING HEALTH STATUS AND OTHER CONTACTS WITH HEALTH SERVICES,3,Major,Minor,Surgical,Miscellaneous/Other,Medicaid,,,,false,31093.25,15934.84
Southern Tier,Broome,0303001,000058,United Health Services Hospitals Inc. - Wilson Medical Center,50 to 69,137,M,White,Not Span/Hispanic,7,Elective,Home w/ Home Health Services,2019,MUS037,POSTPROCEDURAL OR POSTOPERATIVE MUSCULOSKELETAL SYSTEM COMPLICATION,MST013,SPINE FUSION,850,"PROCEDURE W DIAG OF REHAB, AFTERCARE OR OTH CONTACT W HEALTH SERVICE",23,FACTORS INFLUENCING HEALTH STATUS AND OTHER CONTACTS WITH HEALTH SERVICES,3,Major,Minor,Surgical,Medicaid,Medicaid,,,,false,52711.4,27385.22
Long Island,Suffolk,5154001,000925,Good Samaritan Hospital Medical Center,50 to 69,117,F,Other Race,Spanish/Hispanic,2,Elective,Skilled Nursing Home,2019,FAC010,OTHER AFTERCARE ENCOUNTER,MST012,BONE FIXATION (EXCLUDING EXTREMITIES),850,"PROCEDURE W DIAG OF REHAB, AFTERCARE OR OTH CONTACT W HEALTH SERVICE",23,FACTORS INFLUENCING HEALTH STATUS AND OTHER CONTACTS WITH HEALTH SERVICES,2,Moderate,Moderate,Surgical,Medicare,,,,,false,71818.14,15026.23
Hudson Valley,Dutchess,1302001,000181,Vassar Brothers Medical Center,70 or Older,125,F,White,Not Span/Hispanic,4,Trauma,Home or Self Care,2019,NVS019,NERVOUS SYSTEM PAIN AND PAIN SYNDROMES,MST028,"SUBCUTANEOUS TISSUE AND FASCIA PROCEDURES, NEC",850,"PROCEDURE W DIAG OF REHAB, AFTERCARE OR OTH CONTACT W HEALTH SERVICE",23,FACTORS INFLUENCING HEALTH STATUS AND OTHER CONTACTS WITH HEALTH SERVICES,2,Moderate,Major,Surgical,Miscellaneous/Other,Medicare,"Managed Care, Unspecified",,,true,36610.7,7991.82
New York City,Manhattan,7002012,001447,Hospital for Special Surgery,50 to 69,148,F,White,Not Span/Hispanic,17,Elective,Home w/ Home Health Services,2019,MUS037,POSTPROCEDURAL OR POSTOPERATIVE MUSCULOSKELETAL SYSTEM COMPLICATION,MST013,SPINE FUSION,850,"PROCEDURE W DIAG OF REHAB, AFTERCARE OR OTH CONTACT W HEALTH SERVICE",23,FACTORS INFLUENCING HEALTH STATUS AND OTHER CONTACTS WITH HEALTH SERVICES,4,Extreme,Extreme,Surgical,Medicare,Private Health Insurance,,,,false,528398,200911.66
Capital/Adirond,Albany,0101004,000005,St. Peter's Hospital,30 to 49,120,M,White,Not Span/Hispanic,4,Elective,Home or Self Care,2019,MUS037,POSTPROCEDURAL OR POSTOPERATIVE MUSCULOSKELETAL SYSTEM COMPLICATION,MST013,SPINE FUSION,850,"PROCEDURE W DIAG OF REHAB, AFTERCARE OR OTH CONTACT W HEALTH SERVICE",23,FACTORS INFLUENCING HEALTH STATUS AND OTHER CONTACTS WITH HEALTH SERVICES,2,Moderate,Minor,Surgical,Private Health Insurance,,,,,false,72940.4,30304.42
Hudson Valley,Dutchess,5957001,000180,Mid-Hudson Valley Division of Westchester Medical Center,70 or Older,125,F,White,Not Span/Hispanic,3,Elective,Home or Self Care,2019,MUS037,POSTPROCEDURAL OR POSTOPERATIVE MUSCULOSKELETAL SYSTEM COMPLICATION,MST013,SPINE FUSION,850,"PROCEDURE W DIAG OF REHAB, AFTERCARE OR OTH CONTACT W HEALTH SERVICE",23,FACTORS INFLUENCING HEALTH STATUS AND OTHER CONTACTS WITH HEALTH SERVICES,2,Moderate,Minor,Surgical,Medicare,Private Health Insurance,,,,false,121650.2,24099.04
Hudson Valley,Westchester,5957001,001139,Westchester Medical Center,50 to 69,112,F,Black/African American,Not Span/Hispanic,5,Elective,Home w/ Home Health Services,2019,MUS037,POSTPROCEDURAL OR POSTOPERATIVE MUSCULOSKELETAL SYSTEM COMPLICATION,MST013,SPINE FUSION,850,"PROCEDURE W DIAG OF REHAB, AFTERCARE OR OTH CONTACT W HEALTH SERVICE",23,FACTORS INFLUENCING HEALTH STATUS AND OTHER CONTACTS WITH HEALTH SERVICES,1,Minor,Minor,Surgical,Miscellaneous/Other,,,,,false,135968.52,26469.43
Long Island,Suffolk,5151001,000245,Stony Brook University Hospital,50 to 69,117,M,Other Race,Not Span/Hispanic,17,Emergency,Home w/ Home Health Services,2019,INJ037,"COMPLICATION OF OTHER SURGICAL OR MEDICAL CARE, INJURY, INITIAL ENCOUNTER",CAR010,LIGATION AND EMBOLIZATION OF VESSELS,850,"PROCEDURE W DIAG OF REHAB, AFTERCARE OR OTH CONTACT W HEALTH SERVICE",23,FACTORS INFLUENCING HEALTH STATUS AND OTHER CONTACTS WITH HEALTH SERVICES,4,Extreme,Extreme,Surgical,Medicaid,Medicaid,,,,true,277431.28,87473.54
Finger Lakes,Monroe,2701005,000413,Strong Memorial Hospital,50 to 69,146,F,White,Not Span/Hispanic,1,Elective,Home or Self Care,2019,MUS037,POSTPROCEDURAL OR POSTOPERATIVE MUSCULOSKELETAL SYSTEM COMPLICATION,MST013,SPINE FUSION,850,"PROCEDURE W DIAG OF REHAB, AFTERCARE OR OTH CONTACT W HEALTH SERVICE",23,FACTORS INFLUENCING HEALTH STATUS AND OTHER CONTACTS WITH HEALTH SERVICES,3,Major,Minor,Surgical,Private Health Insurance,,,,,false,20208.02,10168.67
Capital/Adirond,Albany,0101004,000005,St. Peter's Hospital,50 to 69,121,M,White,Not Span/Hispanic,3,Elective,Inpatient Rehabilitation Facility,2019,FAC010,OTHER AFTERCARE ENCOUNTER,MST006,KNEE ARTHROPLASTY,850,"PROCEDURE W DIAG OF REHAB, AFTERCARE OR OTH CONTACT W HEALTH SERVICE",23,FACTORS INFLUENCING HEALTH STATUS AND OTHER CONTACTS WITH HEALTH SERVICES,1,Minor,Minor,Surgical,Medicaid,Medicaid,,,,false,98959.75,37997.88
Capital/Adirond,Albany,0101004,000005,St. Peter's Hospital,70 or Older,124,M,White,Not Span/Hispanic,1,Elective,Home w/ Home Health Services,2019,FAC010,OTHER AFTERCARE ENCOUNTER,MST007,HIP ARTHROPLASTY,850,"PROCEDURE W DIAG OF REHAB, AFTERCARE OR OTH CONTACT W HEALTH SERVICE",23,FACTORS INFLUENCING HEALTH STATUS AND OTHER CONTACTS WITH HEALTH SERVICES,1,Minor,Minor,Surgical,Medicare,Private Health Insurance,,,,false,47033,18092.82
New York City,Bronx,7000002,001165,Jacobi Medical Center,50 to 69,104,M,Black/African American,Spanish/Hispanic,5,Elective,Home or Self Care,2019,FAC010,OTHER AFTERCARE ENCOUNTER,SKB007,SKIN GRAFT,850,"PROCEDURE W DIAG OF REHAB, AFTERCARE OR OTH CONTACT W HEALTH SERVICE",23,FACTORS INFLUENCING HEALTH STATUS AND OTHER CONTACTS WITH HEALTH SERVICES,2,Moderate,Minor,Surgical,Self-Pay,,,,,false,36807.17,21776.96
New York City,Manhattan,7002053,001446,NYU Langone Orthopedic Hospital,30 to 49,,M,Black/African American,Not Span/Hispanic,1,Elective,Home w/ Home Health Services,2019,MUS037,POSTPROCEDURAL OR POSTOPERATIVE MUSCULOSKELETAL SYSTEM COMPLICATION,MST013,SPINE FUSION,850,"PROCEDURE W DIAG OF REHAB, AFTERCARE OR OTH CONTACT W HEALTH SERVICE",23,FACTORS INFLUENCING HEALTH STATUS AND OTHER CONTACTS WITH HEALTH SERVICES,1,Minor,Minor,Surgical,Miscellaneous/Other,Private Health Insurance,,,,false,315055.01,49019.49
Capital/Adirond,Albany,0101004,000005,St. Peter's Hospital,70 or Older,128,F,White,Not Span/Hispanic,1,Elective,Home or Self Care,2019,FAC010,OTHER AFTERCARE ENCOUNTER,MST008,ARTHROPLASTY OF OTHER JOINT (EXCLUDING KNEE AND HIP),850,"PROCEDURE W DIAG OF REHAB, AFTERCARE OR OTH CONTACT W HEALTH SERVICE",23,FACTORS INFLUENCING HEALTH STATUS AND OTHER CONTACTS WITH HEALTH SERVICES,1,Minor,Minor,Surgical,Medicare,Medicare,,,,false,41964,15328.9
Hudson Valley,Ulster,5501000,000989,HealthAlliance Hospital Mary's Avenue Campus,50 to 69,124,F,Black/African American,Not Span/Hispanic,23,Elective,Short-term Hospital,2019,INJ043,"FRACTURE OF THE NECK OF THE FEMUR (HIP), SUBSEQUENT ENCOUNTER",CAR025,PLACEMENT OF TUNNELED OR IMPLANTABLE PORTION OF A VASCULAR ACCESS DEVICE,850,"PROCEDURE W DIAG OF REHAB, AFTERCARE OR OTH CONTACT W HEALTH SERVICE",23,FACTORS INFLUENCING HEALTH STATUS AND OTHER CONTACTS WITH HEALTH SERVICES,2,Moderate,Moderate,Surgical,Medicare,"Managed Care, Unspecified",,,,false,225289.22,185775.7
Capital/Adirond,Albany,0101004,000005,St. Peter's Hospital,70 or Older,121,M,White,Not Span/Hispanic,2,Elective,Home w/ Home Health Services,2019,FAC010,OTHER AFTERCARE ENCOUNTER,MST006,KNEE ARTHROPLASTY,850,"PROCEDURE W DIAG OF REHAB, AFTERCARE OR OTH CONTACT W HEALTH SERVICE",23,FACTORS INFLUENCING HEALTH STATUS AND OTHER CONTACTS WITH HEALTH SERVICES,2,Moderate,Moderate,Surgical,Medicare,Medicare,,,,false,69878.13,27533.35
New York City,Manhattan,7002053,001446,NYU Langone Orthopedic Hospital,50 to 69,101,F,White,Not Span/Hispanic,3,Elective,Home w/ Home Health Services,2019,MUS037,POSTPROCEDURAL OR POSTOPERATIVE MUSCULOSKELETAL SYSTEM COMPLICATION,MST013,SPINE FUSION,850,"PROCEDURE W DIAG OF REHAB, AFTERCARE OR OTH CONTACT W HEALTH SERVICE",23,FACTORS INFLUENCING HEALTH STATUS AND OTHER CONTACTS WITH HEALTH SERVICES,1,Minor,Minor,Surgical,Private Health Insurance,,,,,false,274542.06,47523.7
New York City,Manhattan,7002053,001446,NYU Langone Orthopedic Hospital,50 to 69,113,M,White,Not Span/Hispanic,3,Elective,Home w/ Home Health Services,2019,FAC010,OTHER AFTERCARE ENCOUNTER,MST007,HIP ARTHROPLASTY,850,"PROCEDURE W DIAG OF REHAB, AFTERCARE OR OTH CONTACT W HEALTH SERVICE",23,FACTORS INFLUENCING HEALTH STATUS AND OTHER CONTACTS WITH HEALTH SERVICES,2,Moderate,Minor,Surgical,Miscellaneous/Other,,,,,false,258228.92,44467.4
Western NY,Erie,1401005,000210,Erie County Medical Center,50 to 69,142,F,White,Not Span/Hispanic,1,Elective,Skilled Nursing Home,2019,MUS037,POSTPROCEDURAL OR POSTOPERATIVE MUSCULOSKELETAL SYSTEM COMPLICATION,MST014,JOINT FUSION (EXCLUDING SPINE),850,"PROCEDURE W DIAG OF REHAB, AFTERCARE OR OTH CONTACT W HEALTH SERVICE",23,FACTORS INFLUENCING HEALTH STATUS AND OTHER CONTACTS WITH HEALTH SERVICES,2,Moderate,Minor,Surgical,Medicaid,Medicaid,,,,false,12277.08,7877.88
Long Island,Nassau,2952006,000551,St. Joseph Hospital,50 to 69,117,F,White,Not Span/Hispanic,3,Elective,Skilled Nursing Home,2019,INJ071,"COMPLICATION OF INTERNAL ORTHOPEDIC DEVICE OR IMPLANT, SUBSEQUENT ENCOUNTER",MST014,JOINT FUSION (EXCLUDING SPINE),850,"PROCEDURE W DIAG OF REHAB, AFTERCARE OR OTH CONTACT W HEALTH SERVICE",23,FACTORS INFLUENCING HEALTH STATUS AND OTHER CONTACTS WITH HEALTH SERVICES,2,Moderate,Moderate,Surgical,Medicare,Private Health Insurance,,,,false,105674.07,28050.11
Hudson Valley,Ulster,5501000,000989,HealthAlliance Hospital Mary's Avenue Campus,70 or Older,124,M,White,Not Span/Hispanic,2,Elective,Home or Self Care,2019,NVS019,NERVOUS SYSTEM PAIN AND PAIN SYNDROMES,MST014,JOINT FUSION (EXCLUDING SPINE),850,"PROCEDURE W DIAG OF REHAB, AFTERCARE OR OTH CONTACT W HEALTH SERVICE",23,FACTORS INFLUENCING HEALTH STATUS AND OTHER CONTACTS WITH HEALTH SERVICES,1,Minor,Minor,Surgical,Medicare,Private Health Insurance,,,,false,80242.87,48723.48
New York City,Bronx,7000001,001178,BronxCare Hospital Center,50 to 69,104,F,Black/African American,Not Span/Hispanic,3,Elective,Home or Self Care,2019,INJ071,"COMPLICATION OF INTERNAL ORTHOPEDIC DEVICE OR IMPLANT, SUBSEQUENT ENCOUNTER",MST006,KNEE ARTHROPLASTY,850,"PROCEDURE W DIAG OF REHAB, AFTERCARE OR OTH CONTACT W HEALTH SERVICE",23,FACTORS INFLUENCING HEALTH STATUS AND OTHER CONTACTS WITH HEALTH SERVICES,3,Major,Moderate,Surgical,Medicaid,Medicaid,,,,false,18345.71,25148.32
Capital/Adirond,Albany,0101000,000001,Albany Medical Center Hospital,30 to 49,120,F,White,Not Span/Hispanic,2,Emergency,Home or Self Care,2019,NVS019,NERVOUS SYSTEM PAIN AND PAIN SYNDROMES,RES011,DIAPHRAGMATIC HERNIA REPAIR,850,"PROCEDURE W DIAG OF REHAB, AFTERCARE OR OTH CONTACT W HEALTH SERVICE",23,FACTORS INFLUENCING HEALTH STATUS AND OTHER CONTACTS WITH HEALTH SERVICES,2,Moderate,Minor,Surgical,Blue Cross/Blue Shield,,,,,true,36552.54,13262.15
New York City,Manhattan,7002024,001456,Mount Sinai Hospital,50 to 69,OOS,M,Other Race,Not Span/Hispanic,4,Emergency,Home or Self Care,2019,INJ037,"COMPLICATION OF OTHER SURGICAL OR MEDICAL CARE, INJURY, INITIAL ENCOUNTER",GNR008,"ABDOMINAL WALL PROCEDURES, NEC",850,"PROCEDURE W DIAG OF REHAB, AFTERCARE OR OTH CONTACT W HEALTH SERVICE",23,FACTORS INFLUENCING HEALTH STATUS AND OTHER CONTACTS WITH HEALTH SERVICES,1,Minor,Minor,Surgical,Blue Cross/Blue Shield,Self-Pay,,,,true,73502.97,22939.68
New York City,Manhattan,7002053,001446,NYU Langone Orthopedic Hospital,50 to 69,103,M,Other Race,Spanish/Hispanic,2,Elective,Home w/ Home Health Services,2019,FAC010,OTHER AFTERCARE ENCOUNTER,MST007,HIP ARTHROPLASTY,850,"PROCEDURE W DIAG OF REHAB, AFTERCARE OR OTH CONTACT W HEALTH SERVICE",23,FACTORS INFLUENCING HEALTH STATUS AND OTHER CONTACTS WITH HEALTH SERVICES,2,Moderate,Minor,Surgical,Medicare,Private Health Insurance,,,,false,218268.08,36326.04
New York City,Manhattan,7002053,001446,NYU Langone Orthopedic Hospital,50 to 69,112,F,White,Not Span/Hispanic,3,Elective,Home w/ Home Health Services,2019,FAC010,OTHER AFTERCARE ENCOUNTER,MST006,KNEE ARTHROPLASTY,850,"PROCEDURE W DIAG OF REHAB, AFTERCARE OR OTH CONTACT W HEALTH SERVICE",23,FACTORS INFLUENCING HEALTH STATUS AND OTHER CONTACTS WITH HEALTH SERVICES,2,Moderate,Minor,Surgical,Medicare,Blue Cross/Blue Shield,,,,false,254042.79,44361.93
New York City,Manhattan,7002017,001450,Lenox Hill Hospital,50 to 69,OOS,F,White,Not Span/Hispanic,4,Emergency,Home or Self Care,2019,INJ037,"COMPLICATION OF OTHER SURGICAL OR MEDICAL CARE, INJURY, INITIAL ENCOUNTER",RES014,"RESPIRATORY SYSTEM PROCEDURES, NEC",850,"PROCEDURE W DIAG OF REHAB, AFTERCARE OR OTH CONTACT W HEALTH SERVICE",23,FACTORS INFLUENCING HEALTH STATUS AND OTHER CONTACTS WITH HEALTH SERVICES,1,Minor,Moderate,Surgical,Medicare,Private Health Insurance,,,,true,111758.74,26745.25
Long Island,Nassau,2908000,000511,NYU Langone Hospital-Long Island,70 or Older,117,M,White,Not Span/Hispanic,7,Urgent,Inpatient Rehabilitation Facility,2019,MUS037,POSTPROCEDURAL OR POSTOPERATIVE MUSCULOSKELETAL SYSTEM COMPLICATION,MST013,SPINE FUSION,850,"PROCEDURE W DIAG OF REHAB, AFTERCARE OR OTH CONTACT W HEALTH SERVICE",23,FACTORS INFLUENCING HEALTH STATUS AND OTHER CONTACTS WITH HEALTH SERVICES,2,Moderate,Minor,Surgical,Medicare,Medicare,Blue Cross/Blue Shield,,,false,387215.99,65620.89
New York City,Manhattan,7002054,001437,New York-Presbyterian/Lower Manhattan Hospital,50 to 69,OOS,F,White,Not Span/Hispanic,2,Emergency,Home w/ Home Health Services,2019,FAC010,OTHER AFTERCARE ENCOUNTER,MST028,"SUBCUTANEOUS TISSUE AND FASCIA PROCEDURES, NEC",850,"PROCEDURE W DIAG OF REHAB, AFTERCARE OR OTH CONTACT W HEALTH SERVICE",23,FACTORS INFLUENCING HEALTH STATUS AND OTHER CONTACTS WITH HEALTH SERVICES,1,Minor,Minor,Surgical,Miscellaneous/Other,Medicare,Self-Pay,,,false,38023.27,10619.86
New York City,Manhattan,7002012,001447,Hospital for Special Surgery,50 to 69,100,M,White,Not Span/Hispanic,3,Elective,Home or Self Care,2019,MUS037,POSTPROCEDURAL OR POSTOPERATIVE MUSCULOSKELETAL SYSTEM COMPLICATION,MST013,SPINE FUSION,850,"PROCEDURE W DIAG OF REHAB, AFTERCARE OR OTH CONTACT W HEALTH SERVICE",23,FACTORS INFLUENCING HEALTH STATUS AND OTHER CONTACTS WITH HEALTH SERVICES,3,Major,Minor,Surgical,Medicare,Private Health Insurance,,,,false,154163,56741.08
Capital/Adirond,Albany,0101004,000005,St. Peter's Hospital,70 or Older,121,F,White,Not Span/Hispanic,6,Elective,Skilled Nursing Home,2019,FAC010,OTHER AFTERCARE ENCOUNTER,MST006,KNEE ARTHROPLASTY,850,"PROCEDURE W DIAG OF REHAB, AFTERCARE OR OTH CONTACT W HEALTH SERVICE",23,FACTORS INFLUENCING HEALTH STATUS AND OTHER CONTACTS WITH HEALTH SERVICES,3,Major,Major,Surgical,Medicare,Medicare,,,,false,98658.4,39171.56
New York City,Manhattan,7002053,001446,NYU Langone Orthopedic Hospital,70 or Older,113,F,Other Race,Not Span/Hispanic,4,Elective,Skilled Nursing Home,2019,MUS037,POSTPROCEDURAL OR POSTOPERATIVE MUSCULOSKELETAL SYSTEM COMPLICATION,MST013,SPINE FUSION,850,"PROCEDURE W DIAG OF REHAB, AFTERCARE OR OTH CONTACT W HEALTH SERVICE",23,FACTORS INFLUENCING HEALTH STATUS AND OTHER CONTACTS WITH HEALTH SERVICES,3,Major,Major,Surgical,Medicare,Medicaid,,,,false,555876.38,94155.58
New York City,Manhattan,7002053,001446,NYU Langone Orthopedic Hospital,50 to 69,112,M,White,Not Span/Hispanic,2,Elective,Skilled Nursing Home,2019,FAC010,OTHER AFTERCARE ENCOUNTER,MST006,KNEE ARTHROPLASTY,850,"PROCEDURE W DIAG OF REHAB, AFTERCARE OR OTH CONTACT W HEALTH SERVICE",23,FACTORS INFLUENCING HEALTH STATUS AND OTHER CONTACTS WITH HEALTH SERVICES,1,Minor,Moderate,Surgical,Medicare,Private Health Insurance,,,,false,334447.28,53822.16
New York City,Queens,7003010,001637,New York - Presbyterian/Queens,70 or Older,113,M,Other Race,Not Span/Hispanic,7,Emergency,Home or Self Care,2019,INJ037,"COMPLICATION OF OTHER SURGICAL OR MEDICAL CARE, INJURY, INITIAL ENCOUNTER",CAR008,ANGIOPLASTY AND RELATED VESSEL PROCEDURES (ENDOVASCULAR; EXCLUDING CAROTID),850,"PROCEDURE W DIAG OF REHAB, AFTERCARE OR OTH CONTACT W HEALTH SERVICE",23,FACTORS INFLUENCING HEALTH STATUS AND OTHER CONTACTS WITH HEALTH SERVICES,2,Moderate,Moderate,Surgical,Medicare,Medicare,Self-Pay,,,true,64231.76,18619.28
New York City,Manhattan,7002012,001447,Hospital for Special Surgery,50 to 69,112,F,White,Not Span/Hispanic,2,Elective,Home w/ Home Health Services,2019,MUS037,POSTPROCEDURAL OR POSTOPERATIVE MUSCULOSKELETAL SYSTEM COMPLICATION,MST014,JOINT FUSION (EXCLUDING SPINE),850,"PROCEDURE W DIAG OF REHAB, AFTERCARE OR OTH CONTACT W HEALTH SERVICE",23,FACTORS INFLUENCING HEALTH STATUS AND OTHER CONTACTS WITH HEALTH SERVICES,3,Major,Minor,Surgical,Medicare,Medicaid,,,,false,108359,38977.84
New York City,Kings,7001021,001306,New York - Presbyterian Brooklyn Methodist Hospital,70 or Older,112,M,White,Not Span/Hispanic,1,Elective,Home or Self Care,2019,NVS019,NERVOUS SYSTEM PAIN AND PAIN SYNDROMES,MST028,"SUBCUTANEOUS TISSUE AND FASCIA PROCEDURES, NEC",850,"PROCEDURE W DIAG OF REHAB, AFTERCARE OR OTH CONTACT W HEALTH SERVICE",23,FACTORS INFLUENCING HEALTH STATUS AND OTHER CONTACTS WITH HEALTH SERVICES,2,Moderate,Minor,Surgical,Medicare,Medicaid,Self-Pay,,,false,29858.54,13074.21
New York City,Kings,7002002,001324,Mount Sinai Brooklyn,50 to 69,100,M,Other Race,Spanish/Hispanic,1,Urgent,Home or Self Care,2019,NVS019,NERVOUS SYSTEM PAIN AND PAIN SYNDROMES,MRS002,PENIS PROCEDURES (EXCLUDING CIRCUMCISION),850,"PROCEDURE W DIAG OF REHAB, AFTERCARE OR OTH CONTACT W HEALTH SERVICE",23,FACTORS INFLUENCING HEALTH STATUS AND OTHER CONTACTS WITH HEALTH SERVICES,1,Minor,Minor,Surgical,Medicaid,Self-Pay,,,,false,66466.35,21363.2
New York City,Manhattan,7002053,001463,NYU Langone Hospitals,50 to 69,100,M,White,Not Span/Hispanic,7,Elective,Home w/ Home Health Services,2019,MUS037,POSTPROCEDURAL OR POSTOPERATIVE MUSCULOSKELETAL SYSTEM COMPLICATION,MST013,SPINE FUSION,850,"PROCEDURE W DIAG OF REHAB, AFTERCARE OR OTH CONTACT W HEALTH SERVICE",23,FACTORS INFLUENCING HEALTH STATUS AND OTHER CONTACTS WITH HEALTH SERVICES,1,Minor,Minor,Surgical,Private Health Insurance,,,,,false,336178.27,67225.47
New York City,Manhattan,7002012,001447,Hospital for Special Surgery,30 to 49,125,F,White,Not Span/Hispanic,4,Urgent,Home w/ Home Health Services,2019,MUS037,POSTPROCEDURAL OR POSTOPERATIVE MUSCULOSKELETAL SYSTEM COMPLICATION,MST013,SPINE FUSION,850,"PROCEDURE W DIAG OF REHAB, AFTERCARE OR OTH CONTACT W HEALTH SERVICE",23,FACTORS INFLUENCING HEALTH STATUS AND OTHER CONTACTS WITH HEALTH SERVICES,3,Major,Moderate,Surgical,Medicare,Medicaid,,,,false,108560,44009.39