Hospital Service Area,Hospital County,Operating Certificate Number,Permanent Facility Id,Facility Name,Age Group,Zip Code - 3 digits,Gender,Race,Ethnicity,Length of Stay,Type of Admission,Patient Disposition,Discharge Year,CCS Diagnosis Code,CCS Diagnosis Description,CCS Procedure Code,CCS Procedure Description,APR DRG Code,APR DRG Description,APR MDC Code,APR MDC Description,APR Severity of Illness Code,APR Severity of Illness Description,APR Risk of Mortality,APR Medical Surgical Description,Payment Typology 1,Payment Typology 2,Payment Typology 3,Birth Weight,Abortion Edit Indicator,Emergency Department Indicator,Total Charges,Total Costs
New York City,Manhattan,7002001,001438,Bellevue Hospital Center,50 to 69,113,M,Black/African American,Not Span/Hispanic,1,Emergency,Home or Self Care,2019,INJ041,"FRACTURE OF THE UPPER LIMB, SUBSEQUENT ENCOUNTER",MST014,JOINT FUSION (EXCLUDING SPINE),850,"PROCEDURE W DIAG OF REHAB, AFTERCARE OR OTH CONTACT W HEALTH SERVICE",23,FACTORS INFLUENCING HEALTH STATUS AND OTHER CONTACTS WITH HEALTH SERVICES,2,Moderate,Moderate,Surgical,Department of Corrections,,,,,true,7282.16,4839.72
New York City,Manhattan,7002001,001438,Bellevue Hospital Center,50 to 69,109,M,Other Race,Not Span/Hispanic,1,Emergency,Home or Self Care,2019,INJ064,"OTHER UNSPECIFIED INJURIES, SUBSEQUENT ENCOUNTER",SKB007,SKIN GRAFT,850,"PROCEDURE W DIAG OF REHAB, AFTERCARE OR OTH CONTACT W HEALTH SERVICE",23,FACTORS INFLUENCING HEALTH STATUS AND OTHER CONTACTS WITH HEALTH SERVICES,1,Minor,Minor,Surgical,Blue Cross/Blue Shield,,,,,false,2676.97,1779.11
New York City,Manhattan,7002001,001438,Bellevue Hospital Center,30 to 49,112,M,Other Race,Not Span/Hispanic,1,Emergency,Home or Self Care,2019,INJ049,"OPEN WOUNDS TO LIMBS, SUBSEQUENT ENCOUNTER",PNS004,NERVE REPAIR,850,"PROCEDURE W DIAG OF REHAB, AFTERCARE OR OTH CONTACT W HEALTH SERVICE",23,FACTORS INFLUENCING HEALTH STATUS AND OTHER CONTACTS WITH HEALTH SERVICES,1,Minor,Minor,Surgical,Self-Pay,,,,,false,2520,1674.79
New York City,Manhattan,7002001,001438,Bellevue Hospital Center,30 to 49,113,M,White,Not Span/Hispanic,1,Emergency,Home or Self Care,2019,INJ071,"COMPLICATION OF INTERNAL ORTHOPEDIC DEVICE OR IMPLANT, SUBSEQUENT ENCOUNTER",MST014,JOINT FUSION (EXCLUDING SPINE),850,"PROCEDURE W DIAG OF REHAB, AFTERCARE OR OTH CONTACT W HEALTH SERVICE",23,FACTORS INFLUENCING HEALTH STATUS AND OTHER CONTACTS WITH HEALTH SERVICES,1,Minor,Minor,Surgical,Private Health Insurance,,,,,true,7601.83,5052.18
New York City,Manhattan,7002001,001438,Bellevue Hospital Center,30 to 49,112,M,Other Race,Spanish/Hispanic,8,Emergency,Home or Self Care,2019,INJ055,"CRUSHING INJURY, SUBSEQUENT ENCOUNTER",SKB007,SKIN GRAFT,850,"PROCEDURE W DIAG OF REHAB, AFTERCARE OR OTH CONTACT W HEALTH SERVICE",23,FACTORS INFLUENCING HEALTH STATUS AND OTHER CONTACTS WITH HEALTH SERVICES,1,Minor,Minor,Surgical,Medicaid,,,,,false,56382.45,37471.78
New York City,Manhattan,7002001,001438,Bellevue Hospital Center,18 to 29,100,M,Black/African American,Not Span/Hispanic,2,Elective,Home or Self Care,2019,INJ037,"COMPLICATION OF OTHER SURGICAL OR MEDICAL CARE, INJURY, INITIAL ENCOUNTER",MST012,BONE FIXATION (EXCLUDING EXTREMITIES),850,"PROCEDURE W DIAG OF REHAB, AFTERCARE OR OTH CONTACT W HEALTH SERVICE",23,FACTORS INFLUENCING HEALTH STATUS AND OTHER CONTACTS WITH HEALTH SERVICES,1,Minor,Minor,Surgical,Medicaid,,,,,false,34465.55,22905.8
New York City,Manhattan,7002001,001438,Bellevue Hospital Center,18 to 29,108,M,Other Race,Unknown,1,Elective,Home or Self Care,2019,INJ055,"CRUSHING INJURY, SUBSEQUENT ENCOUNTER",PNS004,NERVE REPAIR,850,"PROCEDURE W DIAG OF REHAB, AFTERCARE OR OTH CONTACT W HEALTH SERVICE",23,FACTORS INFLUENCING HEALTH STATUS AND OTHER CONTACTS WITH HEALTH SERVICES,1,Minor,Minor,Surgical,Federal/State/Local/VA,,,,,false,40329.74,26803.15
New York City,Manhattan,7002001,001438,Bellevue Hospital Center,70 or Older,104,F,Other Race,Spanish/Hispanic,4,Urgent,Home w/ Home Health Services,2019,INJ037,"COMPLICATION OF OTHER SURGICAL OR MEDICAL CARE, INJURY, INITIAL ENCOUNTER",MST030,"MUSCULOSKELETAL PROCEDURES, NEC",850,"PROCEDURE W DIAG OF REHAB, AFTERCARE OR OTH CONTACT W HEALTH SERVICE",23,FACTORS INFLUENCING HEALTH STATUS AND OTHER CONTACTS WITH HEALTH SERVICES,1,Minor,Moderate,Surgical,Medicare,,,,,false,38490.76,25580.96
New York City,Manhattan,7002001,001438,Bellevue Hospital Center,30 to 49,100,F,Other Race,Not Span/Hispanic,1,Emergency,Home or Self Care,2019,INJ037,"COMPLICATION OF OTHER SURGICAL OR MEDICAL CARE, INJURY, INITIAL ENCOUNTER",SKB004,BREAST RECONSTRUCTION,850,"PROCEDURE W DIAG OF REHAB, AFTERCARE OR OTH CONTACT W HEALTH SERVICE",23,FACTORS INFLUENCING HEALTH STATUS AND OTHER CONTACTS WITH HEALTH SERVICES,1,Minor,Minor,Surgical,Medicaid,,,,,true,22677.59,15071.53
New York City,Manhattan,7002001,001438,Bellevue Hospital Center,30 to 49,112,M,Black/African American,Not Span/Hispanic,1,Elective,Home or Self Care,2019,FAC010,OTHER AFTERCARE ENCOUNTER,MST006,KNEE ARTHROPLASTY,850,"PROCEDURE W DIAG OF REHAB, AFTERCARE OR OTH CONTACT W HEALTH SERVICE",23,FACTORS INFLUENCING HEALTH STATUS AND OTHER CONTACTS WITH HEALTH SERVICES,1,Minor,Minor,Surgical,Medicaid,,,,,false,78943.69,52465.98
New York City,Manhattan,7002001,001438,Bellevue Hospital Center,70 or Older,100,F,Other Race,Unknown,16,Elective,Home or Self Care,2019,INJ045,"TRAUMATIC BRAIN INJURY (TBI); CONCUSSION, SUBSEQUENT ENCOUNTER",MST009,FIXATION OF UPPER EXTREMITY BONES,850,"PROCEDURE W DIAG OF REHAB, AFTERCARE OR OTH CONTACT W HEALTH SERVICE",23,FACTORS INFLUENCING HEALTH STATUS AND OTHER CONTACTS WITH HEALTH SERVICES,1,Minor,Moderate,Surgical,Medicare,Miscellaneous/Other,,,,false,49619.49,32977.11
New York City,Manhattan,7002001,001438,Bellevue Hospital Center,50 to 69,104,F,Other Race,Unknown,7,Elective,Home w/ Home Health Services,2019,INJ063,"OTHER SPECIFIED INJURY, SUBSEQUENT ENCOUNTER",SKB007,SKIN GRAFT,850,"PROCEDURE W DIAG OF REHAB, AFTERCARE OR OTH CONTACT W HEALTH SERVICE",23,FACTORS INFLUENCING HEALTH STATUS AND OTHER CONTACTS WITH HEALTH SERVICES,1,Minor,Moderate,Surgical,Miscellaneous/Other,Miscellaneous/Other,,,,false,82936.34,55119.49
New York City,Manhattan,7002001,001438,Bellevue Hospital Center,50 to 69,112,F,Black/African American,Not Span/Hispanic,30,Urgent,Skilled Nursing Home,2019,FAC010,OTHER AFTERCARE ENCOUNTER,RHB002,"PHYSICAL, OCCUPATIONAL, AND RESPIRATORY THERAPY TREATMENT",850,"PROCEDURE W DIAG OF REHAB, AFTERCARE OR OTH CONTACT W HEALTH SERVICE",23,FACTORS INFLUENCING HEALTH STATUS AND OTHER CONTACTS WITH HEALTH SERVICES,3,Major,Major,Surgical,Medicaid,,,,,false,96274.87,63984.28
New York City,Manhattan,7002001,001438,Bellevue Hospital Center,50 to 69,113,M,Other Race,Spanish/Hispanic,8,Elective,Home or Self Care,2019,MUS037,POSTPROCEDURAL OR POSTOPERATIVE MUSCULOSKELETAL SYSTEM COMPLICATION,CNS008,SPINAL CORD DECOMPRESSION,850,"PROCEDURE W DIAG OF REHAB, AFTERCARE OR OTH CONTACT W HEALTH SERVICE",23,FACTORS INFLUENCING HEALTH STATUS AND OTHER CONTACTS WITH HEALTH SERVICES,3,Major,Minor,Surgical,Medicaid,,,,,false,112507.09,74772.21
New York City,Manhattan,7002001,001438,Bellevue Hospital Center,30 to 49,112,M,Other Race,Not Span/Hispanic,4,Elective,Home or Self Care,2019,INJ055,"CRUSHING INJURY, SUBSEQUENT ENCOUNTER",CAR012,VESSEL REPAIR AND REPLACEMENT,850,"PROCEDURE W DIAG OF REHAB, AFTERCARE OR OTH CONTACT W HEALTH SERVICE",23,FACTORS INFLUENCING HEALTH STATUS AND OTHER CONTACTS WITH HEALTH SERVICES,1,Minor,Minor,Surgical,Medicaid,,,,,false,66243.01,44025.1
