Hospital Service Area,Hospital County,Operating Certificate Number,Permanent Facility Id,Facility Name,Age Group,Zip Code - 3 digits,Gender,Race,Ethnicity,Length of Stay,Type of Admission,Patient Disposition,Discharge Year,CCS Diagnosis Code,CCS Diagnosis Description,CCS Procedure Code,CCS Procedure Description,APR DRG Code,APR DRG Description,APR MDC Code,APR MDC Description,APR Severity of Illness Code,APR Severity of Illness Description,APR Risk of Mortality,APR Medical Surgical Description,Payment Typology 1,Payment Typology 2,Payment Typology 3,Birth Weight,Abortion Edit Indicator,Emergency Department Indicator,Total Charges,Total Costs
New York City,Manhattan,7002053,001446,NYU Langone Orthopedic Hospital,70 or Older,113,F,Other Race,Not Span/Hispanic,5,Elective,Home w/ Home Health Services,2019,FAC010,OTHER AFTERCARE ENCOUNTER,MST006,KNEE ARTHROPLASTY,850,"PROCEDURE W DIAG OF REHAB, AFTERCARE OR OTH CONTACT W HEALTH SERVICE",23,FACTORS INFLUENCING HEALTH STATUS AND OTHER CONTACTS WITH HEALTH SERVICES,1,Minor,Minor,Surgical,Blue Cross/Blue Shield,Medicaid,,,,false,233155.26,44709.69
New York City,Manhattan,7002053,001446,NYU Langone Orthopedic Hospital,30 to 49,,M,Black/African American,Not Span/Hispanic,1,Elective,Home w/ Home Health Services,2019,MUS037,POSTPROCEDURAL OR POSTOPERATIVE MUSCULOSKELETAL SYSTEM COMPLICATION,MST013,SPINE FUSION,850,"PROCEDURE W DIAG OF REHAB, AFTERCARE OR OTH CONTACT W HEALTH SERVICE",23,FACTORS INFLUENCING HEALTH STATUS AND OTHER CONTACTS WITH HEALTH SERVICES,1,Minor,Minor,Surgical,Miscellaneous/Other,Private Health Insurance,,,,false,315055.01,49019.49
New York City,Manhattan,7002053,001446,NYU Langone Orthopedic Hospital,50 to 69,101,F,White,Not Span/Hispanic,3,Elective,Home w/ Home Health Services,2019,MUS037,POSTPROCEDURAL OR POSTOPERATIVE MUSCULOSKELETAL SYSTEM COMPLICATION,MST013,SPINE FUSION,850,"PROCEDURE W DIAG OF REHAB, AFTERCARE OR OTH CONTACT W HEALTH SERVICE",23,FACTORS INFLUENCING HEALTH STATUS AND OTHER CONTACTS WITH HEALTH SERVICES,1,Minor,Minor,Surgical,Private Health Insurance,,,,,false,274542.06,47523.7
New York City,Manhattan,7002053,001446,NYU Langone Orthopedic Hospital,50 to 69,113,M,White,Not Span/Hispanic,3,Elective,Home w/ Home Health Services,2019,FAC010,OTHER AFTERCARE ENCOUNTER,MST007,HIP ARTHROPLASTY,850,"PROCEDURE W DIAG OF REHAB, AFTERCARE OR OTH CONTACT W HEALTH SERVICE",23,FACTORS INFLUENCING HEALTH STATUS AND OTHER CONTACTS WITH HEALTH SERVICES,2,Moderate,Minor,Surgical,Miscellaneous/Other,,,,,false,258228.92,44467.4
New York City,Manhattan,7002053,001446,NYU Langone Orthopedic Hospital,50 to 69,103,M,Other Race,Spanish/Hispanic,2,Elective,Home w/ Home Health Services,2019,FAC010,OTHER AFTERCARE ENCOUNTER,MST007,HIP ARTHROPLASTY,850,"PROCEDURE W DIAG OF REHAB, AFTERCARE OR OTH CONTACT W HEALTH SERVICE",23,FACTORS INFLUENCING HEALTH STATUS AND OTHER CONTACTS WITH HEALTH SERVICES,2,Moderate,Minor,Surgical,Medicare,Private Health Insurance,,,,false,218268.08,36326.04
New York City,Manhattan,7002053,001446,NYU Langone Orthopedic Hospital,50 to 69,112,F,White,Not Span/Hispanic,3,Elective,Home w/ Home Health Services,2019,FAC010,OTHER AFTERCARE ENCOUNTER,MST006,KNEE ARTHROPLASTY,850,"PROCEDURE W DIAG OF REHAB, AFTERCARE OR OTH CONTACT W HEALTH SERVICE",23,FACTORS INFLUENCING HEALTH STATUS AND OTHER CONTACTS WITH HEALTH SERVICES,2,Moderate,Minor,Surgical,Medicare,Blue Cross/Blue Shield,,,,false,254042.79,44361.93
New York City,Manhattan,7002053,001446,NYU Langone Orthopedic Hospital,70 or Older,113,F,Other Race,Not Span/Hispanic,4,Elective,Skilled Nursing Home,2019,MUS037,POSTPROCEDURAL OR POSTOPERATIVE MUSCULOSKELETAL SYSTEM COMPLICATION,MST013,SPINE FUSION,850,"PROCEDURE W DIAG OF REHAB, AFTERCARE OR OTH CONTACT W HEALTH SERVICE",23,FACTORS INFLUENCING HEALTH STATUS AND OTHER CONTACTS WITH HEALTH SERVICES,3,Major,Major,Surgical,Medicare,Medicaid,,,,false,555876.38,94155.58
New York City,Manhattan,7002053,001446,NYU Langone Orthopedic Hospital,50 to 69,112,M,White,Not Span/Hispanic,2,Elective,Skilled Nursing Home,2019,FAC010,OTHER AFTERCARE ENCOUNTER,MST006,KNEE ARTHROPLASTY,850,"PROCEDURE W DIAG OF REHAB, AFTERCARE OR OTH CONTACT W HEALTH SERVICE",23,FACTORS INFLUENCING HEALTH STATUS AND OTHER CONTACTS WITH HEALTH SERVICES,1,Minor,Moderate,Surgical,Medicare,Private Health Insurance,,,,false,334447.28,53822.16
New York City,Manhattan,7002053,001446,NYU Langone Orthopedic Hospital,50 to 69,OOS,F,Other Race,Spanish/Hispanic,2,Elective,Home w/ Home Health Services,2019,MUS037,POSTPROCEDURAL OR POSTOPERATIVE MUSCULOSKELETAL SYSTEM COMPLICATION,MST013,SPINE FUSION,850,"PROCEDURE W DIAG OF REHAB, AFTERCARE OR OTH CONTACT W HEALTH SERVICE",23,FACTORS INFLUENCING HEALTH STATUS AND OTHER CONTACTS WITH HEALTH SERVICES,2,Moderate,Minor,Surgical,Miscellaneous/Other,Blue Cross/Blue Shield,,,,false,266051.78,43548.79
New York City,Manhattan,7002053,001446,NYU Langone Orthopedic Hospital,50 to 69,105,M,White,Not Span/Hispanic,2,Elective,Home or Self Care,2019,FAC010,OTHER AFTERCARE ENCOUNTER,MST006,KNEE ARTHROPLASTY,850,"PROCEDURE W DIAG OF REHAB, AFTERCARE OR OTH CONTACT W HEALTH SERVICE",23,FACTORS INFLUENCING HEALTH STATUS AND OTHER CONTACTS WITH HEALTH SERVICES,1,Minor,Minor,Surgical,Medicare,Private Health Insurance,,,,false,252648.19,41356.83
New York City,Manhattan,7002053,001446,NYU Langone Orthopedic Hospital,70 or Older,112,F,White,Not Span/Hispanic,4,Elective,Home w/ Home Health Services,2019,MUS037,POSTPROCEDURAL OR POSTOPERATIVE MUSCULOSKELETAL SYSTEM COMPLICATION,MST013,SPINE FUSION,850,"PROCEDURE W DIAG OF REHAB, AFTERCARE OR OTH CONTACT W HEALTH SERVICE",23,FACTORS INFLUENCING HEALTH STATUS AND OTHER CONTACTS WITH HEALTH SERVICES,2,Moderate,Minor,Surgical,Medicare,Medicare,,,,false,486641.48,80983.14
New York City,Manhattan,7002053,001446,NYU Langone Orthopedic Hospital,30 to 49,OOS,M,White,Unknown,2,Elective,Home w/ Home Health Services,2019,MUS037,POSTPROCEDURAL OR POSTOPERATIVE MUSCULOSKELETAL SYSTEM COMPLICATION,MST013,SPINE FUSION,850,"PROCEDURE W DIAG OF REHAB, AFTERCARE OR OTH CONTACT W HEALTH SERVICE",23,FACTORS INFLUENCING HEALTH STATUS AND OTHER CONTACTS WITH HEALTH SERVICES,1,Minor,Minor,Surgical,Miscellaneous/Other,,,,,false,383938.62,61138.05
New York City,Manhattan,7002053,001446,NYU Langone Orthopedic Hospital,50 to 69,125,M,White,Not Span/Hispanic,1,Elective,Home w/ Home Health Services,2019,FAC010,OTHER AFTERCARE ENCOUNTER,MST006,KNEE ARTHROPLASTY,850,"PROCEDURE W DIAG OF REHAB, AFTERCARE OR OTH CONTACT W HEALTH SERVICE",23,FACTORS INFLUENCING HEALTH STATUS AND OTHER CONTACTS WITH HEALTH SERVICES,2,Moderate,Minor,Surgical,Blue Cross/Blue Shield,,,,,false,218618.37,34595.2
New York City,Manhattan,7002053,001446,NYU Langone Orthopedic Hospital,50 to 69,,F,White,Unknown,11,Elective,Home w/ Home Health Services,2019,MUS037,POSTPROCEDURAL OR POSTOPERATIVE MUSCULOSKELETAL SYSTEM COMPLICATION,MST013,SPINE FUSION,850,"PROCEDURE W DIAG OF REHAB, AFTERCARE OR OTH CONTACT W HEALTH SERVICE",23,FACTORS INFLUENCING HEALTH STATUS AND OTHER CONTACTS WITH HEALTH SERVICES,2,Moderate,Minor,Surgical,Private Health Insurance,,,,,false,239768.02,61665.1
New York City,Manhattan,7002053,001446,NYU Langone Orthopedic Hospital,70 or Older,OOS,F,White,Not Span/Hispanic,3,Elective,Home w/ Home Health Services,2019,MUS037,POSTPROCEDURAL OR POSTOPERATIVE MUSCULOSKELETAL SYSTEM COMPLICATION,MST013,SPINE FUSION,850,"PROCEDURE W DIAG OF REHAB, AFTERCARE OR OTH CONTACT W HEALTH SERVICE",23,FACTORS INFLUENCING HEALTH STATUS AND OTHER CONTACTS WITH HEALTH SERVICES,3,Major,Major,Surgical,Medicare,Medicare,,,,false,368316.01,63976.53
New York City,Manhattan,7002053,001446,NYU Langone Orthopedic Hospital,70 or Older,100,F,Black/African American,Not Span/Hispanic,3,Elective,Home w/ Home Health Services,2019,MUS037,POSTPROCEDURAL OR POSTOPERATIVE MUSCULOSKELETAL SYSTEM COMPLICATION,MST013,SPINE FUSION,850,"PROCEDURE W DIAG OF REHAB, AFTERCARE OR OTH CONTACT W HEALTH SERVICE",23,FACTORS INFLUENCING HEALTH STATUS AND OTHER CONTACTS WITH HEALTH SERVICES,2,Moderate,Moderate,Surgical,Medicare,,,,,false,322647.48,54298.84
New York City,Manhattan,7002053,001446,NYU Langone Orthopedic Hospital,50 to 69,114,F,White,Not Span/Hispanic,6,Elective,Home w/ Home Health Services,2019,MUS037,POSTPROCEDURAL OR POSTOPERATIVE MUSCULOSKELETAL SYSTEM COMPLICATION,MST013,SPINE FUSION,850,"PROCEDURE W DIAG OF REHAB, AFTERCARE OR OTH CONTACT W HEALTH SERVICE",23,FACTORS INFLUENCING HEALTH STATUS AND OTHER CONTACTS WITH HEALTH SERVICES,3,Major,Minor,Surgical,Medicare,Medicaid,,,,false,333876.88,69240.92
New York City,Manhattan,7002053,001446,NYU Langone Orthopedic Hospital,50 to 69,100,F,Other Race,Not Span/Hispanic,3,Elective,Home w/ Home Health Services,2019,MUS037,POSTPROCEDURAL OR POSTOPERATIVE MUSCULOSKELETAL SYSTEM COMPLICATION,MST013,SPINE FUSION,850,"PROCEDURE W DIAG OF REHAB, AFTERCARE OR OTH CONTACT W HEALTH SERVICE",23,FACTORS INFLUENCING HEALTH STATUS AND OTHER CONTACTS WITH HEALTH SERVICES,1,Minor,Minor,Surgical,Medicaid,,,,,false,272974.13,47304.36
New York City,Manhattan,7002053,001446,NYU Langone Orthopedic Hospital,50 to 69,114,M,White,Not Span/Hispanic,6,Elective,Home w/ Home Health Services,2019,MUS037,POSTPROCEDURAL OR POSTOPERATIVE MUSCULOSKELETAL SYSTEM COMPLICATION,MST013,SPINE FUSION,850,"PROCEDURE W DIAG OF REHAB, AFTERCARE OR OTH CONTACT W HEALTH SERVICE",23,FACTORS INFLUENCING HEALTH STATUS AND OTHER CONTACTS WITH HEALTH SERVICES,2,Moderate,Minor,Surgical,Miscellaneous/Other,Medicare,,,,false,577959.03,108272.31
New York City,Manhattan,7002053,001446,NYU Langone Orthopedic Hospital,50 to 69,100,F,White,Not Span/Hispanic,1,Elective,Home or Self Care,2019,FAC010,OTHER AFTERCARE ENCOUNTER,MST007,HIP ARTHROPLASTY,850,"PROCEDURE W DIAG OF REHAB, AFTERCARE OR OTH CONTACT W HEALTH SERVICE",23,FACTORS INFLUENCING HEALTH STATUS AND OTHER CONTACTS WITH HEALTH SERVICES,1,Minor,Minor,Surgical,Private Health Insurance,,,,,false,220450.85,34328.27
New York City,Manhattan,7002053,001446,NYU Langone Orthopedic Hospital,50 to 69,112,F,Black/African American,Not Span/Hispanic,4,Elective,Home w/ Home Health Services,2019,FAC010,OTHER AFTERCARE ENCOUNTER,MST006,KNEE ARTHROPLASTY,850,"PROCEDURE W DIAG OF REHAB, AFTERCARE OR OTH CONTACT W HEALTH SERVICE",23,FACTORS INFLUENCING HEALTH STATUS AND OTHER CONTACTS WITH HEALTH SERVICES,2,Moderate,Minor,Surgical,Private Health Insurance,,,,,false,235558.86,44620.66
New York City,Manhattan,7002053,001446,NYU Langone Orthopedic Hospital,50 to 69,112,F,White,Not Span/Hispanic,10,Elective,Home w/ Home Health Services,2019,FAC010,OTHER AFTERCARE ENCOUNTER,MST008,ARTHROPLASTY OF OTHER JOINT (EXCLUDING KNEE AND HIP),850,"PROCEDURE W DIAG OF REHAB, AFTERCARE OR OTH CONTACT W HEALTH SERVICE",23,FACTORS INFLUENCING HEALTH STATUS AND OTHER CONTACTS WITH HEALTH SERVICES,2,Moderate,Minor,Surgical,Miscellaneous/Other,,,,,false,449765.84,88791.95
New York City,Manhattan,7002053,001446,NYU Langone Orthopedic Hospital,50 to 69,103,M,White,Not Span/Hispanic,2,Elective,Home w/ Home Health Services,2019,FAC010,OTHER AFTERCARE ENCOUNTER,MST007,HIP ARTHROPLASTY,850,"PROCEDURE W DIAG OF REHAB, AFTERCARE OR OTH CONTACT W HEALTH SERVICE",23,FACTORS INFLUENCING HEALTH STATUS AND OTHER CONTACTS WITH HEALTH SERVICES,1,Minor,Minor,Surgical,Medicare,Medicare,,,,false,261091.07,42089.12
New York City,Manhattan,7002053,001446,NYU Langone Orthopedic Hospital,18 to 29,,M,Other Race,Spanish/Hispanic,2,Elective,Home w/ Home Health Services,2019,NVS019,NERVOUS SYSTEM PAIN AND PAIN SYNDROMES,MST006,KNEE ARTHROPLASTY,850,"PROCEDURE W DIAG OF REHAB, AFTERCARE OR OTH CONTACT W HEALTH SERVICE",23,FACTORS INFLUENCING HEALTH STATUS AND OTHER CONTACTS WITH HEALTH SERVICES,1,Minor,Minor,Surgical,Blue Cross/Blue Shield,,,,,false,462453.18,73346.03
New York City,Manhattan,7002053,001446,NYU Langone Orthopedic Hospital,70 or Older,104,F,Other Race,Spanish/Hispanic,1,Elective,Home w/ Home Health Services,2019,FAC010,OTHER AFTERCARE ENCOUNTER,MST008,ARTHROPLASTY OF OTHER JOINT (EXCLUDING KNEE AND HIP),850,"PROCEDURE W DIAG OF REHAB, AFTERCARE OR OTH CONTACT W HEALTH SERVICE",23,FACTORS INFLUENCING HEALTH STATUS AND OTHER CONTACTS WITH HEALTH SERVICES,1,Minor,Minor,Surgical,Medicare,Medicaid,,,,false,179994.09,28711.76
New York City,Manhattan,7002053,001446,NYU Langone Orthopedic Hospital,50 to 69,113,M,White,Not Span/Hispanic,2,Elective,Home w/ Home Health Services,2019,FAC010,OTHER AFTERCARE ENCOUNTER,MST007,HIP ARTHROPLASTY,850,"PROCEDURE W DIAG OF REHAB, AFTERCARE OR OTH CONTACT W HEALTH SERVICE",23,FACTORS INFLUENCING HEALTH STATUS AND OTHER CONTACTS WITH HEALTH SERVICES,2,Moderate,Minor,Surgical,Private Health Insurance,Medicaid,,,,false,270898.73,44394.85
New York City,Manhattan,7002053,001446,NYU Langone Orthopedic Hospital,50 to 69,OOS,F,White,Not Span/Hispanic,1,Elective,Home w/ Home Health Services,2019,INJ042,"FRACTURE OF LOWER LIMB (EXCEPT HIP), SUBSEQUENT ENCOUNTER",MST014,JOINT FUSION (EXCLUDING SPINE),850,"PROCEDURE W DIAG OF REHAB, AFTERCARE OR OTH CONTACT W HEALTH SERVICE",23,FACTORS INFLUENCING HEALTH STATUS AND OTHER CONTACTS WITH HEALTH SERVICES,2,Moderate,Minor,Surgical,Blue Cross/Blue Shield,,,,,false,123654.35,20215.71
New York City,Manhattan,7002053,001446,NYU Langone Orthopedic Hospital,30 to 49,112,M,White,Not Span/Hispanic,4,Elective,Home w/ Home Health Services,2019,MUS037,POSTPROCEDURAL OR POSTOPERATIVE MUSCULOSKELETAL SYSTEM COMPLICATION,MST013,SPINE FUSION,850,"PROCEDURE W DIAG OF REHAB, AFTERCARE OR OTH CONTACT W HEALTH SERVICE",23,FACTORS INFLUENCING HEALTH STATUS AND OTHER CONTACTS WITH HEALTH SERVICES,2,Moderate,Minor,Surgical,Miscellaneous/Other,,,,,false,483526.06,80737.61
New York City,Manhattan,7002053,001446,NYU Langone Orthopedic Hospital,50 to 69,112,F,Other Race,Spanish/Hispanic,1,Elective,Home w/ Home Health Services,2019,MUS037,POSTPROCEDURAL OR POSTOPERATIVE MUSCULOSKELETAL SYSTEM COMPLICATION,MST013,SPINE FUSION,850,"PROCEDURE W DIAG OF REHAB, AFTERCARE OR OTH CONTACT W HEALTH SERVICE",23,FACTORS INFLUENCING HEALTH STATUS AND OTHER CONTACTS WITH HEALTH SERVICES,2,Moderate,Minor,Surgical,Miscellaneous/Other,Medicaid,,,,false,157518.69,25835.97
New York City,Manhattan,7002053,001446,NYU Langone Orthopedic Hospital,50 to 69,112,F,Other Race,Not Span/Hispanic,4,Elective,Home w/ Home Health Services,2019,FAC010,OTHER AFTERCARE ENCOUNTER,MST006,KNEE ARTHROPLASTY,850,"PROCEDURE W DIAG OF REHAB, AFTERCARE OR OTH CONTACT W HEALTH SERVICE",23,FACTORS INFLUENCING HEALTH STATUS AND OTHER CONTACTS WITH HEALTH SERVICES,1,Minor,Minor,Surgical,Private Health Insurance,,,,,false,447411.04,75294.28
New York City,Manhattan,7002053,001446,NYU Langone Orthopedic Hospital,50 to 69,100,F,White,Not Span/Hispanic,2,Elective,Home w/ Home Health Services,2019,MUS037,POSTPROCEDURAL OR POSTOPERATIVE MUSCULOSKELETAL SYSTEM COMPLICATION,MST013,SPINE FUSION,850,"PROCEDURE W DIAG OF REHAB, AFTERCARE OR OTH CONTACT W HEALTH SERVICE",23,FACTORS INFLUENCING HEALTH STATUS AND OTHER CONTACTS WITH HEALTH SERVICES,2,Moderate,Minor,Surgical,Private Health Insurance,,,,,false,300641.6,48674.84
New York City,Manhattan,7002053,001446,NYU Langone Orthopedic Hospital,50 to 69,116,M,Other Race,Not Span/Hispanic,3,Elective,Skilled Nursing Home,2019,FAC010,OTHER AFTERCARE ENCOUNTER,MST007,HIP ARTHROPLASTY,850,"PROCEDURE W DIAG OF REHAB, AFTERCARE OR OTH CONTACT W HEALTH SERVICE",23,FACTORS INFLUENCING HEALTH STATUS AND OTHER CONTACTS WITH HEALTH SERVICES,2,Moderate,Minor,Surgical,Private Health Insurance,,,,,false,283820.99,52895.76
New York City,Manhattan,7002053,001446,NYU Langone Orthopedic Hospital,70 or Older,OOS,M,White,Not Span/Hispanic,3,Elective,Home w/ Home Health Services,2019,FAC010,OTHER AFTERCARE ENCOUNTER,MST006,KNEE ARTHROPLASTY,850,"PROCEDURE W DIAG OF REHAB, AFTERCARE OR OTH CONTACT W HEALTH SERVICE",23,FACTORS INFLUENCING HEALTH STATUS AND OTHER CONTACTS WITH HEALTH SERVICES,2,Moderate,Minor,Surgical,Medicare,,,,,false,398844.79,65190.78
New York City,Manhattan,7002053,001446,NYU Langone Orthopedic Hospital,50 to 69,103,M,White,Not Span/Hispanic,3,Elective,Skilled Nursing Home,2019,FAC010,OTHER AFTERCARE ENCOUNTER,MST006,KNEE ARTHROPLASTY,850,"PROCEDURE W DIAG OF REHAB, AFTERCARE OR OTH CONTACT W HEALTH SERVICE",23,FACTORS INFLUENCING HEALTH STATUS AND OTHER CONTACTS WITH HEALTH SERVICES,2,Moderate,Minor,Surgical,Medicare,Blue Cross/Blue Shield,,,,false,460855.95,74250.73
New York City,Manhattan,7002053,001446,NYU Langone Orthopedic Hospital,50 to 69,121,M,White,Not Span/Hispanic,6,Elective,Home w/ Home Health Services,2019,MUS037,POSTPROCEDURAL OR POSTOPERATIVE MUSCULOSKELETAL SYSTEM COMPLICATION,MST013,SPINE FUSION,850,"PROCEDURE W DIAG OF REHAB, AFTERCARE OR OTH CONTACT W HEALTH SERVICE",23,FACTORS INFLUENCING HEALTH STATUS AND OTHER CONTACTS WITH HEALTH SERVICES,2,Moderate,Minor,Surgical,Miscellaneous/Other,,,,,false,340087.47,64548.51
New York City,Manhattan,7002053,001446,NYU Langone Orthopedic Hospital,50 to 69,113,M,Other Race,Spanish/Hispanic,4,Elective,Home or Self Care,2019,MUS037,POSTPROCEDURAL OR POSTOPERATIVE MUSCULOSKELETAL SYSTEM COMPLICATION,MST013,SPINE FUSION,850,"PROCEDURE W DIAG OF REHAB, AFTERCARE OR OTH CONTACT W HEALTH SERVICE",23,FACTORS INFLUENCING HEALTH STATUS AND OTHER CONTACTS WITH HEALTH SERVICES,2,Moderate,Minor,Surgical,Miscellaneous/Other,,,,,false,570410.45,96530.03
New York City,Manhattan,7002053,001446,NYU Langone Orthopedic Hospital,50 to 69,114,F,Other Race,Spanish/Hispanic,3,Elective,Home w/ Home Health Services,2019,MUS037,POSTPROCEDURAL OR POSTOPERATIVE MUSCULOSKELETAL SYSTEM COMPLICATION,MST013,SPINE FUSION,850,"PROCEDURE W DIAG OF REHAB, AFTERCARE OR OTH CONTACT W HEALTH SERVICE",23,FACTORS INFLUENCING HEALTH STATUS AND OTHER CONTACTS WITH HEALTH SERVICES,1,Minor,Minor,Surgical,Medicare,Medicaid,,,,false,501975.24,81143.05
New York City,Manhattan,7002053,001446,NYU Langone Orthopedic Hospital,50 to 69,OOS,F,Black/African American,Not Span/Hispanic,8,Elective,Home w/ Home Health Services,2019,MUS037,POSTPROCEDURAL OR POSTOPERATIVE MUSCULOSKELETAL SYSTEM COMPLICATION,MST013,SPINE FUSION,850,"PROCEDURE W DIAG OF REHAB, AFTERCARE OR OTH CONTACT W HEALTH SERVICE",23,FACTORS INFLUENCING HEALTH STATUS AND OTHER CONTACTS WITH HEALTH SERVICES,2,Moderate,Minor,Surgical,Miscellaneous/Other,Medicare,,,,false,409551.65,78107.74
New York City,Manhattan,7002053,001446,NYU Langone Orthopedic Hospital,70 or Older,107,F,White,Not Span/Hispanic,3,Elective,Skilled Nursing Home,2019,FAC010,OTHER AFTERCARE ENCOUNTER,MST007,HIP ARTHROPLASTY,850,"PROCEDURE W DIAG OF REHAB, AFTERCARE OR OTH CONTACT W HEALTH SERVICE",23,FACTORS INFLUENCING HEALTH STATUS AND OTHER CONTACTS WITH HEALTH SERVICES,2,Moderate,Minor,Surgical,Medicare,Private Health Insurance,Medicare,,,false,237096.81,42010.33
New York City,Manhattan,7002053,001446,NYU Langone Orthopedic Hospital,50 to 69,125,M,White,Not Span/Hispanic,2,Elective,Home or Self Care,2019,FAC010,OTHER AFTERCARE ENCOUNTER,MST007,HIP ARTHROPLASTY,850,"PROCEDURE W DIAG OF REHAB, AFTERCARE OR OTH CONTACT W HEALTH SERVICE",23,FACTORS INFLUENCING HEALTH STATUS AND OTHER CONTACTS WITH HEALTH SERVICES,1,Minor,Minor,Surgical,Medicaid,,,,,false,320875.08,51341.73
New York City,Manhattan,7002053,001446,NYU Langone Orthopedic Hospital,50 to 69,115,M,White,Not Span/Hispanic,1,Elective,Home or Self Care,2019,FAC010,OTHER AFTERCARE ENCOUNTER,MST030,"MUSCULOSKELETAL PROCEDURES, NEC",850,"PROCEDURE W DIAG OF REHAB, AFTERCARE OR OTH CONTACT W HEALTH SERVICE",23,FACTORS INFLUENCING HEALTH STATUS AND OTHER CONTACTS WITH HEALTH SERVICES,1,Minor,Minor,Surgical,Private Health Insurance,,,,,false,53161.52,10211.7
New York City,Manhattan,7002053,001446,NYU Langone Orthopedic Hospital,50 to 69,104,F,Black/African American,Not Span/Hispanic,7,Elective,Skilled Nursing Home,2019,FAC010,OTHER AFTERCARE ENCOUNTER,MST006,KNEE ARTHROPLASTY,850,"PROCEDURE W DIAG OF REHAB, AFTERCARE OR OTH CONTACT W HEALTH SERVICE",23,FACTORS INFLUENCING HEALTH STATUS AND OTHER CONTACTS WITH HEALTH SERVICES,1,Minor,Minor,Surgical,Medicare,Medicaid,,,,false,555979.01,98622.03
New York City,Manhattan,7002053,001446,NYU Langone Orthopedic Hospital,50 to 69,113,M,Other Race,Spanish/Hispanic,3,Elective,Home w/ Home Health Services,2019,FAC010,OTHER AFTERCARE ENCOUNTER,MST006,KNEE ARTHROPLASTY,850,"PROCEDURE W DIAG OF REHAB, AFTERCARE OR OTH CONTACT W HEALTH SERVICE",23,FACTORS INFLUENCING HEALTH STATUS AND OTHER CONTACTS WITH HEALTH SERVICES,3,Major,Major,Surgical,Medicare,,,,,false,236345.37,41153.9
New York City,Manhattan,7002053,001446,NYU Langone Orthopedic Hospital,50 to 69,109,M,White,Not Span/Hispanic,1,Elective,Home or Self Care,2019,FAC010,OTHER AFTERCARE ENCOUNTER,MST008,ARTHROPLASTY OF OTHER JOINT (EXCLUDING KNEE AND HIP),850,"PROCEDURE W DIAG OF REHAB, AFTERCARE OR OTH CONTACT W HEALTH SERVICE",23,FACTORS INFLUENCING HEALTH STATUS AND OTHER CONTACTS WITH HEALTH SERVICES,1,Minor,Minor,Surgical,Medicare,Private Health Insurance,,,,false,137702.78,22643.37
New York City,Manhattan,7002053,001446,NYU Langone Orthopedic Hospital,70 or Older,OOS,F,White,Not Span/Hispanic,1,Elective,Skilled Nursing Home,2019,MUS037,POSTPROCEDURAL OR POSTOPERATIVE MUSCULOSKELETAL SYSTEM COMPLICATION,MST014,JOINT FUSION (EXCLUDING SPINE),850,"PROCEDURE W DIAG OF REHAB, AFTERCARE OR OTH CONTACT W HEALTH SERVICE",23,FACTORS INFLUENCING HEALTH STATUS AND OTHER CONTACTS WITH HEALTH SERVICES,2,Moderate,Minor,Surgical,Medicare,Blue Cross/Blue Shield,,,,false,135956.99,22353.88
New York City,Manhattan,7002053,001446,NYU Langone Orthopedic Hospital,50 to 69,125,M,White,Not Span/Hispanic,1,Elective,Home w/ Home Health Services,2019,FAC010,OTHER AFTERCARE ENCOUNTER,MST007,HIP ARTHROPLASTY,850,"PROCEDURE W DIAG OF REHAB, AFTERCARE OR OTH CONTACT W HEALTH SERVICE",23,FACTORS INFLUENCING HEALTH STATUS AND OTHER CONTACTS WITH HEALTH SERVICES,1,Minor,Minor,Surgical,Private Health Insurance,,,,,false,275008.57,42800.86
New York City,Manhattan,7002053,001446,NYU Langone Orthopedic Hospital,50 to 69,107,M,White,Not Span/Hispanic,1,Elective,Home w/ Home Health Services,2019,FAC010,OTHER AFTERCARE ENCOUNTER,MST007,HIP ARTHROPLASTY,850,"PROCEDURE W DIAG OF REHAB, AFTERCARE OR OTH CONTACT W HEALTH SERVICE",23,FACTORS INFLUENCING HEALTH STATUS AND OTHER CONTACTS WITH HEALTH SERVICES,2,Moderate,Minor,Surgical,Medicare,Blue Cross/Blue Shield,,,,false,223706.38,35532.28
New York City,Manhattan,7002053,001446,NYU Langone Orthopedic Hospital,50 to 69,100,F,White,Not Span/Hispanic,1,Elective,Home or Self Care,2019,FAC010,OTHER AFTERCARE ENCOUNTER,MST008,ARTHROPLASTY OF OTHER JOINT (EXCLUDING KNEE AND HIP),850,"PROCEDURE W DIAG OF REHAB, AFTERCARE OR OTH CONTACT W HEALTH SERVICE",23,FACTORS INFLUENCING HEALTH STATUS AND OTHER CONTACTS WITH HEALTH SERVICES,2,Moderate,Minor,Surgical,Private Health Insurance,,,,,false,236149.46,37360.48
New York City,Manhattan,7002053,001446,NYU Langone Orthopedic Hospital,70 or Older,104,M,Black/African American,Not Span/Hispanic,2,Elective,Home w/ Home Health Services,2019,FAC010,OTHER AFTERCARE ENCOUNTER,MST007,HIP ARTHROPLASTY,850,"PROCEDURE W DIAG OF REHAB, AFTERCARE OR OTH CONTACT W HEALTH SERVICE",23,FACTORS INFLUENCING HEALTH STATUS AND OTHER CONTACTS WITH HEALTH SERVICES,2,Moderate,Minor,Surgical,Medicare,,,,,false,294700.88,48080.36
New York City,Manhattan,7002053,001446,NYU Langone Orthopedic Hospital,50 to 69,103,F,Other Race,Not Span/Hispanic,2,Elective,Home w/ Home Health Services,2019,FAC010,OTHER AFTERCARE ENCOUNTER,MST006,KNEE ARTHROPLASTY,850,"PROCEDURE W DIAG OF REHAB, AFTERCARE OR OTH CONTACT W HEALTH SERVICE",23,FACTORS INFLUENCING HEALTH STATUS AND OTHER CONTACTS WITH HEALTH SERVICES,1,Minor,Minor,Surgical,Medicaid,,,,,false,182434.68,31696.23