Hospital Service Area,Hospital County,Operating Certificate Number,Permanent Facility Id,Facility Name,Age Group,Zip Code - 3 digits,Gender,Race,Ethnicity,Length of Stay,Type of Admission,Patient Disposition,Discharge Year,CCS Diagnosis Code,CCS Diagnosis Description,CCS Procedure Code,CCS Procedure Description,APR DRG Code,APR DRG Description,APR MDC Code,APR MDC Description,APR Severity of Illness Code,APR Severity of Illness Description,APR Risk of Mortality,APR Medical Surgical Description,Payment Typology 1,Payment Typology 2,Payment Typology 3,Birth Weight,Abortion Edit Indicator,Emergency Department Indicator,Total Charges,Total Costs
Long Island,Nassau,2908000,000511,NYU Langone Hospital-Long Island,50 to 69,110,F,Black/African American,Not Span/Hispanic,7,Emergency,Inpatient Rehabilitation Facility,2019,INJ042,"FRACTURE OF LOWER LIMB (EXCEPT HIP), SUBSEQUENT ENCOUNTER",MST011,FIXATION OF LEG AND FOOT BONES,850,"PROCEDURE W DIAG OF REHAB, AFTERCARE OR OTH CONTACT W HEALTH SERVICE",23,FACTORS INFLUENCING HEALTH STATUS AND OTHER CONTACTS WITH HEALTH SERVICES,3,Major,Moderate,Surgical,Medicare,Medicare,,,,true,176173.57,31082.46
Long Island,Nassau,2908000,000511,NYU Langone Hospital-Long Island,70 or Older,117,M,White,Not Span/Hispanic,7,Urgent,Inpatient Rehabilitation Facility,2019,MUS037,POSTPROCEDURAL OR POSTOPERATIVE MUSCULOSKELETAL SYSTEM COMPLICATION,MST013,SPINE FUSION,850,"PROCEDURE W DIAG OF REHAB, AFTERCARE OR OTH CONTACT W HEALTH SERVICE",23,FACTORS INFLUENCING HEALTH STATUS AND OTHER CONTACTS WITH HEALTH SERVICES,2,Moderate,Minor,Surgical,Medicare,Medicare,Blue Cross/Blue Shield,,,false,387215.99,65620.89
Long Island,Nassau,2908000,000511,NYU Langone Hospital-Long Island,70 or Older,117,M,White,Not Span/Hispanic,3,Elective,Home w/ Home Health Services,2019,FAC010,OTHER AFTERCARE ENCOUNTER,MST006,KNEE ARTHROPLASTY,850,"PROCEDURE W DIAG OF REHAB, AFTERCARE OR OTH CONTACT W HEALTH SERVICE",23,FACTORS INFLUENCING HEALTH STATUS AND OTHER CONTACTS WITH HEALTH SERVICES,1,Minor,Moderate,Surgical,Medicare,Medicare,Blue Cross/Blue Shield,,,false,569051.12,92781.31
Long Island,Nassau,2908000,000511,NYU Langone Hospital-Long Island,50 to 69,114,F,White,Spanish/Hispanic,8,Elective,Skilled Nursing Home,2019,MUS037,POSTPROCEDURAL OR POSTOPERATIVE MUSCULOSKELETAL SYSTEM COMPLICATION,MST013,SPINE FUSION,850,"PROCEDURE W DIAG OF REHAB, AFTERCARE OR OTH CONTACT W HEALTH SERVICE",23,FACTORS INFLUENCING HEALTH STATUS AND OTHER CONTACTS WITH HEALTH SERVICES,2,Moderate,Minor,Surgical,Miscellaneous/Other,,,,,false,415769.88,70476.55
Long Island,Nassau,2908000,000511,NYU Langone Hospital-Long Island,50 to 69,115,F,White,Not Span/Hispanic,4,Elective,Home w/ Home Health Services,2019,MUS037,POSTPROCEDURAL OR POSTOPERATIVE MUSCULOSKELETAL SYSTEM COMPLICATION,MST013,SPINE FUSION,850,"PROCEDURE W DIAG OF REHAB, AFTERCARE OR OTH CONTACT W HEALTH SERVICE",23,FACTORS INFLUENCING HEALTH STATUS AND OTHER CONTACTS WITH HEALTH SERVICES,2,Moderate,Minor,Surgical,Private Health Insurance,,,,,false,376420.86,62879.65
Long Island,Nassau,2908000,000511,NYU Langone Hospital-Long Island,50 to 69,117,F,White,Not Span/Hispanic,5,Elective,Home w/ Home Health Services,2019,MUS037,POSTPROCEDURAL OR POSTOPERATIVE MUSCULOSKELETAL SYSTEM COMPLICATION,MST013,SPINE FUSION,850,"PROCEDURE W DIAG OF REHAB, AFTERCARE OR OTH CONTACT W HEALTH SERVICE",23,FACTORS INFLUENCING HEALTH STATUS AND OTHER CONTACTS WITH HEALTH SERVICES,2,Moderate,Moderate,Surgical,Private Health Insurance,,,,,false,556410.75,91346.23
Long Island,Nassau,2908000,000511,NYU Langone Hospital-Long Island,50 to 69,117,M,White,Not Span/Hispanic,6,Elective,Skilled Nursing Home,2019,MUS037,POSTPROCEDURAL OR POSTOPERATIVE MUSCULOSKELETAL SYSTEM COMPLICATION,MST013,SPINE FUSION,850,"PROCEDURE W DIAG OF REHAB, AFTERCARE OR OTH CONTACT W HEALTH SERVICE",23,FACTORS INFLUENCING HEALTH STATUS AND OTHER CONTACTS WITH HEALTH SERVICES,2,Moderate,Minor,Surgical,Miscellaneous/Other,,,,,false,773108.37,125769.92
Long Island,Nassau,2908000,000511,NYU Langone Hospital-Long Island,30 to 49,115,M,White,Not Span/Hispanic,25,Emergency,Skilled Nursing Home,2019,SYM007,MALAISE AND FATIGUE,MST020,SUBCUTANEOUS TISSUE AND FASCIA EXCISION,850,"PROCEDURE W DIAG OF REHAB, AFTERCARE OR OTH CONTACT W HEALTH SERVICE",23,FACTORS INFLUENCING HEALTH STATUS AND OTHER CONTACTS WITH HEALTH SERVICES,3,Major,Major,Surgical,Blue Cross/Blue Shield,,,,,true,494805.58,85441.51
Long Island,Nassau,2908000,000511,NYU Langone Hospital-Long Island,70 or Older,114,F,White,Not Span/Hispanic,3,Elective,Home w/ Home Health Services,2019,FAC010,OTHER AFTERCARE ENCOUNTER,MST006,KNEE ARTHROPLASTY,850,"PROCEDURE W DIAG OF REHAB, AFTERCARE OR OTH CONTACT W HEALTH SERVICE",23,FACTORS INFLUENCING HEALTH STATUS AND OTHER CONTACTS WITH HEALTH SERVICES,2,Moderate,Minor,Surgical,Medicare,Medicare,,,,false,602753.38,98591.77
Long Island,Nassau,2908000,000511,NYU Langone Hospital-Long Island,50 to 69,117,F,White,Not Span/Hispanic,3,Elective,Home w/ Home Health Services,2019,MUS037,POSTPROCEDURAL OR POSTOPERATIVE MUSCULOSKELETAL SYSTEM COMPLICATION,MST013,SPINE FUSION,850,"PROCEDURE W DIAG OF REHAB, AFTERCARE OR OTH CONTACT W HEALTH SERVICE",23,FACTORS INFLUENCING HEALTH STATUS AND OTHER CONTACTS WITH HEALTH SERVICES,2,Moderate,Minor,Surgical,Private Health Insurance,Private Health Insurance,,,,false,610244.71,100320.46
Long Island,Nassau,2908000,000511,NYU Langone Hospital-Long Island,30 to 49,114,F,White,Not Span/Hispanic,4,Elective,Home or Self Care,2019,INJ037,"COMPLICATION OF OTHER SURGICAL OR MEDICAL CARE, INJURY, INITIAL ENCOUNTER",SKB004,BREAST RECONSTRUCTION,850,"PROCEDURE W DIAG OF REHAB, AFTERCARE OR OTH CONTACT W HEALTH SERVICE",23,FACTORS INFLUENCING HEALTH STATUS AND OTHER CONTACTS WITH HEALTH SERVICES,1,Minor,Minor,Surgical,Blue Cross/Blue Shield,,,,,false,154301.22,25300.82
Long Island,Nassau,2908000,000511,NYU Langone Hospital-Long Island,50 to 69,113,M,Other Race,Not Span/Hispanic,4,Elective,Home or Self Care,2019,MUS037,POSTPROCEDURAL OR POSTOPERATIVE MUSCULOSKELETAL SYSTEM COMPLICATION,MST013,SPINE FUSION,850,"PROCEDURE W DIAG OF REHAB, AFTERCARE OR OTH CONTACT W HEALTH SERVICE",23,FACTORS INFLUENCING HEALTH STATUS AND OTHER CONTACTS WITH HEALTH SERVICES,3,Major,Moderate,Surgical,Private Health Insurance,,,,,false,298185.94,47453.8
Long Island,Nassau,2908000,000511,NYU Langone Hospital-Long Island,50 to 69,115,M,White,Not Span/Hispanic,9,Urgent,Home w/ Home Health Services,2019,MUS037,POSTPROCEDURAL OR POSTOPERATIVE MUSCULOSKELETAL SYSTEM COMPLICATION,MST013,SPINE FUSION,850,"PROCEDURE W DIAG OF REHAB, AFTERCARE OR OTH CONTACT W HEALTH SERVICE",23,FACTORS INFLUENCING HEALTH STATUS AND OTHER CONTACTS WITH HEALTH SERVICES,3,Major,Moderate,Surgical,Private Health Insurance,,,,,false,714373.3,119961.78
Long Island,Nassau,2908000,000511,NYU Langone Hospital-Long Island,50 to 69,117,F,White,Not Span/Hispanic,5,Emergency,Home w/ Home Health Services,2019,MUS037,POSTPROCEDURAL OR POSTOPERATIVE MUSCULOSKELETAL SYSTEM COMPLICATION,MST013,SPINE FUSION,850,"PROCEDURE W DIAG OF REHAB, AFTERCARE OR OTH CONTACT W HEALTH SERVICE",23,FACTORS INFLUENCING HEALTH STATUS AND OTHER CONTACTS WITH HEALTH SERVICES,2,Moderate,Minor,Surgical,Private Health Insurance,Medicare,Medicare,,,true,1040303.97,169943.39
Long Island,Nassau,2908000,000511,NYU Langone Hospital-Long Island,50 to 69,117,F,White,Not Span/Hispanic,2,Elective,Home or Self Care,2019,MUS037,POSTPROCEDURAL OR POSTOPERATIVE MUSCULOSKELETAL SYSTEM COMPLICATION,MST013,SPINE FUSION,850,"PROCEDURE W DIAG OF REHAB, AFTERCARE OR OTH CONTACT W HEALTH SERVICE",23,FACTORS INFLUENCING HEALTH STATUS AND OTHER CONTACTS WITH HEALTH SERVICES,2,Moderate,Minor,Surgical,Private Health Insurance,Medicaid,,,,false,319953.9,52139.71
Long Island,Nassau,2908000,000511,NYU Langone Hospital-Long Island,50 to 69,115,F,White,Not Span/Hispanic,5,Elective,Home w/ Home Health Services,2019,MUS037,POSTPROCEDURAL OR POSTOPERATIVE MUSCULOSKELETAL SYSTEM COMPLICATION,MST013,SPINE FUSION,850,"PROCEDURE W DIAG OF REHAB, AFTERCARE OR OTH CONTACT W HEALTH SERVICE",23,FACTORS INFLUENCING HEALTH STATUS AND OTHER CONTACTS WITH HEALTH SERVICES,2,Moderate,Minor,Surgical,Medicare,Medicare,Private Health Insurance,,,false,447896,74908.57
Long Island,Nassau,2908000,000511,NYU Langone Hospital-Long Island,70 or Older,110,M,White,Not Span/Hispanic,2,Elective,Home or Self Care,2019,MUS037,POSTPROCEDURAL OR POSTOPERATIVE MUSCULOSKELETAL SYSTEM COMPLICATION,MST013,SPINE FUSION,850,"PROCEDURE W DIAG OF REHAB, AFTERCARE OR OTH CONTACT W HEALTH SERVICE",23,FACTORS INFLUENCING HEALTH STATUS AND OTHER CONTACTS WITH HEALTH SERVICES,2,Moderate,Moderate,Surgical,Private Health Insurance,Medicare,,,,false,256087.47,41732.21
Long Island,Nassau,2908000,000511,NYU Langone Hospital-Long Island,70 or Older,117,M,White,Not Span/Hispanic,3,Elective,Skilled Nursing Home,2019,FAC010,OTHER AFTERCARE ENCOUNTER,MST006,KNEE ARTHROPLASTY,850,"PROCEDURE W DIAG OF REHAB, AFTERCARE OR OTH CONTACT W HEALTH SERVICE",23,FACTORS INFLUENCING HEALTH STATUS AND OTHER CONTACTS WITH HEALTH SERVICES,2,Moderate,Minor,Surgical,Medicare,Medicare,Private Health Insurance,,,false,349078.3,56728.56
Long Island,Nassau,2908000,000511,NYU Langone Hospital-Long Island,18 to 29,110,M,White,Spanish/Hispanic,1,Emergency,Home or Self Care,2019,INJ041,"FRACTURE OF THE UPPER LIMB, SUBSEQUENT ENCOUNTER",MST009,FIXATION OF UPPER EXTREMITY BONES,850,"PROCEDURE W DIAG OF REHAB, AFTERCARE OR OTH CONTACT W HEALTH SERVICE",23,FACTORS INFLUENCING HEALTH STATUS AND OTHER CONTACTS WITH HEALTH SERVICES,1,Minor,Minor,Surgical,Blue Cross/Blue Shield,Medicaid,Medicaid,,,true,123929.22,19295.45
Long Island,Nassau,2908000,000511,NYU Langone Hospital-Long Island,18 to 29,115,M,White,Not Span/Hispanic,2,Elective,Home w/ Home Health Services,2019,MUS037,POSTPROCEDURAL OR POSTOPERATIVE MUSCULOSKELETAL SYSTEM COMPLICATION,MST013,SPINE FUSION,850,"PROCEDURE W DIAG OF REHAB, AFTERCARE OR OTH CONTACT W HEALTH SERVICE",23,FACTORS INFLUENCING HEALTH STATUS AND OTHER CONTACTS WITH HEALTH SERVICES,2,Moderate,Minor,Surgical,Blue Cross/Blue Shield,,,,,false,712161.52,115754.05
Long Island,Nassau,2908000,000511,NYU Langone Hospital-Long Island,50 to 69,115,F,White,Not Span/Hispanic,4,Elective,Home w/ Home Health Services,2019,MUS037,POSTPROCEDURAL OR POSTOPERATIVE MUSCULOSKELETAL SYSTEM COMPLICATION,MST013,SPINE FUSION,850,"PROCEDURE W DIAG OF REHAB, AFTERCARE OR OTH CONTACT W HEALTH SERVICE",23,FACTORS INFLUENCING HEALTH STATUS AND OTHER CONTACTS WITH HEALTH SERVICES,2,Moderate,Minor,Surgical,Blue Cross/Blue Shield,,,,,false,958839.18,157292.09
Long Island,Nassau,2908000,000511,NYU Langone Hospital-Long Island,50 to 69,110,F,Other Race,Not Span/Hispanic,5,Emergency,Home w/ Home Health Services,2019,MUS037,POSTPROCEDURAL OR POSTOPERATIVE MUSCULOSKELETAL SYSTEM COMPLICATION,MST013,SPINE FUSION,850,"PROCEDURE W DIAG OF REHAB, AFTERCARE OR OTH CONTACT W HEALTH SERVICE",23,FACTORS INFLUENCING HEALTH STATUS AND OTHER CONTACTS WITH HEALTH SERVICES,2,Moderate,Minor,Surgical,Private Health Insurance,,,,,true,592257.2,95714.97
Long Island,Nassau,2908000,000511,NYU Langone Hospital-Long Island,50 to 69,115,M,White,Spanish/Hispanic,3,Elective,Home or Self Care,2019,MUS037,POSTPROCEDURAL OR POSTOPERATIVE MUSCULOSKELETAL SYSTEM COMPLICATION,MST013,SPINE FUSION,850,"PROCEDURE W DIAG OF REHAB, AFTERCARE OR OTH CONTACT W HEALTH SERVICE",23,FACTORS INFLUENCING HEALTH STATUS AND OTHER CONTACTS WITH HEALTH SERVICES,1,Minor,Minor,Surgical,Blue Cross/Blue Shield,,,,,false,301980.56,49469.98
Long Island,Nassau,2908000,000511,NYU Langone Hospital-Long Island,18 to 29,115,F,White,Not Span/Hispanic,2,Elective,Home w/ Home Health Services,2019,FAC004,ENCOUNTER FOR PROPHYLACTIC OR OTHER PROCEDURES,SKB003,MASTECTOMY AND LUMPECTOMY,850,"PROCEDURE W DIAG OF REHAB, AFTERCARE OR OTH CONTACT W HEALTH SERVICE",23,FACTORS INFLUENCING HEALTH STATUS AND OTHER CONTACTS WITH HEALTH SERVICES,1,Minor,Minor,Surgical,Medicaid,Medicaid,,,,false,161504.09,32652.85
Long Island,Nassau,2908000,000511,NYU Langone Hospital-Long Island,30 to 49,117,F,White,Spanish/Hispanic,2,Elective,Home w/ Home Health Services,2019,MUS037,POSTPROCEDURAL OR POSTOPERATIVE MUSCULOSKELETAL SYSTEM COMPLICATION,MST013,SPINE FUSION,850,"PROCEDURE W DIAG OF REHAB, AFTERCARE OR OTH CONTACT W HEALTH SERVICE",23,FACTORS INFLUENCING HEALTH STATUS AND OTHER CONTACTS WITH HEALTH SERVICES,2,Moderate,Minor,Surgical,Blue Cross/Blue Shield,,,,,false,376557.65,61148.94
Long Island,Nassau,2908000,000511,NYU Langone Hospital-Long Island,50 to 69,117,F,Other Race,Spanish/Hispanic,3,Elective,Skilled Nursing Home,2019,MUS037,POSTPROCEDURAL OR POSTOPERATIVE MUSCULOSKELETAL SYSTEM COMPLICATION,MST014,JOINT FUSION (EXCLUDING SPINE),850,"PROCEDURE W DIAG OF REHAB, AFTERCARE OR OTH CONTACT W HEALTH SERVICE",23,FACTORS INFLUENCING HEALTH STATUS AND OTHER CONTACTS WITH HEALTH SERVICES,2,Moderate,Minor,Surgical,Medicare,Medicare,Blue Cross/Blue Shield,,,false,173001.31,29162.33
Long Island,Nassau,2908000,000511,NYU Langone Hospital-Long Island,70 or Older,115,F,White,Not Span/Hispanic,3,Elective,Home w/ Home Health Services,2019,FAC010,OTHER AFTERCARE ENCOUNTER,MST006,KNEE ARTHROPLASTY,850,"PROCEDURE W DIAG OF REHAB, AFTERCARE OR OTH CONTACT W HEALTH SERVICE",23,FACTORS INFLUENCING HEALTH STATUS AND OTHER CONTACTS WITH HEALTH SERVICES,1,Minor,Minor,Surgical,Medicare,Medicare,,,,false,564272.51,92502.38
Long Island,Nassau,2908000,000511,NYU Langone Hospital-Long Island,70 or Older,115,F,White,Not Span/Hispanic,4,Elective,Skilled Nursing Home,2019,FAC010,OTHER AFTERCARE ENCOUNTER,MST007,HIP ARTHROPLASTY,850,"PROCEDURE W DIAG OF REHAB, AFTERCARE OR OTH CONTACT W HEALTH SERVICE",23,FACTORS INFLUENCING HEALTH STATUS AND OTHER CONTACTS WITH HEALTH SERVICES,3,Major,Moderate,Surgical,Medicare,Medicare,Private Health Insurance,,,false,396897.7,65006.23
Long Island,Nassau,2908000,000511,NYU Langone Hospital-Long Island,70 or Older,118,M,White,Not Span/Hispanic,1,Elective,Home w/ Home Health Services,2019,FAC010,OTHER AFTERCARE ENCOUNTER,MST006,KNEE ARTHROPLASTY,850,"PROCEDURE W DIAG OF REHAB, AFTERCARE OR OTH CONTACT W HEALTH SERVICE",23,FACTORS INFLUENCING HEALTH STATUS AND OTHER CONTACTS WITH HEALTH SERVICES,1,Minor,Moderate,Surgical,Medicare,Medicare,,,,false,215549.96,34870.77
Long Island,Nassau,2908000,000511,NYU Langone Hospital-Long Island,50 to 69,115,M,White,Not Span/Hispanic,7,Elective,Skilled Nursing Home,2019,MUS037,POSTPROCEDURAL OR POSTOPERATIVE MUSCULOSKELETAL SYSTEM COMPLICATION,MST013,SPINE FUSION,850,"PROCEDURE W DIAG OF REHAB, AFTERCARE OR OTH CONTACT W HEALTH SERVICE",23,FACTORS INFLUENCING HEALTH STATUS AND OTHER CONTACTS WITH HEALTH SERVICES,2,Moderate,Moderate,Surgical,Blue Cross/Blue Shield,,,,,false,761255.12,120556.18
Long Island,Nassau,2908000,000511,NYU Langone Hospital-Long Island,30 to 49,117,F,White,Not Span/Hispanic,3,Elective,Home or Self Care,2019,MUS037,POSTPROCEDURAL OR POSTOPERATIVE MUSCULOSKELETAL SYSTEM COMPLICATION,MST013,SPINE FUSION,850,"PROCEDURE W DIAG OF REHAB, AFTERCARE OR OTH CONTACT W HEALTH SERVICE",23,FACTORS INFLUENCING HEALTH STATUS AND OTHER CONTACTS WITH HEALTH SERVICES,1,Minor,Minor,Surgical,Blue Cross/Blue Shield,,,,,false,278579.31,45930.11
Long Island,Nassau,2908000,000511,NYU Langone Hospital-Long Island,0 to 17,110,M,White,Unknown,37,Elective,Home w/ Home Health Services,2019,PNL002,SHORT GESTATION; LOW BIRTH WEIGHT; AND FETAL GROWTH RETARDATION,GNR003,INGUINAL AND FEMORAL HERNIA REPAIR,850,"PROCEDURE W DIAG OF REHAB, AFTERCARE OR OTH CONTACT W HEALTH SERVICE",23,FACTORS INFLUENCING HEALTH STATUS AND OTHER CONTACTS WITH HEALTH SERVICES,3,Major,Minor,Surgical,Private Health Insurance,,,,,false,508170.88,79757.08
Long Island,Nassau,2908000,000511,NYU Langone Hospital-Long Island,70 or Older,OOS,F,White,Not Span/Hispanic,3,Elective,Skilled Nursing Home,2019,INJ071,"COMPLICATION OF INTERNAL ORTHOPEDIC DEVICE OR IMPLANT, SUBSEQUENT ENCOUNTER",MST006,KNEE ARTHROPLASTY,850,"PROCEDURE W DIAG OF REHAB, AFTERCARE OR OTH CONTACT W HEALTH SERVICE",23,FACTORS INFLUENCING HEALTH STATUS AND OTHER CONTACTS WITH HEALTH SERVICES,1,Minor,Minor,Surgical,Medicare,,,,,false,508522.13,83219.45
Long Island,Nassau,2908000,000511,NYU Langone Hospital-Long Island,50 to 69,115,F,Black/African American,Not Span/Hispanic,13,Elective,Home w/ Home Health Services,2019,MUS037,POSTPROCEDURAL OR POSTOPERATIVE MUSCULOSKELETAL SYSTEM COMPLICATION,MST013,SPINE FUSION,850,"PROCEDURE W DIAG OF REHAB, AFTERCARE OR OTH CONTACT W HEALTH SERVICE",23,FACTORS INFLUENCING HEALTH STATUS AND OTHER CONTACTS WITH HEALTH SERVICES,3,Major,Major,Surgical,Medicare,Medicare,,,,true,483432.28,83828.6
Long Island,Nassau,2908000,000511,NYU Langone Hospital-Long Island,50 to 69,115,F,White,Not Span/Hispanic,3,Elective,Home w/ Home Health Services,2019,MUS037,POSTPROCEDURAL OR POSTOPERATIVE MUSCULOSKELETAL SYSTEM COMPLICATION,MST013,SPINE FUSION,850,"PROCEDURE W DIAG OF REHAB, AFTERCARE OR OTH CONTACT W HEALTH SERVICE",23,FACTORS INFLUENCING HEALTH STATUS AND OTHER CONTACTS WITH HEALTH SERVICES,2,Moderate,Minor,Surgical,Medicare,Medicare,,,,false,316619.91,51863.58
Long Island,Nassau,2908000,000511,NYU Langone Hospital-Long Island,50 to 69,OOS,F,White,Not Span/Hispanic,7,Elective,Home or Self Care,2019,MUS037,POSTPROCEDURAL OR POSTOPERATIVE MUSCULOSKELETAL SYSTEM COMPLICATION,MST013,SPINE FUSION,850,"PROCEDURE W DIAG OF REHAB, AFTERCARE OR OTH CONTACT W HEALTH SERVICE",23,FACTORS INFLUENCING HEALTH STATUS AND OTHER CONTACTS WITH HEALTH SERVICES,4,Extreme,Extreme,Surgical,Blue Cross/Blue Shield,,,,,false,442858.9,69069.86
Long Island,Nassau,2908000,000511,NYU Langone Hospital-Long Island,30 to 49,116,M,White,Not Span/Hispanic,5,Elective,Home or Self Care,2019,MUS037,POSTPROCEDURAL OR POSTOPERATIVE MUSCULOSKELETAL SYSTEM COMPLICATION,MST013,SPINE FUSION,850,"PROCEDURE W DIAG OF REHAB, AFTERCARE OR OTH CONTACT W HEALTH SERVICE",23,FACTORS INFLUENCING HEALTH STATUS AND OTHER CONTACTS WITH HEALTH SERVICES,2,Moderate,Moderate,Surgical,Miscellaneous/Other,,,,,false,367004,58639.38
Long Island,Nassau,2908000,000511,NYU Langone Hospital-Long Island,30 to 49,117,F,White,Not Span/Hispanic,4,Elective,Home w/ Home Health Services,2019,MUS037,POSTPROCEDURAL OR POSTOPERATIVE MUSCULOSKELETAL SYSTEM COMPLICATION,MST016,VERTEBRAL DISCECTOMY,850,"PROCEDURE W DIAG OF REHAB, AFTERCARE OR OTH CONTACT W HEALTH SERVICE",23,FACTORS INFLUENCING HEALTH STATUS AND OTHER CONTACTS WITH HEALTH SERVICES,3,Major,Minor,Surgical,Blue Cross/Blue Shield,,,,,false,438315.74,71539.42
Long Island,Nassau,2908000,000511,NYU Langone Hospital-Long Island,70 or Older,117,F,White,Not Span/Hispanic,1,Emergency,Home w/ Home Health Services,2019,INJ037,"COMPLICATION OF OTHER SURGICAL OR MEDICAL CARE, INJURY, INITIAL ENCOUNTER",SKB004,BREAST RECONSTRUCTION,850,"PROCEDURE W DIAG OF REHAB, AFTERCARE OR OTH CONTACT W HEALTH SERVICE",23,FACTORS INFLUENCING HEALTH STATUS AND OTHER CONTACTS WITH HEALTH SERVICES,1,Minor,Minor,Surgical,Medicaid,,,,,true,53407.84,7782.69
Long Island,Nassau,2908000,000511,NYU Langone Hospital-Long Island,70 or Older,117,F,Other Race,Unknown,12,Elective,Skilled Nursing Home,2019,MUS015,"PATHOLOGICAL FRACTURE, SUBSEQUENT ENCOUNTER",MST029,"MUSCULOSKELETAL DEVICE PROCEDURES, NEC",850,"PROCEDURE W DIAG OF REHAB, AFTERCARE OR OTH CONTACT W HEALTH SERVICE",23,FACTORS INFLUENCING HEALTH STATUS AND OTHER CONTACTS WITH HEALTH SERVICES,3,Major,Extreme,Surgical,Medicaid,,,,,false,232120.37,41363.5
