Hospital Service Area,Hospital County,Operating Certificate Number,Permanent Facility Id,Facility Name,Age Group,Zip Code - 3 digits,Gender,Race,Ethnicity,Length of Stay,Type of Admission,Patient Disposition,Discharge Year,CCS Diagnosis Code,CCS Diagnosis Description,CCS Procedure Code,CCS Procedure Description,APR DRG Code,APR DRG Description,APR MDC Code,APR MDC Description,APR Severity of Illness Code,APR Severity of Illness Description,APR Risk of Mortality,APR Medical Surgical Description,Payment Typology 1,Payment Typology 2,Payment Typology 3,Birth Weight,Abortion Edit Indicator,Emergency Department Indicator,Total Charges,Total Costs
New York City,Manhattan,7002024,001456,Mount Sinai Hospital,30 to 49,114,F,Other Race,Not Span/Hispanic,14,Elective,Home w/ Home Health Services,2017,233,Intracranial injury,215,OT PHYS THER/REHAB,860,Rehabilitation,23,"Rehabilitation, Aftercare, Other Factors Influencing Health Status and Other Health Service Contacts",2,Moderate,Minor,Medical,Blue Cross/Blue Shield,Self-Pay,,,N,N,88509.80,25786.01
Capital/Adirond,Schenectady,4601004,000831,Sunnyview Hospital and Rehabilitation Center,50 to 69,133,M,White,Not Span/Hispanic,26,Elective,Home w/ Home Health Services,2017,259,Residual codes; unclassified,213,"PHYS THER EXER, MANIPUL",860,Rehabilitation,23,"Rehabilitation, Aftercare, Other Factors Influencing Health Status and Other Health Service Contacts",3,Major,Major,Medical,Medicare,Self-Pay,Self-Pay,,N,N,73455.75,35355.62
Capital/Adirond,Schenectady,4601004,000831,Sunnyview Hospital and Rehabilitation Center,70 or Older,121,F,White,Not Span/Hispanic,24,Elective,Short-term Hospital,2017,259,Residual codes; unclassified,213,"PHYS THER EXER, MANIPUL",860,Rehabilitation,23,"Rehabilitation, Aftercare, Other Factors Influencing Health Status and Other Health Service Contacts",3,Major,Major,Medical,Medicare,Self-Pay,Self-Pay,,N,N,52994.85,25112.22
Capital/Adirond,Schenectady,4601004,000831,Sunnyview Hospital and Rehabilitation Center,70 or Older,121,F,White,Not Span/Hispanic,21,Elective,Home w/ Home Health Services,2017,259,Residual codes; unclassified,213,"PHYS THER EXER, MANIPUL",860,Rehabilitation,23,"Rehabilitation, Aftercare, Other Factors Influencing Health Status and Other Health Service Contacts",2,Moderate,Moderate,Medical,Medicare,Private Health Insurance,Self-Pay,,N,N,44401.10,21819.52
Capital/Adirond,Schenectady,4601004,000831,Sunnyview Hospital and Rehabilitation Center,70 or Older,123,F,White,Not Span/Hispanic,6,Elective,Home or Self Care,2017,259,Residual codes; unclassified,213,"PHYS THER EXER, MANIPUL",860,Rehabilitation,23,"Rehabilitation, Aftercare, Other Factors Influencing Health Status and Other Health Service Contacts",1,Minor,Moderate,Medical,Medicare,Private Health Insurance,Self-Pay,,N,N,13292.65,5842.15
Capital/Adirond,Schenectady,4601004,000831,Sunnyview Hospital and Rehabilitation Center,70 or Older,120,M,White,Not Span/Hispanic,13,Elective,Home w/ Home Health Services,2017,259,Residual codes; unclassified,213,"PHYS THER EXER, MANIPUL",860,Rehabilitation,23,"Rehabilitation, Aftercare, Other Factors Influencing Health Status and Other Health Service Contacts",2,Moderate,Major,Medical,Medicare,Private Health Insurance,Self-Pay,,N,N,26019.50,12249.74
Capital/Adirond,Schenectady,4601004,000831,Sunnyview Hospital and Rehabilitation Center,70 or Older,121,F,Other Race,Not Span/Hispanic,14,Elective,Skilled Nursing Home,2017,259,Residual codes; unclassified,213,"PHYS THER EXER, MANIPUL",860,Rehabilitation,23,"Rehabilitation, Aftercare, Other Factors Influencing Health Status and Other Health Service Contacts",2,Moderate,Moderate,Medical,Medicare,Medicaid,Self-Pay,,N,N,31427.45,15355.38
Capital/Adirond,Schenectady,4601004,000831,Sunnyview Hospital and Rehabilitation Center,70 or Older,121,M,White,Not Span/Hispanic,11,Elective,Home or Self Care,2017,259,Residual codes; unclassified,213,"PHYS THER EXER, MANIPUL",860,Rehabilitation,23,"Rehabilitation, Aftercare, Other Factors Influencing Health Status and Other Health Service Contacts",3,Major,Major,Medical,Medicare,Blue Cross/Blue Shield,Self-Pay,,N,N,27020.77,12703.50
Capital/Adirond,Schenectady,4601004,000831,Sunnyview Hospital and Rehabilitation Center,70 or Older,128,F,White,Not Span/Hispanic,10,Elective,Home or Self Care,2017,259,Residual codes; unclassified,213,"PHYS THER EXER, MANIPUL",860,Rehabilitation,23,"Rehabilitation, Aftercare, Other Factors Influencing Health Status and Other Health Service Contacts",2,Moderate,Major,Medical,Medicare,Private Health Insurance,Self-Pay,,N,N,22090.30,10419.81
Capital/Adirond,Schenectady,4601004,000831,Sunnyview Hospital and Rehabilitation Center,70 or Older,123,F,White,Not Span/Hispanic,7,Elective,Home w/ Home Health Services,2017,259,Residual codes; unclassified,213,"PHYS THER EXER, MANIPUL",860,Rehabilitation,23,"Rehabilitation, Aftercare, Other Factors Influencing Health Status and Other Health Service Contacts",2,Moderate,Moderate,Medical,Medicare,Private Health Insurance,Self-Pay,,N,N,14897.25,6918.88
Capital/Adirond,Schenectady,4601004,000831,Sunnyview Hospital and Rehabilitation Center,70 or Older,121,F,White,Not Span/Hispanic,10,Elective,Home or Self Care,2017,259,Residual codes; unclassified,213,"PHYS THER EXER, MANIPUL",860,Rehabilitation,23,"Rehabilitation, Aftercare, Other Factors Influencing Health Status and Other Health Service Contacts",3,Major,Moderate,Medical,Medicare,Private Health Insurance,Self-Pay,,N,N,24095.55,11509.13
Capital/Adirond,Schenectady,4601004,000831,Sunnyview Hospital and Rehabilitation Center,70 or Older,123,F,White,Not Span/Hispanic,6,Elective,Home or Self Care,2017,259,Residual codes; unclassified,213,"PHYS THER EXER, MANIPUL",860,Rehabilitation,23,"Rehabilitation, Aftercare, Other Factors Influencing Health Status and Other Health Service Contacts",1,Minor,Minor,Medical,Medicare,Self-Pay,Self-Pay,,N,N,14282.40,6745.30
Capital/Adirond,Schenectady,4601004,000831,Sunnyview Hospital and Rehabilitation Center,70 or Older,123,F,White,Not Span/Hispanic,19,Elective,Skilled Nursing Home,2017,259,Residual codes; unclassified,213,"PHYS THER EXER, MANIPUL",860,Rehabilitation,23,"Rehabilitation, Aftercare, Other Factors Influencing Health Status and Other Health Service Contacts",2,Moderate,Moderate,Medical,Medicare,Blue Cross/Blue Shield,Self-Pay,,N,N,41553.25,20283.45
Capital/Adirond,Schenectady,4601004,000831,Sunnyview Hospital and Rehabilitation Center,70 or Older,120,M,White,Not Span/Hispanic,6,Elective,Skilled Nursing Home,2017,259,Residual codes; unclassified,213,"PHYS THER EXER, MANIPUL",860,Rehabilitation,23,"Rehabilitation, Aftercare, Other Factors Influencing Health Status and Other Health Service Contacts",1,Minor,Moderate,Medical,Medicare,Blue Cross/Blue Shield,Self-Pay,,N,N,12825.55,6047.21
Capital/Adirond,Schenectady,4601004,000831,Sunnyview Hospital and Rehabilitation Center,50 to 69,121,M,White,Not Span/Hispanic,5,Elective,Home w/ Home Health Services,2017,259,Residual codes; unclassified,213,"PHYS THER EXER, MANIPUL",860,Rehabilitation,23,"Rehabilitation, Aftercare, Other Factors Influencing Health Status and Other Health Service Contacts",2,Moderate,Minor,Medical,Medicare,Self-Pay,Self-Pay,,N,N,10646.20,5031.74
Capital/Adirond,Schenectady,4601004,000831,Sunnyview Hospital and Rehabilitation Center,70 or Older,123,F,White,Not Span/Hispanic,13,Elective,Short-term Hospital,2017,259,Residual codes; unclassified,213,"PHYS THER EXER, MANIPUL",860,Rehabilitation,23,"Rehabilitation, Aftercare, Other Factors Influencing Health Status and Other Health Service Contacts",3,Major,Major,Medical,Medicare,Private Health Insurance,Self-Pay,,N,N,29079.69,13966.71
Capital/Adirond,Schenectady,4601004,000831,Sunnyview Hospital and Rehabilitation Center,50 to 69,121,F,White,Not Span/Hispanic,7,Elective,Home or Self Care,2017,259,Residual codes; unclassified,213,"PHYS THER EXER, MANIPUL",860,Rehabilitation,23,"Rehabilitation, Aftercare, Other Factors Influencing Health Status and Other Health Service Contacts",2,Moderate,Minor,Medical,Miscellaneous/Other,Blue Cross/Blue Shield,Self-Pay,,N,N,16716.65,7742.95
Capital/Adirond,Schenectady,4601004,000831,Sunnyview Hospital and Rehabilitation Center,70 or Older,120,F,White,Not Span/Hispanic,5,Elective,Home or Self Care,2017,259,Residual codes; unclassified,213,"PHYS THER EXER, MANIPUL",860,Rehabilitation,23,"Rehabilitation, Aftercare, Other Factors Influencing Health Status and Other Health Service Contacts",3,Major,Moderate,Medical,Medicare,Blue Cross/Blue Shield,Private Health Insurance,,N,N,11433.85,5388.96
Capital/Adirond,Schenectady,4601004,000831,Sunnyview Hospital and Rehabilitation Center,70 or Older,120,F,White,Not Span/Hispanic,12,Elective,Home or Self Care,2017,259,Residual codes; unclassified,213,"PHYS THER EXER, MANIPUL",860,Rehabilitation,23,"Rehabilitation, Aftercare, Other Factors Influencing Health Status and Other Health Service Contacts",3,Major,Major,Medical,Medicare,Private Health Insurance,Self-Pay,,N,N,27621.35,13473.64
Capital/Adirond,Schenectady,4601004,000831,Sunnyview Hospital and Rehabilitation Center,70 or Older,123,M,White,Not Span/Hispanic,7,Elective,Home or Self Care,2017,259,Residual codes; unclassified,213,"PHYS THER EXER, MANIPUL",860,Rehabilitation,23,"Rehabilitation, Aftercare, Other Factors Influencing Health Status and Other Health Service Contacts",2,Moderate,Moderate,Medical,Medicare,Blue Cross/Blue Shield,Private Health Insurance,,N,N,16021.40,7638.81
Capital/Adirond,Schenectady,4601004,000831,Sunnyview Hospital and Rehabilitation Center,70 or Older,123,F,White,Not Span/Hispanic,9,Elective,Home w/ Home Health Services,2017,259,Residual codes; unclassified,213,"PHYS THER EXER, MANIPUL",860,Rehabilitation,23,"Rehabilitation, Aftercare, Other Factors Influencing Health Status and Other Health Service Contacts",3,Major,Major,Medical,Medicare,Private Health Insurance,Self-Pay,,N,N,20546.30,9854.30
Capital/Adirond,Schenectady,4601004,000831,Sunnyview Hospital and Rehabilitation Center,50 to 69,120,F,White,Not Span/Hispanic,9,Elective,Home w/ Home Health Services,2017,259,Residual codes; unclassified,213,"PHYS THER EXER, MANIPUL",860,Rehabilitation,23,"Rehabilitation, Aftercare, Other Factors Influencing Health Status and Other Health Service Contacts",2,Moderate,Minor,Medical,Blue Cross/Blue Shield,Self-Pay,Self-Pay,,N,N,22563.65,10738.19
Capital/Adirond,Schenectady,4601004,000831,Sunnyview Hospital and Rehabilitation Center,70 or Older,121,F,White,Not Span/Hispanic,8,Elective,Home w/ Home Health Services,2017,259,Residual codes; unclassified,213,"PHYS THER EXER, MANIPUL",860,Rehabilitation,23,"Rehabilitation, Aftercare, Other Factors Influencing Health Status and Other Health Service Contacts",2,Moderate,Moderate,Medical,Medicare,Self-Pay,Self-Pay,,N,N,19216.10,9174.09
Capital/Adirond,Schenectady,4601004,000831,Sunnyview Hospital and Rehabilitation Center,50 to 69,123,F,White,Not Span/Hispanic,6,Elective,Home or Self Care,2017,259,Residual codes; unclassified,213,"PHYS THER EXER, MANIPUL",860,Rehabilitation,23,"Rehabilitation, Aftercare, Other Factors Influencing Health Status and Other Health Service Contacts",1,Minor,Minor,Medical,Medicare,Self-Pay,Self-Pay,,N,N,13694.00,6341.85
Capital/Adirond,Schenectady,4601004,000831,Sunnyview Hospital and Rehabilitation Center,50 to 69,122,M,White,Not Span/Hispanic,3,Elective,Home or Self Care,2017,259,Residual codes; unclassified,213,"PHYS THER EXER, MANIPUL",860,Rehabilitation,23,"Rehabilitation, Aftercare, Other Factors Influencing Health Status and Other Health Service Contacts",2,Moderate,Minor,Medical,Medicare,Self-Pay,Self-Pay,,N,N,8617.75,3780.11
Capital/Adirond,Schenectady,4601004,000831,Sunnyview Hospital and Rehabilitation Center,70 or Older,122,F,White,Not Span/Hispanic,5,Elective,Home or Self Care,2017,259,Residual codes; unclassified,213,"PHYS THER EXER, MANIPUL",860,Rehabilitation,23,"Rehabilitation, Aftercare, Other Factors Influencing Health Status and Other Health Service Contacts",2,Moderate,Moderate,Medical,Medicare,Blue Cross/Blue Shield,Private Health Insurance,,N,N,12237.95,5695.46
Capital/Adirond,Schenectady,4601004,000831,Sunnyview Hospital and Rehabilitation Center,50 to 69,123,F,White,Not Span/Hispanic,5,Elective,Home or Self Care,2017,259,Residual codes; unclassified,213,"PHYS THER EXER, MANIPUL",860,Rehabilitation,23,"Rehabilitation, Aftercare, Other Factors Influencing Health Status and Other Health Service Contacts",1,Minor,Minor,Medical,Medicare,Private Health Insurance,Self-Pay,,N,N,11253.25,5273.97
Capital/Adirond,Schenectady,4601004,000831,Sunnyview Hospital and Rehabilitation Center,70 or Older,122,F,White,Not Span/Hispanic,6,Elective,Home or Self Care,2017,259,Residual codes; unclassified,213,"PHYS THER EXER, MANIPUL",860,Rehabilitation,23,"Rehabilitation, Aftercare, Other Factors Influencing Health Status and Other Health Service Contacts",2,Moderate,Moderate,Medical,Medicare,Blue Cross/Blue Shield,Self-Pay,,N,N,14201.20,6431.10
Capital/Adirond,Schenectady,4601004,000831,Sunnyview Hospital and Rehabilitation Center,70 or Older,121,F,White,Not Span/Hispanic,5,Elective,Home or Self Care,2017,259,Residual codes; unclassified,213,"PHYS THER EXER, MANIPUL",860,Rehabilitation,23,"Rehabilitation, Aftercare, Other Factors Influencing Health Status and Other Health Service Contacts",2,Moderate,Moderate,Medical,Medicare,Private Health Insurance,Self-Pay,,N,N,12182.55,5939.79
New York City,Kings,7001033,001315,Kingsbrook Jewish Medical Center,30 to 49,112,M,Black/African American,Not Span/Hispanic,27,Urgent,Skilled Nursing Home,2017,252,Malaise and fatigue,213,"PHYS THER EXER, MANIPUL",860,Rehabilitation,23,"Rehabilitation, Aftercare, Other Factors Influencing Health Status and Other Health Service Contacts",1,Minor,Minor,Medical,Medicaid,Medicaid,Self-Pay,,N,N,143392.00,43502.39
New York City,Kings,7001033,001315,Kingsbrook Jewish Medical Center,50 to 69,112,F,Black/African American,Not Span/Hispanic,24,Urgent,Skilled Nursing Home,2017,252,Malaise and fatigue,058,HEMODIALYSIS,860,Rehabilitation,23,"Rehabilitation, Aftercare, Other Factors Influencing Health Status and Other Health Service Contacts",2,Moderate,Moderate,Medical,Medicare,Medicaid,Self-Pay,,N,N,122433.00,32605.58
New York City,Kings,7001033,001315,Kingsbrook Jewish Medical Center,70 or Older,112,F,Black/African American,Not Span/Hispanic,18,Urgent,Home w/ Home Health Services,2017,252,Malaise and fatigue,213,"PHYS THER EXER, MANIPUL",860,Rehabilitation,23,"Rehabilitation, Aftercare, Other Factors Influencing Health Status and Other Health Service Contacts",2,Moderate,Moderate,Medical,Medicaid,Self-Pay,,,N,N,69641.00,22342.90
New York City,Kings,7001033,001315,Kingsbrook Jewish Medical Center,70 or Older,112,M,Other Race,Not Span/Hispanic,20,Urgent,Home or Self Care,2017,252,Malaise and fatigue,213,"PHYS THER EXER, MANIPUL",860,Rehabilitation,23,"Rehabilitation, Aftercare, Other Factors Influencing Health Status and Other Health Service Contacts",2,Moderate,Moderate,Medical,Medicare,Medicare,Self-Pay,,N,N,77683.00,25690.68
New York City,Kings,7001033,001315,Kingsbrook Jewish Medical Center,50 to 69,114,M,Other Race,Not Span/Hispanic,16,Urgent,Home w/ Home Health Services,2017,257,Other aftercare,215,OT PHYS THER/REHAB,860,Rehabilitation,23,"Rehabilitation, Aftercare, Other Factors Influencing Health Status and Other Health Service Contacts",1,Minor,Minor,Medical,Medicaid,Medicaid,Self-Pay,,N,N,55313.00,18810.82
New York City,Kings,7001033,001315,Kingsbrook Jewish Medical Center,50 to 69,112,F,Black/African American,Not Span/Hispanic,20,Urgent,Home w/ Home Health Services,2017,257,Other aftercare,215,OT PHYS THER/REHAB,860,Rehabilitation,23,"Rehabilitation, Aftercare, Other Factors Influencing Health Status and Other Health Service Contacts",2,Moderate,Minor,Medical,Medicare,Medicare,Medicaid,,N,N,62712.00,23510.17
New York City,Kings,7001033,001315,Kingsbrook Jewish Medical Center,30 to 49,112,F,Black/African American,Not Span/Hispanic,14,Urgent,Home or Self Care,2017,257,Other aftercare,215,OT PHYS THER/REHAB,860,Rehabilitation,23,"Rehabilitation, Aftercare, Other Factors Influencing Health Status and Other Health Service Contacts",1,Minor,Minor,Medical,Medicaid,Medicaid,Self-Pay,,N,N,60154.00,17890.87
New York City,Kings,7001033,001315,Kingsbrook Jewish Medical Center,70 or Older,116,M,White,Not Span/Hispanic,14,Urgent,Home w/ Home Health Services,2017,252,Malaise and fatigue,215,OT PHYS THER/REHAB,860,Rehabilitation,23,"Rehabilitation, Aftercare, Other Factors Influencing Health Status and Other Health Service Contacts",2,Moderate,Moderate,Medical,Medicare,Medicaid,Self-Pay,,N,N,34142.00,15227.19
New York City,Kings,7001033,001315,Kingsbrook Jewish Medical Center,50 to 69,112,F,Black/African American,Not Span/Hispanic,15,Urgent,Home w/ Home Health Services,2017,252,Malaise and fatigue,215,OT PHYS THER/REHAB,860,Rehabilitation,23,"Rehabilitation, Aftercare, Other Factors Influencing Health Status and Other Health Service Contacts",3,Major,Major,Medical,Medicare,Medicaid,Self-Pay,,N,N,42298.00,17472.24
New York City,Kings,7001033,001315,Kingsbrook Jewish Medical Center,50 to 69,112,M,Black/African American,Not Span/Hispanic,12,Urgent,Home w/ Home Health Services,2017,252,Malaise and fatigue,215,OT PHYS THER/REHAB,860,Rehabilitation,23,"Rehabilitation, Aftercare, Other Factors Influencing Health Status and Other Health Service Contacts",2,Moderate,Moderate,Medical,Medicare,Medicaid,Self-Pay,,N,N,34036.00,13991.25
New York City,Kings,7001033,001315,Kingsbrook Jewish Medical Center,70 or Older,112,M,White,Not Span/Hispanic,9,Urgent,Home or Self Care,2017,252,Malaise and fatigue,213,"PHYS THER EXER, MANIPUL",860,Rehabilitation,23,"Rehabilitation, Aftercare, Other Factors Influencing Health Status and Other Health Service Contacts",2,Moderate,Moderate,Medical,Private Health Insurance,Self-Pay,,,N,N,42997.00,11843.19
New York City,Kings,7001033,001315,Kingsbrook Jewish Medical Center,30 to 49,112,M,Black/African American,Not Span/Hispanic,8,Urgent,Home w/ Home Health Services,2017,252,Malaise and fatigue,213,"PHYS THER EXER, MANIPUL",860,Rehabilitation,23,"Rehabilitation, Aftercare, Other Factors Influencing Health Status and Other Health Service Contacts",3,Major,Minor,Medical,Blue Cross/Blue Shield,Self-Pay,,,N,N,34705.00,9996.68
New York City,Kings,7001033,001315,Kingsbrook Jewish Medical Center,70 or Older,112,M,White,Not Span/Hispanic,2,Urgent,Short-term Hospital,2017,252,Malaise and fatigue,215,OT PHYS THER/REHAB,860,Rehabilitation,23,"Rehabilitation, Aftercare, Other Factors Influencing Health Status and Other Health Service Contacts",2,Moderate,Moderate,Medical,Medicare,Self-Pay,,,N,N,10343.00,2519.50
New York City,Manhattan,7002024,001456,Mount Sinai Hospital,50 to 69,112,M,Other Race,Not Span/Hispanic,26,Elective,Skilled Nursing Home,2017,252,Malaise and fatigue,231,OTHER THERAPEUTIC PRCS,860,Rehabilitation,23,"Rehabilitation, Aftercare, Other Factors Influencing Health Status and Other Health Service Contacts",4,Extreme,Extreme,Medical,Medicaid,Self-Pay,,,N,N,198327.95,56340.55
New York City,Manhattan,7002024,001456,Mount Sinai Hospital,50 to 69,101,M,White,Not Span/Hispanic,24,Elective,Home w/ Home Health Services,2017,252,Malaise and fatigue,213,"PHYS THER EXER, MANIPUL",860,Rehabilitation,23,"Rehabilitation, Aftercare, Other Factors Influencing Health Status and Other Health Service Contacts",3,Major,Extreme,Medical,Private Health Insurance,Self-Pay,Medicare,,N,N,148643.93,42311.72
New York City,Manhattan,7002024,001456,Mount Sinai Hospital,70 or Older,101,M,White,Not Span/Hispanic,16,Urgent,Short-term Hospital,2017,257,Other aftercare,215,OT PHYS THER/REHAB,860,Rehabilitation,23,"Rehabilitation, Aftercare, Other Factors Influencing Health Status and Other Health Service Contacts",2,Moderate,Moderate,Medical,Medicare,Private Health Insurance,Self-Pay,,N,N,117012.95,35118.29
New York City,Manhattan,7002024,001456,Mount Sinai Hospital,30 to 49,100,M,White,Not Span/Hispanic,7,Elective,Home w/ Home Health Services,2017,252,Malaise and fatigue,213,"PHYS THER EXER, MANIPUL",860,Rehabilitation,23,"Rehabilitation, Aftercare, Other Factors Influencing Health Status and Other Health Service Contacts",3,Major,Major,Medical,Private Health Insurance,Self-Pay,,,N,N,44749.50,13237.05
New York City,Manhattan,7002032,001466,Mount Sinai West,50 to 69,100,F,White,Not Span/Hispanic,12,Elective,Home w/ Home Health Services,2017,257,Other aftercare,213,"PHYS THER EXER, MANIPUL",860,Rehabilitation,23,"Rehabilitation, Aftercare, Other Factors Influencing Health Status and Other Health Service Contacts",1,Minor,Minor,Medical,Blue Cross/Blue Shield,Medicare,Self-Pay,,N,N,74092.65,24908.88
New York City,Manhattan,7002032,001466,Mount Sinai West,70 or Older,100,M,White,Not Span/Hispanic,15,Elective,Home w/ Home Health Services,2017,257,Other aftercare,213,"PHYS THER EXER, MANIPUL",860,Rehabilitation,23,"Rehabilitation, Aftercare, Other Factors Influencing Health Status and Other Health Service Contacts",1,Minor,Minor,Medical,Medicare,Private Health Insurance,Self-Pay,,N,N,90193.19,30531.60
New York City,Manhattan,7002032,001466,Mount Sinai West,70 or Older,100,F,White,Not Span/Hispanic,14,Elective,Home w/ Home Health Services,2017,257,Other aftercare,213,"PHYS THER EXER, MANIPUL",860,Rehabilitation,23,"Rehabilitation, Aftercare, Other Factors Influencing Health Status and Other Health Service Contacts",1,Minor,Minor,Medical,Medicare,Medicare,Self-Pay,,N,N,84352.41,28699.96
New York City,Manhattan,7002032,001466,Mount Sinai West,70 or Older,117,M,White,Not Span/Hispanic,9,Elective,Home w/ Home Health Services,2017,238,Complications of surgical procedures or medical care,213,"PHYS THER EXER, MANIPUL",860,Rehabilitation,23,"Rehabilitation, Aftercare, Other Factors Influencing Health Status and Other Health Service Contacts",1,Minor,Moderate,Medical,Medicare,Blue Cross/Blue Shield,Self-Pay,,N,N,55071.85,18348.09
New York City,Manhattan,7002032,001466,Mount Sinai West,70 or Older,100,M,White,Not Span/Hispanic,4,Elective,Home w/ Home Health Services,2017,252,Malaise and fatigue,213,"PHYS THER EXER, MANIPUL",860,Rehabilitation,23,"Rehabilitation, Aftercare, Other Factors Influencing Health Status and Other Health Service Contacts",3,Major,Major,Medical,Medicare,Private Health Insurance,Self-Pay,,N,N,23237.43,7672.10
New York City,Manhattan,7002032,001469,Mount Sinai St. Luke's,70 or Older,101,F,Other Race,Not Span/Hispanic,14,Elective,Home w/ Home Health Services,2017,230,Fracture of lower limb,215,OT PHYS THER/REHAB,860,Rehabilitation,23,"Rehabilitation, Aftercare, Other Factors Influencing Health Status and Other Health Service Contacts",2,Moderate,Minor,Medical,Medicare,Private Health Insurance,Self-Pay,,N,N,84541.00,28641.48
New York City,Manhattan,7002032,001469,Mount Sinai St. Luke's,70 or Older,100,F,Other Race,Not Span/Hispanic,21,Elective,Skilled Nursing Home,2017,226,Fracture of neck of femur (hip),215,OT PHYS THER/REHAB,860,Rehabilitation,23,"Rehabilitation, Aftercare, Other Factors Influencing Health Status and Other Health Service Contacts",2,Moderate,Minor,Medical,Medicare,Private Health Insurance,Self-Pay,,N,N,128277.64,43299.88
New York City,Bronx,7000006,001168,Montefiore Medical Center-Wakefield Hospital,50 to 69,105,M,Black/African American,Not Span/Hispanic,7,Elective,Inpatient Rehabilitation Facility,2017,232,Sprains and strains,213,"PHYS THER EXER, MANIPUL",860,Rehabilitation,23,"Rehabilitation, Aftercare, Other Factors Influencing Health Status and Other Health Service Contacts",3,Major,Major,Medical,Medicare,Medicaid,,,N,N,61843.23,15547.18