Hospital Service Area,Hospital County,Operating Certificate Number,Permanent Facility Id,Facility Name,Age Group,Zip Code - 3 digits,Gender,Race,Ethnicity,Length of Stay,Type of Admission,Patient Disposition,Discharge Year,CCS Diagnosis Code,CCS Diagnosis Description,CCS Procedure Code,CCS Procedure Description,APR DRG Code,APR DRG Description,APR MDC Code,APR MDC Description,APR Severity of Illness Code,APR Severity of Illness Description,APR Risk of Mortality,APR Medical Surgical Description,Payment Typology 1,Payment Typology 2,Payment Typology 3,Birth Weight,Abortion Edit Indicator,Emergency Department Indicator,Total Charges,Total Costs
New York City,Kings,7002053,001304,NYU Langone Hospital-Brooklyn,50 to 69,112,M,White,Not Span/Hispanic,15,Elective,Home w/ Home Health Services,2017,226,Fracture of neck of femur (hip),213,"PHYS THER EXER, MANIPUL",860,Rehabilitation,23,"Rehabilitation, Aftercare, Other Factors Influencing Health Status and Other Health Service Contacts",1,Minor,Minor,Medical,Blue Cross/Blue Shield,,,,N,N,110841.80,23202.63
New York City,Kings,7002053,001304,NYU Langone Hospital-Brooklyn,50 to 69,112,F,Other Race,Not Span/Hispanic,16,Elective,Home w/ Home Health Services,2017,231,Other fractures,213,"PHYS THER EXER, MANIPUL",860,Rehabilitation,23,"Rehabilitation, Aftercare, Other Factors Influencing Health Status and Other Health Service Contacts",1,Minor,Minor,Medical,Miscellaneous/Other,,,,N,N,114279.27,22080.00
New York City,Kings,7002053,001304,NYU Langone Hospital-Brooklyn,50 to 69,112,M,White,Not Span/Hispanic,17,Elective,Skilled Nursing Home,2017,257,Other aftercare,213,"PHYS THER EXER, MANIPUL",860,Rehabilitation,23,"Rehabilitation, Aftercare, Other Factors Influencing Health Status and Other Health Service Contacts",1,Minor,Minor,Medical,Blue Cross/Blue Shield,,,,N,N,128362.30,24459.18
New York City,Kings,7002053,001304,NYU Langone Hospital-Brooklyn,70 or Older,112,F,Other Race,Not Span/Hispanic,14,Elective,Skilled Nursing Home,2017,231,Other fractures,213,"PHYS THER EXER, MANIPUL",860,Rehabilitation,23,"Rehabilitation, Aftercare, Other Factors Influencing Health Status and Other Health Service Contacts",1,Minor,Minor,Medical,Medicare,,,,N,Y,141530.38,29771.86
New York City,Kings,7002053,001304,NYU Langone Hospital-Brooklyn,70 or Older,112,M,Other Race,Not Span/Hispanic,13,Elective,Home w/ Home Health Services,2017,257,Other aftercare,213,"PHYS THER EXER, MANIPUL",860,Rehabilitation,23,"Rehabilitation, Aftercare, Other Factors Influencing Health Status and Other Health Service Contacts",1,Minor,Minor,Medical,Medicare,,,,N,N,100489.35,18932.13
New York City,Kings,7002053,001304,NYU Langone Hospital-Brooklyn,50 to 69,112,F,Other Race,Not Span/Hispanic,15,Elective,Home w/ Home Health Services,2017,233,Intracranial injury,213,"PHYS THER EXER, MANIPUL",860,Rehabilitation,23,"Rehabilitation, Aftercare, Other Factors Influencing Health Status and Other Health Service Contacts",1,Minor,Minor,Medical,Miscellaneous/Other,,,,N,N,132185.56,24250.47
New York City,Kings,7002053,001304,NYU Langone Hospital-Brooklyn,30 to 49,112,F,Other Race,Not Span/Hispanic,14,Elective,Home w/ Home Health Services,2017,231,Other fractures,213,"PHYS THER EXER, MANIPUL",860,Rehabilitation,23,"Rehabilitation, Aftercare, Other Factors Influencing Health Status and Other Health Service Contacts",1,Minor,Minor,Medical,Medicare,,,,N,N,109871.02,21967.02
New York City,Kings,7002053,001304,NYU Langone Hospital-Brooklyn,70 or Older,112,M,White,Not Span/Hispanic,15,Elective,Home w/ Home Health Services,2017,233,Intracranial injury,213,"PHYS THER EXER, MANIPUL",860,Rehabilitation,23,"Rehabilitation, Aftercare, Other Factors Influencing Health Status and Other Health Service Contacts",1,Minor,Minor,Medical,Medicare,,,,N,N,120449.51,22805.40
New York City,Kings,7002053,001304,NYU Langone Hospital-Brooklyn,50 to 69,112,F,Black/African American,Not Span/Hispanic,13,Elective,Home w/ Home Health Services,2017,233,Intracranial injury,213,"PHYS THER EXER, MANIPUL",860,Rehabilitation,23,"Rehabilitation, Aftercare, Other Factors Influencing Health Status and Other Health Service Contacts",1,Minor,Minor,Medical,Medicare,,,,N,N,91434.18,15732.51
New York City,Kings,7002053,001304,NYU Langone Hospital-Brooklyn,70 or Older,112,M,White,Not Span/Hispanic,20,Elective,Home w/ Home Health Services,2017,226,Fracture of neck of femur (hip),213,"PHYS THER EXER, MANIPUL",860,Rehabilitation,23,"Rehabilitation, Aftercare, Other Factors Influencing Health Status and Other Health Service Contacts",1,Minor,Minor,Medical,Medicare,,,,N,N,137378.60,24425.66
New York City,Kings,7002053,001304,NYU Langone Hospital-Brooklyn,70 or Older,112,M,White,Not Span/Hispanic,15,Elective,Home w/ Home Health Services,2017,231,Other fractures,213,"PHYS THER EXER, MANIPUL",860,Rehabilitation,23,"Rehabilitation, Aftercare, Other Factors Influencing Health Status and Other Health Service Contacts",1,Minor,Minor,Medical,Medicare,,,,N,N,119187.73,24026.44
New York City,Kings,7002053,001304,NYU Langone Hospital-Brooklyn,50 to 69,112,M,White,Not Span/Hispanic,15,Elective,Home w/ Home Health Services,2017,233,Intracranial injury,213,"PHYS THER EXER, MANIPUL",860,Rehabilitation,23,"Rehabilitation, Aftercare, Other Factors Influencing Health Status and Other Health Service Contacts",1,Minor,Minor,Medical,Miscellaneous/Other,,,,N,N,131446.76,24679.19
New York City,Kings,7002053,001304,NYU Langone Hospital-Brooklyn,70 or Older,112,M,White,Not Span/Hispanic,18,Elective,Home w/ Home Health Services,2017,252,Malaise and fatigue,100,ENDOSCOPY URINARY TRACT,860,Rehabilitation,23,"Rehabilitation, Aftercare, Other Factors Influencing Health Status and Other Health Service Contacts",3,Major,Major,Medical,Medicare,,,,N,N,152690.93,30512.38
New York City,Kings,7002053,001304,NYU Langone Hospital-Brooklyn,18 to 29,112,M,Other Race,Not Span/Hispanic,16,Elective,Home or Self Care,2017,230,Fracture of lower limb,213,"PHYS THER EXER, MANIPUL",860,Rehabilitation,23,"Rehabilitation, Aftercare, Other Factors Influencing Health Status and Other Health Service Contacts",1,Minor,Minor,Medical,Medicaid,,,,N,N,129501.82,25504.59
New York City,Kings,7002053,001304,NYU Langone Hospital-Brooklyn,30 to 49,112,F,Other Race,Not Span/Hispanic,8,Elective,Home w/ Home Health Services,2017,231,Other fractures,215,OT PHYS THER/REHAB,860,Rehabilitation,23,"Rehabilitation, Aftercare, Other Factors Influencing Health Status and Other Health Service Contacts",1,Minor,Minor,Medical,Medicaid,,,,N,N,67634.34,13353.31
New York City,Kings,7002053,001304,NYU Langone Hospital-Brooklyn,50 to 69,112,M,White,Not Span/Hispanic,23,Elective,Home w/ Home Health Services,2017,252,Malaise and fatigue,213,"PHYS THER EXER, MANIPUL",860,Rehabilitation,23,"Rehabilitation, Aftercare, Other Factors Influencing Health Status and Other Health Service Contacts",1,Minor,Minor,Medical,Medicaid,,,,N,N,246608.12,54005.85
New York City,Kings,7002053,001304,NYU Langone Hospital-Brooklyn,50 to 69,112,M,Other Race,Not Span/Hispanic,14,Elective,Home w/ Home Health Services,2017,233,Intracranial injury,213,"PHYS THER EXER, MANIPUL",860,Rehabilitation,23,"Rehabilitation, Aftercare, Other Factors Influencing Health Status and Other Health Service Contacts",1,Minor,Minor,Medical,Blue Cross/Blue Shield,,,,N,N,110493.77,19667.87
New York City,Kings,7002053,001304,NYU Langone Hospital-Brooklyn,70 or Older,112,F,White,Not Span/Hispanic,8,Elective,Home w/ Home Health Services,2017,252,Malaise and fatigue,213,"PHYS THER EXER, MANIPUL",860,Rehabilitation,23,"Rehabilitation, Aftercare, Other Factors Influencing Health Status and Other Health Service Contacts",1,Minor,Minor,Medical,Medicare,,,,N,N,69814.38,12962.61
New York City,Kings,7002053,001304,NYU Langone Hospital-Brooklyn,50 to 69,103,F,White,Not Span/Hispanic,18,Elective,Short-term Hospital,2017,236,Open wounds of extremities,213,"PHYS THER EXER, MANIPUL",860,Rehabilitation,23,"Rehabilitation, Aftercare, Other Factors Influencing Health Status and Other Health Service Contacts",1,Minor,Minor,Medical,Miscellaneous/Other,,,,N,N,174652.14,35784.59
New York City,Kings,7002053,001304,NYU Langone Hospital-Brooklyn,50 to 69,112,F,White,Not Span/Hispanic,14,Elective,Home w/ Home Health Services,2017,257,Other aftercare,213,"PHYS THER EXER, MANIPUL",860,Rehabilitation,23,"Rehabilitation, Aftercare, Other Factors Influencing Health Status and Other Health Service Contacts",1,Minor,Minor,Medical,Private Health Insurance,,,,N,N,127506.21,26297.82
New York City,Kings,7002053,001304,NYU Langone Hospital-Brooklyn,70 or Older,112,M,White,Not Span/Hispanic,15,Elective,Home w/ Home Health Services,2017,231,Other fractures,213,"PHYS THER EXER, MANIPUL",860,Rehabilitation,23,"Rehabilitation, Aftercare, Other Factors Influencing Health Status and Other Health Service Contacts",1,Minor,Minor,Medical,Medicare,,,,N,N,145323.43,29063.84
New York City,Kings,7002053,001304,NYU Langone Hospital-Brooklyn,50 to 69,112,F,Other Race,Not Span/Hispanic,13,Elective,Skilled Nursing Home,2017,257,Other aftercare,213,"PHYS THER EXER, MANIPUL",860,Rehabilitation,23,"Rehabilitation, Aftercare, Other Factors Influencing Health Status and Other Health Service Contacts",2,Moderate,Minor,Medical,Medicaid,,,,N,N,120397.19,24244.28
New York City,Kings,7002053,001304,NYU Langone Hospital-Brooklyn,70 or Older,112,M,White,Not Span/Hispanic,1,Elective,Short-term Hospital,2017,233,Intracranial injury,213,"PHYS THER EXER, MANIPUL",860,Rehabilitation,23,"Rehabilitation, Aftercare, Other Factors Influencing Health Status and Other Health Service Contacts",1,Minor,Minor,Medical,Private Health Insurance,,,,N,N,22504.69,2601.53
New York City,Kings,7002053,001304,NYU Langone Hospital-Brooklyn,50 to 69,112,F,White,Not Span/Hispanic,19,Elective,Home w/ Home Health Services,2017,226,Fracture of neck of femur (hip),213,"PHYS THER EXER, MANIPUL",860,Rehabilitation,23,"Rehabilitation, Aftercare, Other Factors Influencing Health Status and Other Health Service Contacts",1,Minor,Minor,Medical,Private Health Insurance,,,,N,N,145254.34,27229.63
New York City,Kings,7002053,001304,NYU Langone Hospital-Brooklyn,18 to 29,112,M,White,Not Span/Hispanic,13,Elective,Home w/ Home Health Services,2017,252,Malaise and fatigue,213,"PHYS THER EXER, MANIPUL",860,Rehabilitation,23,"Rehabilitation, Aftercare, Other Factors Influencing Health Status and Other Health Service Contacts",1,Minor,Minor,Medical,Private Health Insurance,,,,N,N,98571.80,18435.59
New York City,Kings,7002053,001304,NYU Langone Hospital-Brooklyn,50 to 69,112,F,Other Race,Not Span/Hispanic,10,Elective,Home w/ Home Health Services,2017,257,Other aftercare,213,"PHYS THER EXER, MANIPUL",860,Rehabilitation,23,"Rehabilitation, Aftercare, Other Factors Influencing Health Status and Other Health Service Contacts",1,Minor,Minor,Medical,Medicaid,,,,N,N,85301.85,16816.18
New York City,Kings,7002053,001304,NYU Langone Hospital-Brooklyn,50 to 69,112,F,Black/African American,Not Span/Hispanic,9,Elective,Home w/ Home Health Services,2017,257,Other aftercare,213,"PHYS THER EXER, MANIPUL",860,Rehabilitation,23,"Rehabilitation, Aftercare, Other Factors Influencing Health Status and Other Health Service Contacts",1,Minor,Minor,Medical,Medicaid,,,,N,N,73866.97,14640.56
New York City,Kings,7002053,001304,NYU Langone Hospital-Brooklyn,70 or Older,112,F,Other Race,Not Span/Hispanic,14,Elective,Home w/ Home Health Services,2017,231,Other fractures,213,"PHYS THER EXER, MANIPUL",860,Rehabilitation,23,"Rehabilitation, Aftercare, Other Factors Influencing Health Status and Other Health Service Contacts",1,Minor,Minor,Medical,Private Health Insurance,,,,N,N,112109.66,26595.03
New York City,Kings,7002053,001304,NYU Langone Hospital-Brooklyn,50 to 69,112,F,Black/African American,Not Span/Hispanic,8,Elective,Home w/ Home Health Services,2017,257,Other aftercare,213,"PHYS THER EXER, MANIPUL",860,Rehabilitation,23,"Rehabilitation, Aftercare, Other Factors Influencing Health Status and Other Health Service Contacts",1,Minor,Minor,Medical,Private Health Insurance,,,,N,N,59863.25,11245.27
New York City,Kings,7002053,001304,NYU Langone Hospital-Brooklyn,50 to 69,103,F,White,Not Span/Hispanic,6,Elective,Home w/ Home Health Services,2017,257,Other aftercare,213,"PHYS THER EXER, MANIPUL",860,Rehabilitation,23,"Rehabilitation, Aftercare, Other Factors Influencing Health Status and Other Health Service Contacts",1,Minor,Minor,Medical,Blue Cross/Blue Shield,,,,N,N,42535.22,7810.86
New York City,Kings,7002053,001304,NYU Langone Hospital-Brooklyn,50 to 69,112,F,Other Race,Not Span/Hispanic,20,Elective,Skilled Nursing Home,2017,231,Other fractures,213,"PHYS THER EXER, MANIPUL",860,Rehabilitation,23,"Rehabilitation, Aftercare, Other Factors Influencing Health Status and Other Health Service Contacts",1,Minor,Minor,Medical,Medicaid,,,,N,N,226228.93,48266.38
New York City,Kings,7002053,001304,NYU Langone Hospital-Brooklyn,50 to 69,OOS,M,White,Not Span/Hispanic,14,Elective,Home w/ Home Health Services,2017,238,Complications of surgical procedures or medical care,213,"PHYS THER EXER, MANIPUL",860,Rehabilitation,23,"Rehabilitation, Aftercare, Other Factors Influencing Health Status and Other Health Service Contacts",1,Minor,Minor,Medical,Medicare,,,,N,N,130991.49,24170.79
New York City,Kings,7002053,001304,NYU Langone Hospital-Brooklyn,30 to 49,112,F,Other Race,Spanish/Hispanic,14,Elective,Home w/ Home Health Services,2017,230,Fracture of lower limb,213,"PHYS THER EXER, MANIPUL",860,Rehabilitation,23,"Rehabilitation, Aftercare, Other Factors Influencing Health Status and Other Health Service Contacts",2,Moderate,Minor,Medical,Medicaid,,,,N,N,154527.58,31366.54
New York City,Kings,7002053,001304,NYU Langone Hospital-Brooklyn,30 to 49,112,M,Black/African American,Not Span/Hispanic,12,Elective,Home or Self Care,2017,257,Other aftercare,213,"PHYS THER EXER, MANIPUL",860,Rehabilitation,23,"Rehabilitation, Aftercare, Other Factors Influencing Health Status and Other Health Service Contacts",3,Major,Moderate,Medical,Private Health Insurance,,,,N,N,100412.66,19674.65
New York City,Kings,7002053,001304,NYU Langone Hospital-Brooklyn,50 to 69,112,F,White,Not Span/Hispanic,14,Elective,Skilled Nursing Home,2017,257,Other aftercare,213,"PHYS THER EXER, MANIPUL",860,Rehabilitation,23,"Rehabilitation, Aftercare, Other Factors Influencing Health Status and Other Health Service Contacts",1,Minor,Minor,Medical,Medicaid,,,,N,N,106200.37,21929.88
New York City,Kings,7002053,001304,NYU Langone Hospital-Brooklyn,50 to 69,112,F,White,Not Span/Hispanic,12,Elective,Home w/ Home Health Services,2017,257,Other aftercare,213,"PHYS THER EXER, MANIPUL",860,Rehabilitation,23,"Rehabilitation, Aftercare, Other Factors Influencing Health Status and Other Health Service Contacts",1,Minor,Minor,Medical,Private Health Insurance,,,,N,N,95277.50,18570.53
New York City,Kings,7002053,001304,NYU Langone Hospital-Brooklyn,50 to 69,112,M,Other Race,Not Span/Hispanic,11,Elective,Home w/ Home Health Services,2017,233,Intracranial injury,213,"PHYS THER EXER, MANIPUL",860,Rehabilitation,23,"Rehabilitation, Aftercare, Other Factors Influencing Health Status and Other Health Service Contacts",1,Minor,Minor,Medical,Private Health Insurance,,,,N,N,113241.55,21703.35
New York City,Kings,7002053,001304,NYU Langone Hospital-Brooklyn,50 to 69,112,M,Other Race,Not Span/Hispanic,14,Elective,Home w/ Home Health Services,2017,230,Fracture of lower limb,213,"PHYS THER EXER, MANIPUL",860,Rehabilitation,23,"Rehabilitation, Aftercare, Other Factors Influencing Health Status and Other Health Service Contacts",1,Minor,Minor,Medical,Miscellaneous/Other,,,,N,N,116490.40,23314.84
New York City,Kings,7002053,001304,NYU Langone Hospital-Brooklyn,70 or Older,112,M,White,Not Span/Hispanic,13,Elective,Home w/ Home Health Services,2017,227,Spinal cord injury,213,"PHYS THER EXER, MANIPUL",860,Rehabilitation,23,"Rehabilitation, Aftercare, Other Factors Influencing Health Status and Other Health Service Contacts",1,Minor,Minor,Medical,Miscellaneous/Other,,,,N,N,94123.97,16501.97
New York City,Kings,7002053,001304,NYU Langone Hospital-Brooklyn,50 to 69,112,F,Black/African American,Not Span/Hispanic,8,Elective,Home or Self Care,2017,257,Other aftercare,215,OT PHYS THER/REHAB,860,Rehabilitation,23,"Rehabilitation, Aftercare, Other Factors Influencing Health Status and Other Health Service Contacts",1,Minor,Minor,Medical,Blue Cross/Blue Shield,,,,N,N,63520.42,12346.76
New York City,Kings,7002053,001304,NYU Langone Hospital-Brooklyn,70 or Older,,F,Other Race,Not Span/Hispanic,8,Elective,Home w/ Home Health Services,2017,257,Other aftercare,213,"PHYS THER EXER, MANIPUL",860,Rehabilitation,23,"Rehabilitation, Aftercare, Other Factors Influencing Health Status and Other Health Service Contacts",1,Minor,Minor,Medical,Private Health Insurance,,,,N,N,68781.55,13747.05
New York City,Kings,7002053,001304,NYU Langone Hospital-Brooklyn,50 to 69,112,F,Other Race,Not Span/Hispanic,20,Elective,Skilled Nursing Home,2017,231,Other fractures,213,"PHYS THER EXER, MANIPUL",860,Rehabilitation,23,"Rehabilitation, Aftercare, Other Factors Influencing Health Status and Other Health Service Contacts",1,Minor,Minor,Medical,Medicare,,,,N,N,181748.55,39257.28
New York City,Kings,7002053,001304,NYU Langone Hospital-Brooklyn,70 or Older,112,F,White,Not Span/Hispanic,12,Elective,Home w/ Home Health Services,2017,252,Malaise and fatigue,215,OT PHYS THER/REHAB,860,Rehabilitation,23,"Rehabilitation, Aftercare, Other Factors Influencing Health Status and Other Health Service Contacts",1,Minor,Minor,Medical,Medicare,,,,N,N,105489.01,21046.33
New York City,Kings,7002053,001304,NYU Langone Hospital-Brooklyn,70 or Older,112,F,White,Not Span/Hispanic,18,Elective,Skilled Nursing Home,2017,231,Other fractures,213,"PHYS THER EXER, MANIPUL",860,Rehabilitation,23,"Rehabilitation, Aftercare, Other Factors Influencing Health Status and Other Health Service Contacts",1,Minor,Minor,Medical,Medicare,,,,N,Y,202615.09,44238.51
New York City,Kings,7002053,001304,NYU Langone Hospital-Brooklyn,70 or Older,112,F,White,Not Span/Hispanic,12,Elective,Skilled Nursing Home,2017,231,Other fractures,213,"PHYS THER EXER, MANIPUL",860,Rehabilitation,23,"Rehabilitation, Aftercare, Other Factors Influencing Health Status and Other Health Service Contacts",1,Minor,Minor,Medical,Medicare,,,,N,N,92931.68,17207.92
New York City,Kings,7002053,001304,NYU Langone Hospital-Brooklyn,50 to 69,100,F,Other Race,Not Span/Hispanic,8,Elective,Home w/ Home Health Services,2017,257,Other aftercare,213,"PHYS THER EXER, MANIPUL",860,Rehabilitation,23,"Rehabilitation, Aftercare, Other Factors Influencing Health Status and Other Health Service Contacts",1,Minor,Minor,Medical,Private Health Insurance,,,,N,N,71170.22,13785.80
New York City,Kings,7002053,001304,NYU Langone Hospital-Brooklyn,50 to 69,,F,White,Not Span/Hispanic,8,Elective,Home w/ Home Health Services,2017,257,Other aftercare,213,"PHYS THER EXER, MANIPUL",860,Rehabilitation,23,"Rehabilitation, Aftercare, Other Factors Influencing Health Status and Other Health Service Contacts",1,Minor,Minor,Medical,Private Health Insurance,,,,N,N,70246.84,15648.96
New York City,Kings,7002053,001304,NYU Langone Hospital-Brooklyn,70 or Older,112,F,Other Race,Not Span/Hispanic,15,Elective,Home w/ Home Health Services,2017,231,Other fractures,213,"PHYS THER EXER, MANIPUL",860,Rehabilitation,23,"Rehabilitation, Aftercare, Other Factors Influencing Health Status and Other Health Service Contacts",1,Minor,Minor,Medical,Medicare,,,,N,N,162053.73,35259.24
New York City,Kings,7002053,001304,NYU Langone Hospital-Brooklyn,50 to 69,112,F,White,Not Span/Hispanic,14,Elective,Home w/ Home Health Services,2017,257,Other aftercare,213,"PHYS THER EXER, MANIPUL",860,Rehabilitation,23,"Rehabilitation, Aftercare, Other Factors Influencing Health Status and Other Health Service Contacts",1,Minor,Minor,Medical,Medicare,,,,N,N,114190.56,22326.86
New York City,Kings,7002053,001304,NYU Langone Hospital-Brooklyn,70 or Older,112,F,Other Race,Not Span/Hispanic,14,Elective,Home w/ Home Health Services,2017,252,Malaise and fatigue,213,"PHYS THER EXER, MANIPUL",860,Rehabilitation,23,"Rehabilitation, Aftercare, Other Factors Influencing Health Status and Other Health Service Contacts",1,Minor,Minor,Medical,Private Health Insurance,,,,N,N,147062.86,28496.82
New York City,Kings,7002053,001304,NYU Langone Hospital-Brooklyn,70 or Older,100,F,Other Race,Not Span/Hispanic,10,Elective,Home w/ Home Health Services,2017,230,Fracture of lower limb,213,"PHYS THER EXER, MANIPUL",860,Rehabilitation,23,"Rehabilitation, Aftercare, Other Factors Influencing Health Status and Other Health Service Contacts",1,Minor,Minor,Medical,Medicare,,,,N,N,81894.07,16187.94
New York City,Kings,7002053,001304,NYU Langone Hospital-Brooklyn,30 to 49,112,F,Other Race,Not Span/Hispanic,2,Elective,Home w/ Home Health Services,2017,257,Other aftercare,213,"PHYS THER EXER, MANIPUL",860,Rehabilitation,23,"Rehabilitation, Aftercare, Other Factors Influencing Health Status and Other Health Service Contacts",1,Minor,Minor,Medical,Miscellaneous/Other,,,,N,N,15611.83,2996.36
New York City,Kings,7002053,001304,NYU Langone Hospital-Brooklyn,70 or Older,112,M,Other Race,Not Span/Hispanic,8,Elective,Home w/ Home Health Services,2017,226,Fracture of neck of femur (hip),213,"PHYS THER EXER, MANIPUL",860,Rehabilitation,23,"Rehabilitation, Aftercare, Other Factors Influencing Health Status and Other Health Service Contacts",1,Minor,Minor,Medical,Blue Cross/Blue Shield,,,,N,N,75101.12,14693.15
New York City,Kings,7002053,001304,NYU Langone Hospital-Brooklyn,30 to 49,112,M,Other Race,Unknown,22,Elective,Home or Self Care,2017,257,Other aftercare,213,"PHYS THER EXER, MANIPUL",860,Rehabilitation,23,"Rehabilitation, Aftercare, Other Factors Influencing Health Status and Other Health Service Contacts",2,Moderate,Minor,Medical,Medicaid,,,,N,N,178044.45,35579.69
New York City,Kings,7002053,001304,NYU Langone Hospital-Brooklyn,50 to 69,113,F,Other Race,Not Span/Hispanic,14,Elective,Home w/ Home Health Services,2017,231,Other fractures,213,"PHYS THER EXER, MANIPUL",860,Rehabilitation,23,"Rehabilitation, Aftercare, Other Factors Influencing Health Status and Other Health Service Contacts",1,Minor,Minor,Medical,Medicare,,,,N,N,92496.43,17274.68
New York City,Kings,7002053,001304,NYU Langone Hospital-Brooklyn,50 to 69,112,F,Other Race,Unknown,13,Elective,Home w/ Home Health Services,2017,233,Intracranial injury,213,"PHYS THER EXER, MANIPUL",860,Rehabilitation,23,"Rehabilitation, Aftercare, Other Factors Influencing Health Status and Other Health Service Contacts",1,Minor,Minor,Medical,Miscellaneous/Other,,,,N,N,97128.89,19157.31
New York City,Kings,7002053,001304,NYU Langone Hospital-Brooklyn,30 to 49,,M,Other Race,Unknown,27,Elective,Home w/ Home Health Services,2017,230,Fracture of lower limb,213,"PHYS THER EXER, MANIPUL",860,Rehabilitation,23,"Rehabilitation, Aftercare, Other Factors Influencing Health Status and Other Health Service Contacts",1,Minor,Minor,Medical,Miscellaneous/Other,,,,N,N,223215.21,44650.91
New York City,Kings,7002053,001304,NYU Langone Hospital-Brooklyn,50 to 69,112,F,Other Race,Not Span/Hispanic,14,Elective,Home w/ Home Health Services,2017,257,Other aftercare,213,"PHYS THER EXER, MANIPUL",860,Rehabilitation,23,"Rehabilitation, Aftercare, Other Factors Influencing Health Status and Other Health Service Contacts",3,Major,Minor,Medical,Medicaid,,,,N,N,129818.40,25403.72
New York City,Kings,7002053,001304,NYU Langone Hospital-Brooklyn,50 to 69,112,M,Other Race,Unknown,13,Elective,Home w/ Home Health Services,2017,231,Other fractures,213,"PHYS THER EXER, MANIPUL",860,Rehabilitation,23,"Rehabilitation, Aftercare, Other Factors Influencing Health Status and Other Health Service Contacts",3,Major,Moderate,Medical,Private Health Insurance,,,,N,N,135314.30,26351.85