Hospital Service Area,Hospital County,Operating Certificate Number,Permanent Facility Id,Facility Name,Age Group,Zip Code - 3 digits,Gender,Race,Ethnicity,Length of Stay,Type of Admission,Patient Disposition,Discharge Year,CCS Diagnosis Code,CCS Diagnosis Description,CCS Procedure Code,CCS Procedure Description,APR DRG Code,APR DRG Description,APR MDC Code,APR MDC Description,APR Severity of Illness Code,APR Severity of Illness Description,APR Risk of Mortality,APR Medical Surgical Description,Payment Typology 1,Payment Typology 2,Payment Typology 3,Birth Weight,Abortion Edit Indicator,Emergency Department Indicator,Total Charges,Total Costs
New York City,Manhattan,7002054,001458,New York-Presbyterian Hospital - New York Weill Cornell Center,70 or Older,100,F,Other Race,Not Span/Hispanic,10,Elective,Skilled Nursing Home,2018,SYM007,MALAISE AND FATIGUE,RHB002,"PHYSICAL, OCCUPATIONAL, AND RESPIRATORY THERAPY TREATMENT",860,REHABILITATION,23,FACTORS INFLUENCING HEALTH STATUS AND OTHER CONTACTS WITH HEALTH SERVICES,4,Extreme,Major,Medical,Medicare,Self-Pay,,,,false,111474.34,30143.67
New York City,Manhattan,7002054,001458,New York-Presbyterian Hospital - New York Weill Cornell Center,70 or Older,108,M,White,Not Span/Hispanic,17,Emergency,Home w/ Home Health Services,2018,SYM007,MALAISE AND FATIGUE,RHB002,"PHYSICAL, OCCUPATIONAL, AND RESPIRATORY THERAPY TREATMENT",860,REHABILITATION,23,FACTORS INFLUENCING HEALTH STATUS AND OTHER CONTACTS WITH HEALTH SERVICES,3,Major,Major,Medical,Medicare,Private Health Insurance,Self-Pay,,,false,226617.17,53984.04
New York City,Manhattan,7002054,001458,New York-Presbyterian Hospital - New York Weill Cornell Center,50 to 69,100,F,Other Race,Not Span/Hispanic,7,Elective,Home w/ Home Health Services,2018,SYM007,MALAISE AND FATIGUE,RHB002,"PHYSICAL, OCCUPATIONAL, AND RESPIRATORY THERAPY TREATMENT",860,REHABILITATION,23,FACTORS INFLUENCING HEALTH STATUS AND OTHER CONTACTS WITH HEALTH SERVICES,3,Major,Moderate,Medical,Medicare,Self-Pay,,,,false,75203.17,20407.78
Long Island,Suffolk,5149001,000896,St. Charles Hospital,70 or Older,117,F,White,Not Span/Hispanic,10,Elective,Home w/ Home Health Services,2018,INJ043,"FRACTURE OF THE NECK OF THE FEMUR (HIP), SUBSEQUENT ENCOUNTER",RHB001,"PHYSICAL, OCCUPATIONAL, AND RESPIRATORY THERAPY EVALUATION",860,REHABILITATION,23,FACTORS INFLUENCING HEALTH STATUS AND OTHER CONTACTS WITH HEALTH SERVICES,2,Moderate,Minor,Medical,Medicare,Private Health Insurance,,,,false,66685,14583.61
New York City,Richmond,7004003,001740,Staten Island University Hosp-North,70 or Older,103,F,White,Not Span/Hispanic,22,Elective,Home w/ Home Health Services,2018,INJ043,"FRACTURE OF THE NECK OF THE FEMUR (HIP), SUBSEQUENT ENCOUNTER",RHB002,"PHYSICAL, OCCUPATIONAL, AND RESPIRATORY THERAPY TREATMENT",860,REHABILITATION,23,FACTORS INFLUENCING HEALTH STATUS AND OTHER CONTACTS WITH HEALTH SERVICES,2,Moderate,Moderate,Medical,Medicare,Private Health Insurance,,,,false,106372.96,51893.72
New York City,Manhattan,7002001,001438,Bellevue Hospital Center,50 to 69,112,M,Other Race,Not Span/Hispanic,14,Emergency,Skilled Nursing Home,2018,INJ045,"TRAUMATIC BRAIN INJURY (TBI); CONCUSSION, SUBSEQUENT ENCOUNTER",RHB002,"PHYSICAL, OCCUPATIONAL, AND RESPIRATORY THERAPY TREATMENT",860,REHABILITATION,23,FACTORS INFLUENCING HEALTH STATUS AND OTHER CONTACTS WITH HEALTH SERVICES,1,Minor,Minor,Medical,Medicaid,Medicaid,,,,false,40662.43,27024.25
Central NY,Onondaga,3301007,000635,University Hospital SUNY Health Science Center,50 to 69,136,F,White,Not Span/Hispanic,7,Elective,Home or Self Care,2018,INJ039,"FRACTURE OF THE SPINE AND BACK, SUBSEQUENT ENCOUNTER",RHB002,"PHYSICAL, OCCUPATIONAL, AND RESPIRATORY THERAPY TREATMENT",860,REHABILITATION,23,FACTORS INFLUENCING HEALTH STATUS AND OTHER CONTACTS WITH HEALTH SERVICES,3,Major,Moderate,Medical,Miscellaneous/Other,,,,,false,44810.9,12302.71
New York City,Manhattan,7002032,001469,Mount Sinai Morningside,70 or Older,100,M,Other Race,Not Span/Hispanic,13,Elective,Short-term Hospital,2018,INJ040,"FRACTURE OF TORSO, SUBSEQUENT ENCOUNTER",RHB002,"PHYSICAL, OCCUPATIONAL, AND RESPIRATORY THERAPY TREATMENT",860,REHABILITATION,23,FACTORS INFLUENCING HEALTH STATUS AND OTHER CONTACTS WITH HEALTH SERVICES,3,Major,Extreme,Medical,Medicare,Private Health Insurance,Self-Pay,,,false,87697.93,32606.1
New York City,Manhattan,7002032,001469,Mount Sinai Morningside,70 or Older,100,M,White,Not Span/Hispanic,22,Elective,Skilled Nursing Home,2018,INJ043,"FRACTURE OF THE NECK OF THE FEMUR (HIP), SUBSEQUENT ENCOUNTER",RHB002,"PHYSICAL, OCCUPATIONAL, AND RESPIRATORY THERAPY TREATMENT",860,REHABILITATION,23,FACTORS INFLUENCING HEALTH STATUS AND OTHER CONTACTS WITH HEALTH SERVICES,2,Moderate,Minor,Medical,Medicare,Blue Cross/Blue Shield,Self-Pay,,,false,154726.2,58623.03
New York City,Manhattan,7002032,001469,Mount Sinai Morningside,50 to 69,112,F,Other Race,Not Span/Hispanic,14,Elective,Home or Self Care,2018,INJ043,"FRACTURE OF THE NECK OF THE FEMUR (HIP), SUBSEQUENT ENCOUNTER",RHB002,"PHYSICAL, OCCUPATIONAL, AND RESPIRATORY THERAPY TREATMENT",860,REHABILITATION,23,FACTORS INFLUENCING HEALTH STATUS AND OTHER CONTACTS WITH HEALTH SERVICES,3,Major,Major,Medical,Medicare,Blue Cross/Blue Shield,Self-Pay,,,false,97122.28,36453.85
New York City,Manhattan,7002032,001469,Mount Sinai Morningside,70 or Older,100,M,White,Not Span/Hispanic,15,Elective,Home or Self Care,2018,FAC010,OTHER AFTERCARE ENCOUNTER,RHB002,"PHYSICAL, OCCUPATIONAL, AND RESPIRATORY THERAPY TREATMENT",860,REHABILITATION,23,FACTORS INFLUENCING HEALTH STATUS AND OTHER CONTACTS WITH HEALTH SERVICES,3,Major,Major,Medical,Medicare,Private Health Insurance,Self-Pay,,,false,101537.88,38427.43
New York City,Manhattan,7002032,001469,Mount Sinai Morningside,70 or Older,100,F,White,Not Span/Hispanic,27,Elective,Short-term Hospital,2018,INJ051,"AMPUTATION OF A LIMB, SUBSEQUENT ENCOUNTER",RHB002,"PHYSICAL, OCCUPATIONAL, AND RESPIRATORY THERAPY TREATMENT",860,REHABILITATION,23,FACTORS INFLUENCING HEALTH STATUS AND OTHER CONTACTS WITH HEALTH SERVICES,3,Major,Major,Medical,Blue Cross/Blue Shield,Medicare,Self-Pay,,,false,212921.69,79107.48
New York City,Manhattan,7002032,001469,Mount Sinai Morningside,50 to 69,100,F,Black/African American,Not Span/Hispanic,10,Elective,Home w/ Home Health Services,2018,FAC010,OTHER AFTERCARE ENCOUNTER,RHB002,"PHYSICAL, OCCUPATIONAL, AND RESPIRATORY THERAPY TREATMENT",860,REHABILITATION,23,FACTORS INFLUENCING HEALTH STATUS AND OTHER CONTACTS WITH HEALTH SERVICES,1,Minor,Minor,Medical,Medicare,Medicare,Self-Pay,,,false,72018.04,27379.88
New York City,Manhattan,7002032,001469,Mount Sinai Morningside,70 or Older,100,F,White,Unknown,14,Elective,Home w/ Home Health Services,2018,SYM007,MALAISE AND FATIGUE,RHB002,"PHYSICAL, OCCUPATIONAL, AND RESPIRATORY THERAPY TREATMENT",860,REHABILITATION,23,FACTORS INFLUENCING HEALTH STATUS AND OTHER CONTACTS WITH HEALTH SERVICES,2,Moderate,Moderate,Medical,Medicare,Self-Pay,,,,false,96413.01,36043.81
New York City,Manhattan,7002032,001469,Mount Sinai Morningside,70 or Older,100,F,White,Unknown,4,Elective,Short-term Hospital,2018,INJ040,"FRACTURE OF TORSO, SUBSEQUENT ENCOUNTER",RHB002,"PHYSICAL, OCCUPATIONAL, AND RESPIRATORY THERAPY TREATMENT",860,REHABILITATION,23,FACTORS INFLUENCING HEALTH STATUS AND OTHER CONTACTS WITH HEALTH SERVICES,3,Major,Major,Medical,Medicare,Private Health Insurance,Self-Pay,,,false,28724.03,10721.38
New York City,Manhattan,7002032,001469,Mount Sinai Morningside,50 to 69,111,F,White,Not Span/Hispanic,14,Elective,Home w/ Home Health Services,2018,INJ042,"FRACTURE OF LOWER LIMB (EXCEPT HIP), SUBSEQUENT ENCOUNTER",RHB002,"PHYSICAL, OCCUPATIONAL, AND RESPIRATORY THERAPY TREATMENT",860,REHABILITATION,23,FACTORS INFLUENCING HEALTH STATUS AND OTHER CONTACTS WITH HEALTH SERVICES,2,Moderate,Minor,Medical,Miscellaneous/Other,Medicare,Self-Pay,,,false,96797.25,36775.1
New York City,Manhattan,7002032,001469,Mount Sinai Morningside,50 to 69,100,M,White,Not Span/Hispanic,18,Elective,Skilled Nursing Home,2018,INJ071,"COMPLICATION OF INTERNAL ORTHOPEDIC DEVICE OR IMPLANT, SUBSEQUENT ENCOUNTER",RHB002,"PHYSICAL, OCCUPATIONAL, AND RESPIRATORY THERAPY TREATMENT",860,REHABILITATION,23,FACTORS INFLUENCING HEALTH STATUS AND OTHER CONTACTS WITH HEALTH SERVICES,3,Major,Moderate,Medical,Medicare,Medicaid,Self-Pay,,,false,125924.32,47072.18
Long Island,Suffolk,5149001,000896,St. Charles Hospital,70 or Older,117,F,White,Not Span/Hispanic,9,Elective,Home w/ Home Health Services,2018,SYM007,MALAISE AND FATIGUE,RHB001,"PHYSICAL, OCCUPATIONAL, AND RESPIRATORY THERAPY EVALUATION",860,REHABILITATION,23,FACTORS INFLUENCING HEALTH STATUS AND OTHER CONTACTS WITH HEALTH SERVICES,2,Moderate,Moderate,Medical,Medicare,Private Health Insurance,,,,false,58530,12468.37
Long Island,Nassau,2909000,000513,Mercy Hospital,70 or Older,115,F,White,Not Span/Hispanic,15,Elective,Skilled Nursing Home,2018,INJ043,"FRACTURE OF THE NECK OF THE FEMUR (HIP), SUBSEQUENT ENCOUNTER",RHB002,"PHYSICAL, OCCUPATIONAL, AND RESPIRATORY THERAPY TREATMENT",860,REHABILITATION,23,FACTORS INFLUENCING HEALTH STATUS AND OTHER CONTACTS WITH HEALTH SERVICES,2,Moderate,Moderate,Medical,Medicare,Blue Cross/Blue Shield,,,,false,90273,24015.41
Long Island,Nassau,2909000,000513,Mercy Hospital,70 or Older,115,F,White,Not Span/Hispanic,14,Elective,Home or Self Care,2018,INJ043,"FRACTURE OF THE NECK OF THE FEMUR (HIP), SUBSEQUENT ENCOUNTER",RHB002,"PHYSICAL, OCCUPATIONAL, AND RESPIRATORY THERAPY TREATMENT",860,REHABILITATION,23,FACTORS INFLUENCING HEALTH STATUS AND OTHER CONTACTS WITH HEALTH SERVICES,1,Minor,Minor,Medical,Blue Cross/Blue Shield,Medicare,,,,false,93758,23921.71
New York City,Richmond,7004003,001740,Staten Island University Hosp-North,70 or Older,103,F,White,Not Span/Hispanic,20,Elective,Home w/ Home Health Services,2018,INJ043,"FRACTURE OF THE NECK OF THE FEMUR (HIP), SUBSEQUENT ENCOUNTER",RHB002,"PHYSICAL, OCCUPATIONAL, AND RESPIRATORY THERAPY TREATMENT",860,REHABILITATION,23,FACTORS INFLUENCING HEALTH STATUS AND OTHER CONTACTS WITH HEALTH SERVICES,2,Moderate,Moderate,Medical,Medicare,Medicare,,,,false,100731.15,49746.14
Capital/Adirond,Warren,5601000,001005,Glens Falls Hospital,70 or Older,128,M,White,Not Span/Hispanic,21,Elective,Skilled Nursing Home,2018,INJ039,"FRACTURE OF THE SPINE AND BACK, SUBSEQUENT ENCOUNTER",RHB002,"PHYSICAL, OCCUPATIONAL, AND RESPIRATORY THERAPY TREATMENT",860,REHABILITATION,23,FACTORS INFLUENCING HEALTH STATUS AND OTHER CONTACTS WITH HEALTH SERVICES,2,Moderate,Moderate,Medical,Miscellaneous/Other,,,,,false,86458.55,50523.84
New York City,Manhattan,7002032,001466,Mount Sinai West,30 to 49,111,F,Black/African American,Not Span/Hispanic,7,Elective,Home w/ Home Health Services,2018,FAC010,OTHER AFTERCARE ENCOUNTER,RHB001,"PHYSICAL, OCCUPATIONAL, AND RESPIRATORY THERAPY EVALUATION",860,REHABILITATION,23,FACTORS INFLUENCING HEALTH STATUS AND OTHER CONTACTS WITH HEALTH SERVICES,2,Moderate,Minor,Medical,Private Health Insurance,Self-Pay,,,,false,48469.86,18257.23
New York City,Richmond,7004003,001740,Staten Island University Hosp-North,70 or Older,103,F,Other Race,Not Span/Hispanic,10,Elective,Home w/ Home Health Services,2018,FAC010,OTHER AFTERCARE ENCOUNTER,RHB002,"PHYSICAL, OCCUPATIONAL, AND RESPIRATORY THERAPY TREATMENT",860,REHABILITATION,23,FACTORS INFLUENCING HEALTH STATUS AND OTHER CONTACTS WITH HEALTH SERVICES,2,Moderate,Moderate,Medical,Medicaid,,,,,false,58663.22,25179.99
Hudson Valley,Dutchess,5957001,000180,Mid-Hudson Valley Division of Westchester Medical Center,70 or Older,125,M,White,Not Span/Hispanic,9,Elective,Skilled Nursing Home,2018,FAC010,OTHER AFTERCARE ENCOUNTER,RHB002,"PHYSICAL, OCCUPATIONAL, AND RESPIRATORY THERAPY TREATMENT",860,REHABILITATION,23,FACTORS INFLUENCING HEALTH STATUS AND OTHER CONTACTS WITH HEALTH SERVICES,2,Moderate,Moderate,Medical,Medicare,Private Health Insurance,,,,false,89352.97,21184.88
New York City,Kings,7001016,001301,Kings County Hospital Center,50 to 69,112,F,Black/African American,Not Span/Hispanic,13,Emergency,Home or Self Care,2018,INJ045,"TRAUMATIC BRAIN INJURY (TBI); CONCUSSION, SUBSEQUENT ENCOUNTER",RHB002,"PHYSICAL, OCCUPATIONAL, AND RESPIRATORY THERAPY TREATMENT",860,REHABILITATION,23,FACTORS INFLUENCING HEALTH STATUS AND OTHER CONTACTS WITH HEALTH SERVICES,2,Moderate,Minor,Medical,Miscellaneous/Other,Medicaid,,,,false,27746.96,19710.36
Capital/Adirond,Montgomery,2801001,000482,St. Mary's Healthcare - Amsterdam Memorial Campus,70 or Older,120,F,White,Not Span/Hispanic,6,Urgent,Home or Self Care,2018,FAC010,OTHER AFTERCARE ENCOUNTER,RHB002,"PHYSICAL, OCCUPATIONAL, AND RESPIRATORY THERAPY TREATMENT",860,REHABILITATION,23,FACTORS INFLUENCING HEALTH STATUS AND OTHER CONTACTS WITH HEALTH SERVICES,1,Minor,Minor,Medical,Medicare,Private Health Insurance,,,,false,15198.3,9364.76
Capital/Adirond,Montgomery,2801001,000482,St. Mary's Healthcare - Amsterdam Memorial Campus,50 to 69,120,F,White,Not Span/Hispanic,10,Urgent,Home or Self Care,2018,FAC010,OTHER AFTERCARE ENCOUNTER,RHB002,"PHYSICAL, OCCUPATIONAL, AND RESPIRATORY THERAPY TREATMENT",860,REHABILITATION,23,FACTORS INFLUENCING HEALTH STATUS AND OTHER CONTACTS WITH HEALTH SERVICES,2,Moderate,Minor,Medical,Medicare,Medicaid,,,,false,25858.35,15920.94
Capital/Adirond,Schenectady,4601004,000831,Sunnyview Hospital and Rehabilitation Center,50 to 69,121,F,White,Not Span/Hispanic,13,Elective,Home or Self Care,2018,SYM016,OTHER GENERAL SIGNS AND SYMPTOMS,RHB002,"PHYSICAL, OCCUPATIONAL, AND RESPIRATORY THERAPY TREATMENT",860,REHABILITATION,23,FACTORS INFLUENCING HEALTH STATUS AND OTHER CONTACTS WITH HEALTH SERVICES,3,Major,Moderate,Medical,Private Health Insurance,Medicare,,,,false,32856.7,15094.24
Capital/Adirond,Schenectady,4601004,000831,Sunnyview Hospital and Rehabilitation Center,30 to 49,122,M,White,Not Span/Hispanic,5,Elective,Home or Self Care,2018,SYM016,OTHER GENERAL SIGNS AND SYMPTOMS,RHB002,"PHYSICAL, OCCUPATIONAL, AND RESPIRATORY THERAPY TREATMENT",860,REHABILITATION,23,FACTORS INFLUENCING HEALTH STATUS AND OTHER CONTACTS WITH HEALTH SERVICES,1,Minor,Minor,Medical,Medicaid,,,,,false,12706.55,5089.32
Capital/Adirond,Montgomery,2801001,000482,St. Mary's Healthcare - Amsterdam Memorial Campus,70 or Older,,M,White,Not Span/Hispanic,7,Elective,Home or Self Care,2018,INJ043,"FRACTURE OF THE NECK OF THE FEMUR (HIP), SUBSEQUENT ENCOUNTER",RHB002,"PHYSICAL, OCCUPATIONAL, AND RESPIRATORY THERAPY TREATMENT",860,REHABILITATION,23,FACTORS INFLUENCING HEALTH STATUS AND OTHER CONTACTS WITH HEALTH SERVICES,3,Major,Moderate,Medical,Medicare,,,,,false,18669.65,11233.33
Capital/Adirond,Montgomery,2801001,000482,St. Mary's Healthcare - Amsterdam Memorial Campus,50 to 69,120,F,White,Unknown,7,Elective,Home or Self Care,2018,FAC010,OTHER AFTERCARE ENCOUNTER,RHB002,"PHYSICAL, OCCUPATIONAL, AND RESPIRATORY THERAPY TREATMENT",860,REHABILITATION,23,FACTORS INFLUENCING HEALTH STATUS AND OTHER CONTACTS WITH HEALTH SERVICES,2,Moderate,Minor,Medical,Blue Cross/Blue Shield,,,,,false,17975.2,10877.81
Capital/Adirond,Montgomery,2801001,000482,St. Mary's Healthcare - Amsterdam Memorial Campus,70 or Older,120,F,White,Unknown,7,Elective,Skilled Nursing Home,2018,INJ043,"FRACTURE OF THE NECK OF THE FEMUR (HIP), SUBSEQUENT ENCOUNTER",RHB002,"PHYSICAL, OCCUPATIONAL, AND RESPIRATORY THERAPY TREATMENT",860,REHABILITATION,23,FACTORS INFLUENCING HEALTH STATUS AND OTHER CONTACTS WITH HEALTH SERVICES,2,Moderate,Moderate,Medical,Medicare,Private Health Insurance,,,,false,19747.65,11677.53
Capital/Adirond,Montgomery,2801001,000482,St. Mary's Healthcare - Amsterdam Memorial Campus,50 to 69,120,F,White,Not Span/Hispanic,8,Elective,Home or Self Care,2018,FAC010,OTHER AFTERCARE ENCOUNTER,RHB002,"PHYSICAL, OCCUPATIONAL, AND RESPIRATORY THERAPY TREATMENT",860,REHABILITATION,23,FACTORS INFLUENCING HEALTH STATUS AND OTHER CONTACTS WITH HEALTH SERVICES,1,Minor,Minor,Medical,Blue Cross/Blue Shield,,,,,false,20115.6,12520.96
Capital/Adirond,Montgomery,2801001,000482,St. Mary's Healthcare - Amsterdam Memorial Campus,30 to 49,120,F,White,Not Span/Hispanic,10,Elective,Home w/ Home Health Services,2018,INJ040,"FRACTURE OF TORSO, SUBSEQUENT ENCOUNTER",RHB002,"PHYSICAL, OCCUPATIONAL, AND RESPIRATORY THERAPY TREATMENT",860,REHABILITATION,23,FACTORS INFLUENCING HEALTH STATUS AND OTHER CONTACTS WITH HEALTH SERVICES,1,Minor,Minor,Medical,Blue Cross/Blue Shield,,,,,false,26124.4,16003.07
Capital/Adirond,Montgomery,2801001,000482,St. Mary's Healthcare - Amsterdam Memorial Campus,50 to 69,120,F,White,Not Span/Hispanic,7,Urgent,Home or Self Care,2018,FAC010,OTHER AFTERCARE ENCOUNTER,RHB002,"PHYSICAL, OCCUPATIONAL, AND RESPIRATORY THERAPY TREATMENT",860,REHABILITATION,23,FACTORS INFLUENCING HEALTH STATUS AND OTHER CONTACTS WITH HEALTH SERVICES,1,Minor,Minor,Medical,Medicare,,,,,false,17453.4,10561.64
Capital/Adirond,Montgomery,2801001,000482,St. Mary's Healthcare - Amsterdam Memorial Campus,50 to 69,133,M,White,Not Span/Hispanic,7,Urgent,Home or Self Care,2018,FAC010,OTHER AFTERCARE ENCOUNTER,RHB002,"PHYSICAL, OCCUPATIONAL, AND RESPIRATORY THERAPY TREATMENT",860,REHABILITATION,23,FACTORS INFLUENCING HEALTH STATUS AND OTHER CONTACTS WITH HEALTH SERVICES,1,Minor,Minor,Medical,Private Health Insurance,,,,,false,17603.7,10895.99
New York City,Kings,7001033,001315,Kingsbrook Jewish Medical Center,50 to 69,112,F,Black/African American,Not Span/Hispanic,18,Urgent,Home w/ Home Health Services,2018,SYM007,MALAISE AND FATIGUE,RHB002,"PHYSICAL, OCCUPATIONAL, AND RESPIRATORY THERAPY TREATMENT",860,REHABILITATION,23,FACTORS INFLUENCING HEALTH STATUS AND OTHER CONTACTS WITH HEALTH SERVICES,3,Major,Major,Medical,Medicaid,Self-Pay,,,,false,87132,27539.44
Capital/Adirond,Schenectady,4601004,000831,Sunnyview Hospital and Rehabilitation Center,50 to 69,122,F,Black/African American,Not Span/Hispanic,6,Elective,Home or Self Care,2018,SYM016,OTHER GENERAL SIGNS AND SYMPTOMS,RHB002,"PHYSICAL, OCCUPATIONAL, AND RESPIRATORY THERAPY TREATMENT",860,REHABILITATION,23,FACTORS INFLUENCING HEALTH STATUS AND OTHER CONTACTS WITH HEALTH SERVICES,2,Moderate,Minor,Medical,Medicaid,,,,,false,16929.4,8040.48
Capital/Adirond,Schenectady,4601004,000831,Sunnyview Hospital and Rehabilitation Center,70 or Older,121,M,White,Not Span/Hispanic,11,Elective,Home or Self Care,2018,SYM016,OTHER GENERAL SIGNS AND SYMPTOMS,RHB002,"PHYSICAL, OCCUPATIONAL, AND RESPIRATORY THERAPY TREATMENT",860,REHABILITATION,23,FACTORS INFLUENCING HEALTH STATUS AND OTHER CONTACTS WITH HEALTH SERVICES,2,Moderate,Minor,Medical,Medicare,Medicaid,,,,false,25179.44,10491.25
Central NY,Onondaga,3301007,000635,University Hospital SUNY Health Science Center,70 or Older,132,F,White,Not Span/Hispanic,27,Elective,Short-term Hospital,2018,INJ046,"SPINAL CORD INJURY (SCI), SUBSEQUENT ENCOUNTER",RHB002,"PHYSICAL, OCCUPATIONAL, AND RESPIRATORY THERAPY TREATMENT",860,REHABILITATION,23,FACTORS INFLUENCING HEALTH STATUS AND OTHER CONTACTS WITH HEALTH SERVICES,3,Major,Moderate,Medical,Medicare,Private Health Insurance,,,,false,185590,51419.97
Central NY,Onondaga,3301007,000635,University Hospital SUNY Health Science Center,50 to 69,132,F,White,Not Span/Hispanic,8,Elective,Home w/ Home Health Services,2018,FAC010,OTHER AFTERCARE ENCOUNTER,RHB002,"PHYSICAL, OCCUPATIONAL, AND RESPIRATORY THERAPY TREATMENT",860,REHABILITATION,23,FACTORS INFLUENCING HEALTH STATUS AND OTHER CONTACTS WITH HEALTH SERVICES,3,Major,Moderate,Medical,Medicare,Private Health Insurance,,,,false,53340.6,14626.26
Central NY,Onondaga,3301007,000635,University Hospital SUNY Health Science Center,50 to 69,135,F,White,Not Span/Hispanic,9,Elective,Home w/ Home Health Services,2018,INJ072,"COMPLICATION OF OTHER SURGICAL OR MEDICAL CARE, INJURY, SUBSEQUENT ENCOUNTER",RHB002,"PHYSICAL, OCCUPATIONAL, AND RESPIRATORY THERAPY TREATMENT",860,REHABILITATION,23,FACTORS INFLUENCING HEALTH STATUS AND OTHER CONTACTS WITH HEALTH SERVICES,3,Major,Minor,Medical,Medicare,,,,,false,59833.3,15316.34
Western NY,Erie,1401005,000210,Erie County Medical Center,70 or Older,142,F,White,Not Span/Hispanic,54,Elective,Short-term Hospital,2018,INJ040,"FRACTURE OF TORSO, SUBSEQUENT ENCOUNTER",RHB002,"PHYSICAL, OCCUPATIONAL, AND RESPIRATORY THERAPY TREATMENT",860,REHABILITATION,23,FACTORS INFLUENCING HEALTH STATUS AND OTHER CONTACTS WITH HEALTH SERVICES,3,Major,Extreme,Medical,Medicare,Blue Cross/Blue Shield,,,,false,175099.36,75265.93
Capital/Adirond,Schenectady,4601004,000831,Sunnyview Hospital and Rehabilitation Center,70 or Older,123,F,White,Not Span/Hispanic,7,Elective,Home or Self Care,2018,SYM016,OTHER GENERAL SIGNS AND SYMPTOMS,RHB002,"PHYSICAL, OCCUPATIONAL, AND RESPIRATORY THERAPY TREATMENT",860,REHABILITATION,23,FACTORS INFLUENCING HEALTH STATUS AND OTHER CONTACTS WITH HEALTH SERVICES,2,Moderate,Moderate,Medical,Medicare,Federal/State/Local/VA,,,,false,16783.5,7026.02
Long Island,Suffolk,5149001,000896,St. Charles Hospital,30 to 49,117,M,White,Not Span/Hispanic,6,Elective,Home or Self Care,2018,FAC010,OTHER AFTERCARE ENCOUNTER,RHB001,"PHYSICAL, OCCUPATIONAL, AND RESPIRATORY THERAPY EVALUATION",860,REHABILITATION,23,FACTORS INFLUENCING HEALTH STATUS AND OTHER CONTACTS WITH HEALTH SERVICES,2,Moderate,Minor,Medical,Private Health Insurance,,,,,false,36351,7544.73
Central NY,Onondaga,3301007,000635,University Hospital SUNY Health Science Center,50 to 69,130,F,White,Not Span/Hispanic,34,Elective,Skilled Nursing Home,2018,INJ071,"COMPLICATION OF INTERNAL ORTHOPEDIC DEVICE OR IMPLANT, SUBSEQUENT ENCOUNTER",RHB002,"PHYSICAL, OCCUPATIONAL, AND RESPIRATORY THERAPY TREATMENT",860,REHABILITATION,23,FACTORS INFLUENCING HEALTH STATUS AND OTHER CONTACTS WITH HEALTH SERVICES,3,Major,Moderate,Medical,Private Health Insurance,,,,,false,270457.2,71223.39
Hudson Valley,Westchester,5957001,001139,Westchester Medical Center,30 to 49,109,M,White,Not Span/Hispanic,14,Urgent,Home or Self Care,2018,INJ046,"SPINAL CORD INJURY (SCI), SUBSEQUENT ENCOUNTER",RHB002,"PHYSICAL, OCCUPATIONAL, AND RESPIRATORY THERAPY TREATMENT",860,REHABILITATION,23,FACTORS INFLUENCING HEALTH STATUS AND OTHER CONTACTS WITH HEALTH SERVICES,1,Minor,Minor,Medical,Miscellaneous/Other,Private Health Insurance,,,,false,137591.79,24405.76
New York City,Bronx,7000002,001165,Jacobi Medical Center,30 to 49,104,F,Other Race,Unknown,33,Elective,Skilled Nursing Home,2018,SYM007,MALAISE AND FATIGUE,RHB002,"PHYSICAL, OCCUPATIONAL, AND RESPIRATORY THERAPY TREATMENT",860,REHABILITATION,23,FACTORS INFLUENCING HEALTH STATUS AND OTHER CONTACTS WITH HEALTH SERVICES,3,Major,Major,Medical,Medicaid,Medicaid,,,,false,54791.71,32417.52
Capital/Adirond,Albany,0101000,000001,Albany Medical Center Hospital,50 to 69,122,F,Black/African American,Not Span/Hispanic,13,Elective,Home w/ Home Health Services,2018,FAC010,OTHER AFTERCARE ENCOUNTER,RHB002,"PHYSICAL, OCCUPATIONAL, AND RESPIRATORY THERAPY TREATMENT",860,REHABILITATION,23,FACTORS INFLUENCING HEALTH STATUS AND OTHER CONTACTS WITH HEALTH SERVICES,3,Major,Major,Medical,Medicaid,,,,,false,89370.74,23231.86
Hudson Valley,Westchester,5932000,001129,Phelps Hospital,70 or Older,105,M,White,Not Span/Hispanic,10,Elective,Home w/ Home Health Services,2018,INJ045,"TRAUMATIC BRAIN INJURY (TBI); CONCUSSION, SUBSEQUENT ENCOUNTER",RHB002,"PHYSICAL, OCCUPATIONAL, AND RESPIRATORY THERAPY TREATMENT",860,REHABILITATION,23,FACTORS INFLUENCING HEALTH STATUS AND OTHER CONTACTS WITH HEALTH SERVICES,2,Moderate,Minor,Medical,Medicare,Private Health Insurance,,,,false,53998.7,14995.19
Capital/Adirond,Schenectady,4601004,000831,Sunnyview Hospital and Rehabilitation Center,70 or Older,121,M,White,Not Span/Hispanic,9,Elective,Home w/ Home Health Services,2018,SYM016,OTHER GENERAL SIGNS AND SYMPTOMS,RHB002,"PHYSICAL, OCCUPATIONAL, AND RESPIRATORY THERAPY TREATMENT",860,REHABILITATION,23,FACTORS INFLUENCING HEALTH STATUS AND OTHER CONTACTS WITH HEALTH SERVICES,2,Moderate,Moderate,Medical,Medicare,Blue Cross/Blue Shield,Private Health Insurance,,,false,19239.8,8017.26