Hospital Service Area,Hospital County,Operating Certificate Number,Permanent Facility Id,Facility Name,Age Group,Zip Code - 3 digits,Gender,Race,Ethnicity,Length of Stay,Type of Admission,Patient Disposition,Discharge Year,CCS Diagnosis Code,CCS Diagnosis Description,CCS Procedure Code,CCS Procedure Description,APR DRG Code,APR DRG Description,APR MDC Code,APR MDC Description,APR Severity of Illness Code,APR Severity of Illness Description,APR Risk of Mortality,APR Medical Surgical Description,Payment Typology 1,Payment Typology 2,Payment Typology 3,Birth Weight,Abortion Edit Indicator,Emergency Department Indicator,Total Charges,Total Costs
New York City,Manhattan,7002024,001456,Mount Sinai Hospital,30 to 49,104,M,Other Race,Not Span/Hispanic,9,Urgent,Home or Self Care,2020,NVS008,PARALYSIS (OTHER THAN CEREBRAL PALSY),RHB002,"PHYSICAL, OCCUPATIONAL, AND RESPIRATORY THERAPY TREATMENT",860,REHABILITATION,23,FACTORS INFLUENCING HEALTH STATUS AND OTHER CONTACTS WITH HEALTH SERVICES,2,Moderate,Minor,Medical,Blue Cross/Blue Shield,Private Health Insurance,Self-Pay,,,N,71048.96,14815.82
New York City,Bronx,7000006,001168,Montefiore Medical Center-Wakefield Hospital,50 to 69,,F,White,Spanish/Hispanic,12,Elective,Home or Self Care,2020,FAC010,OTHER AFTERCARE ENCOUNTER,RHB002,"PHYSICAL, OCCUPATIONAL, AND RESPIRATORY THERAPY TREATMENT",860,REHABILITATION,23,FACTORS INFLUENCING HEALTH STATUS AND OTHER CONTACTS WITH HEALTH SERVICES,2,Moderate,Minor,Medical,Private Health Insurance,,,,,N,113026.9,39299.12
New York City,Manhattan,7002024,001456,Mount Sinai Hospital,50 to 69,100,F,Other Race,Spanish/Hispanic,15,Elective,Home w/ Home Health Services,2020,CIR025,SEQUELA OF CEREBRAL INFARCTION AND OTHER CEREBROVASCULAR DISEASE,RHB002,"PHYSICAL, OCCUPATIONAL, AND RESPIRATORY THERAPY TREATMENT",860,REHABILITATION,23,FACTORS INFLUENCING HEALTH STATUS AND OTHER CONTACTS WITH HEALTH SERVICES,2,Moderate,Minor,Medical,Medicaid,Medicaid,Self-Pay,,,N,114917.34,22956.67
New York City,Manhattan,7002024,001456,Mount Sinai Hospital,50 to 69,117,F,White,Not Span/Hispanic,21,Elective,Home w/ Home Health Services,2020,NVS008,PARALYSIS (OTHER THAN CEREBRAL PALSY),CAR028,INFERIOR VENA CAVA (IVC) FILTER PROCEDURES,860,REHABILITATION,23,FACTORS INFLUENCING HEALTH STATUS AND OTHER CONTACTS WITH HEALTH SERVICES,3,Major,Major,Medical,Private Health Insurance,Self-Pay,,,,N,218941.67,43897.19
New York City,Manhattan,7002024,001456,Mount Sinai Hospital,30 to 49,111,M,White,Not Span/Hispanic,32,Elective,Short-term Hospital,2020,SYM007,MALAISE AND FATIGUE,RHB002,"PHYSICAL, OCCUPATIONAL, AND RESPIRATORY THERAPY TREATMENT",860,REHABILITATION,23,FACTORS INFLUENCING HEALTH STATUS AND OTHER CONTACTS WITH HEALTH SERVICES,3,Major,Moderate,Medical,Medicaid,Medicaid,Self-Pay,,,N,276926.1,55014.73
New York City,Bronx,7000006,001168,Montefiore Medical Center-Wakefield Hospital,70 or Older,104,M,White,Not Span/Hispanic,23,Elective,Home w/ Home Health Services,2020,CIR025,SEQUELA OF CEREBRAL INFARCTION AND OTHER CEREBROVASCULAR DISEASE,RHB002,"PHYSICAL, OCCUPATIONAL, AND RESPIRATORY THERAPY TREATMENT",860,REHABILITATION,23,FACTORS INFLUENCING HEALTH STATUS AND OTHER CONTACTS WITH HEALTH SERVICES,2,Moderate,Moderate,Medical,Medicaid,,,,,N,208282.28,72812.74
New York City,Bronx,7000006,001168,Montefiore Medical Center-Wakefield Hospital,50 to 69,104,F,Other Race,Spanish/Hispanic,23,Elective,Home w/ Home Health Services,2020,FAC010,OTHER AFTERCARE ENCOUNTER,RHB002,"PHYSICAL, OCCUPATIONAL, AND RESPIRATORY THERAPY TREATMENT",860,REHABILITATION,23,FACTORS INFLUENCING HEALTH STATUS AND OTHER CONTACTS WITH HEALTH SERVICES,3,Major,Minor,Medical,Blue Cross/Blue Shield,,,,,N,285295.8,83042.88
New York City,Bronx,7000006,001168,Montefiore Medical Center-Wakefield Hospital,50 to 69,104,M,Other Race,Not Span/Hispanic,15,Elective,Home w/ Home Health Services,2020,CIR025,SEQUELA OF CEREBRAL INFARCTION AND OTHER CEREBROVASCULAR DISEASE,RHB002,"PHYSICAL, OCCUPATIONAL, AND RESPIRATORY THERAPY TREATMENT",860,REHABILITATION,23,FACTORS INFLUENCING HEALTH STATUS AND OTHER CONTACTS WITH HEALTH SERVICES,2,Moderate,Minor,Medical,Medicaid,,,,,N,140090.37,45134.46
New York City,Bronx,7000006,001168,Montefiore Medical Center-Wakefield Hospital,50 to 69,107,M,Other Race,Spanish/Hispanic,15,Elective,Skilled Nursing Home,2020,INJ042,"FRACTURE OF LOWER LIMB (EXCEPT HIP), SUBSEQUENT ENCOUNTER",RHB002,"PHYSICAL, OCCUPATIONAL, AND RESPIRATORY THERAPY TREATMENT",860,REHABILITATION,23,FACTORS INFLUENCING HEALTH STATUS AND OTHER CONTACTS WITH HEALTH SERVICES,2,Moderate,Moderate,Medical,Private Health Insurance,,,,,N,139780.56,49039.79
New York City,Manhattan,7002024,001456,Mount Sinai Hospital,50 to 69,112,M,White,Not Span/Hispanic,13,Urgent,Home w/ Home Health Services,2020,CIR025,SEQUELA OF CEREBRAL INFARCTION AND OTHER CEREBROVASCULAR DISEASE,RHB002,"PHYSICAL, OCCUPATIONAL, AND RESPIRATORY THERAPY TREATMENT",860,REHABILITATION,23,FACTORS INFLUENCING HEALTH STATUS AND OTHER CONTACTS WITH HEALTH SERVICES,2,Moderate,Moderate,Medical,Private Health Insurance,Self-Pay,,,,N,102898.55,21192.05
New York City,Manhattan,7002024,001456,Mount Sinai Hospital,50 to 69,112,F,Other Race,Spanish/Hispanic,31,Urgent,Home w/ Home Health Services,2020,NVS008,PARALYSIS (OTHER THAN CEREBRAL PALSY),RHB002,"PHYSICAL, OCCUPATIONAL, AND RESPIRATORY THERAPY TREATMENT",860,REHABILITATION,23,FACTORS INFLUENCING HEALTH STATUS AND OTHER CONTACTS WITH HEALTH SERVICES,3,Major,Moderate,Medical,Medicaid,Self-Pay,,,,N,250328.29,49594.92
New York City,Manhattan,7002024,001456,Mount Sinai Hospital,70 or Older,100,M,White,Not Span/Hispanic,14,Elective,Short-term Hospital,2020,NVS008,PARALYSIS (OTHER THAN CEREBRAL PALSY),RHB002,"PHYSICAL, OCCUPATIONAL, AND RESPIRATORY THERAPY TREATMENT",860,REHABILITATION,23,FACTORS INFLUENCING HEALTH STATUS AND OTHER CONTACTS WITH HEALTH SERVICES,2,Moderate,Moderate,Medical,Medicare,Private Health Insurance,Self-Pay,,,N,108330.07,22734.24
New York City,Manhattan,7002024,001456,Mount Sinai Hospital,50 to 69,111,M,Black/African American,Spanish/Hispanic,39,Elective,Skilled Nursing Home,2020,NVS008,PARALYSIS (OTHER THAN CEREBRAL PALSY),RHB002,"PHYSICAL, OCCUPATIONAL, AND RESPIRATORY THERAPY TREATMENT",860,REHABILITATION,23,FACTORS INFLUENCING HEALTH STATUS AND OTHER CONTACTS WITH HEALTH SERVICES,3,Major,Minor,Medical,Medicare,Medicare,Medicaid,,,N,308788.07,63056.38
New York City,Manhattan,7002032,001469,Mount Sinai Morningside,70 or Older,100,F,White,Not Span/Hispanic,21,Elective,Skilled Nursing Home,2020,FAC010,OTHER AFTERCARE ENCOUNTER,RHB002,"PHYSICAL, OCCUPATIONAL, AND RESPIRATORY THERAPY TREATMENT",860,REHABILITATION,23,FACTORS INFLUENCING HEALTH STATUS AND OTHER CONTACTS WITH HEALTH SERVICES,2,Moderate,Minor,Medical,Medicare,Private Health Insurance,Self-Pay,,,N,162587.3,56251.88
New York City,Manhattan,7002032,001469,Mount Sinai Morningside,70 or Older,100,F,Other Race,Spanish/Hispanic,9,Elective,Home w/ Home Health Services,2020,CIR025,SEQUELA OF CEREBRAL INFARCTION AND OTHER CEREBROVASCULAR DISEASE,RHB002,"PHYSICAL, OCCUPATIONAL, AND RESPIRATORY THERAPY TREATMENT",860,REHABILITATION,23,FACTORS INFLUENCING HEALTH STATUS AND OTHER CONTACTS WITH HEALTH SERVICES,2,Moderate,Moderate,Medical,Medicare,Medicare,Medicaid,,,N,72427.66,24834.62
New York City,Manhattan,7002032,001469,Mount Sinai Morningside,70 or Older,100,M,White,Not Span/Hispanic,15,Elective,Skilled Nursing Home,2020,NVS008,PARALYSIS (OTHER THAN CEREBRAL PALSY),RHB002,"PHYSICAL, OCCUPATIONAL, AND RESPIRATORY THERAPY TREATMENT",860,REHABILITATION,23,FACTORS INFLUENCING HEALTH STATUS AND OTHER CONTACTS WITH HEALTH SERVICES,3,Major,Moderate,Medical,Medicare,Private Health Insurance,Self-Pay,,,N,120266.12,40757.15
New York City,Manhattan,7002032,001469,Mount Sinai Morningside,70 or Older,100,F,White,Not Span/Hispanic,13,Elective,Home w/ Home Health Services,2020,INJ040,"FRACTURE OF TORSO, SUBSEQUENT ENCOUNTER",RHB002,"PHYSICAL, OCCUPATIONAL, AND RESPIRATORY THERAPY TREATMENT",860,REHABILITATION,23,FACTORS INFLUENCING HEALTH STATUS AND OTHER CONTACTS WITH HEALTH SERVICES,2,Moderate,Minor,Medical,Medicare,Blue Cross/Blue Shield,Self-Pay,,,N,99605.35,34642.75
New York City,Manhattan,7002032,001469,Mount Sinai Morningside,50 to 69,100,F,Black/African American,Not Span/Hispanic,10,Elective,Skilled Nursing Home,2020,INJ043,"FRACTURE OF THE NECK OF THE FEMUR (HIP), SUBSEQUENT ENCOUNTER",RHB002,"PHYSICAL, OCCUPATIONAL, AND RESPIRATORY THERAPY TREATMENT",860,REHABILITATION,23,FACTORS INFLUENCING HEALTH STATUS AND OTHER CONTACTS WITH HEALTH SERVICES,3,Major,Minor,Medical,Medicare,Medicaid,Self-Pay,,,N,76144.91,26208.48
New York City,Manhattan,7002032,001469,Mount Sinai Morningside,70 or Older,100,M,White,Not Span/Hispanic,33,Elective,Home w/ Home Health Services,2020,FAC010,OTHER AFTERCARE ENCOUNTER,RHB001,"PHYSICAL, OCCUPATIONAL, AND RESPIRATORY THERAPY EVALUATION",860,REHABILITATION,23,FACTORS INFLUENCING HEALTH STATUS AND OTHER CONTACTS WITH HEALTH SERVICES,2,Moderate,Minor,Medical,Medicare,Private Health Insurance,Self-Pay,,,N,250828.78,87446.37
New York City,Bronx,7000006,001168,Montefiore Medical Center-Wakefield Hospital,50 to 69,104,F,Black/African American,Not Span/Hispanic,14,Elective,Home w/ Home Health Services,2020,CIR025,SEQUELA OF CEREBRAL INFARCTION AND OTHER CEREBROVASCULAR DISEASE,RHB002,"PHYSICAL, OCCUPATIONAL, AND RESPIRATORY THERAPY TREATMENT",860,REHABILITATION,23,FACTORS INFLUENCING HEALTH STATUS AND OTHER CONTACTS WITH HEALTH SERVICES,3,Major,Moderate,Medical,Private Health Insurance,,,,,N,128888.88,44524.08
New York City,Manhattan,7002032,001466,Mount Sinai West,70 or Older,100,F,Other Race,Not Span/Hispanic,18,Elective,Home w/ Home Health Services,2020,INJ043,"FRACTURE OF THE NECK OF THE FEMUR (HIP), SUBSEQUENT ENCOUNTER",RHB002,"PHYSICAL, OCCUPATIONAL, AND RESPIRATORY THERAPY TREATMENT",860,REHABILITATION,23,FACTORS INFLUENCING HEALTH STATUS AND OTHER CONTACTS WITH HEALTH SERVICES,1,Minor,Minor,Medical,Medicare,Private Health Insurance,Self-Pay,,,N,142508.65,49626.74
New York City,Manhattan,7002032,001466,Mount Sinai West,70 or Older,100,M,Other Race,Spanish/Hispanic,2,Elective,Short-term Hospital,2020,INJ045,"TRAUMATIC BRAIN INJURY (TBI); CONCUSSION, SUBSEQUENT ENCOUNTER",RHB002,"PHYSICAL, OCCUPATIONAL, AND RESPIRATORY THERAPY TREATMENT",860,REHABILITATION,23,FACTORS INFLUENCING HEALTH STATUS AND OTHER CONTACTS WITH HEALTH SERVICES,2,Moderate,Major,Medical,Medicare,Medicare,Self-Pay,,,N,28616.73,7907.02
New York City,Manhattan,7002032,001466,Mount Sinai West,70 or Older,117,F,Other Race,Not Span/Hispanic,12,Elective,Skilled Nursing Home,2020,INJ043,"FRACTURE OF THE NECK OF THE FEMUR (HIP), SUBSEQUENT ENCOUNTER",RHB002,"PHYSICAL, OCCUPATIONAL, AND RESPIRATORY THERAPY TREATMENT",860,REHABILITATION,23,FACTORS INFLUENCING HEALTH STATUS AND OTHER CONTACTS WITH HEALTH SERVICES,1,Minor,Minor,Medical,Medicare,Private Health Insurance,Self-Pay,,,N,97416.59,33868.1
New York City,Manhattan,7002032,001466,Mount Sinai West,50 to 69,100,F,White,Not Span/Hispanic,14,Elective,Skilled Nursing Home,2020,NVS008,PARALYSIS (OTHER THAN CEREBRAL PALSY),RHB002,"PHYSICAL, OCCUPATIONAL, AND RESPIRATORY THERAPY TREATMENT",860,REHABILITATION,23,FACTORS INFLUENCING HEALTH STATUS AND OTHER CONTACTS WITH HEALTH SERVICES,3,Major,Moderate,Medical,Medicare,Self-Pay,,,,N,115472.29,39399.06
New York City,Manhattan,7002032,001466,Mount Sinai West,50 to 69,OOS,M,White,Not Span/Hispanic,5,Elective,Home or Self Care,2020,INJ043,"FRACTURE OF THE NECK OF THE FEMUR (HIP), SUBSEQUENT ENCOUNTER",RHB002,"PHYSICAL, OCCUPATIONAL, AND RESPIRATORY THERAPY TREATMENT",860,REHABILITATION,23,FACTORS INFLUENCING HEALTH STATUS AND OTHER CONTACTS WITH HEALTH SERVICES,1,Minor,Minor,Medical,Medicare,Blue Cross/Blue Shield,Self-Pay,,,N,40694.35,14211.54
New York City,Manhattan,7002032,001466,Mount Sinai West,70 or Older,,F,White,Unknown,20,Elective,Home w/ Home Health Services,2020,FAC010,OTHER AFTERCARE ENCOUNTER,RHB002,"PHYSICAL, OCCUPATIONAL, AND RESPIRATORY THERAPY TREATMENT",860,REHABILITATION,23,FACTORS INFLUENCING HEALTH STATUS AND OTHER CONTACTS WITH HEALTH SERVICES,3,Major,Moderate,Medical,Medicare,Blue Cross/Blue Shield,Self-Pay,,,N,157831.33,55119.14
New York City,Manhattan,7002032,001466,Mount Sinai West,50 to 69,104,F,Black/African American,Spanish/Hispanic,7,Elective,Short-term Hospital,2020,FAC010,OTHER AFTERCARE ENCOUNTER,RHB002,"PHYSICAL, OCCUPATIONAL, AND RESPIRATORY THERAPY TREATMENT",860,REHABILITATION,23,FACTORS INFLUENCING HEALTH STATUS AND OTHER CONTACTS WITH HEALTH SERVICES,3,Major,Major,Medical,Medicare,Medicaid,Self-Pay,,,N,72314.25,24467.42
New York City,Bronx,7000006,001168,Montefiore Medical Center-Wakefield Hospital,50 to 69,100,F,Other Race,Unknown,12,Elective,Home w/ Home Health Services,2020,FAC010,OTHER AFTERCARE ENCOUNTER,RHB002,"PHYSICAL, OCCUPATIONAL, AND RESPIRATORY THERAPY TREATMENT",860,REHABILITATION,23,FACTORS INFLUENCING HEALTH STATUS AND OTHER CONTACTS WITH HEALTH SERVICES,1,Minor,Minor,Medical,Blue Cross/Blue Shield,,,,,N,104925.47,38054
New York City,Manhattan,7002024,001456,Mount Sinai Hospital,50 to 69,100,M,Other Race,Spanish/Hispanic,35,Urgent,Skilled Nursing Home,2020,SYM007,MALAISE AND FATIGUE,RHB002,"PHYSICAL, OCCUPATIONAL, AND RESPIRATORY THERAPY TREATMENT",860,REHABILITATION,23,FACTORS INFLUENCING HEALTH STATUS AND OTHER CONTACTS WITH HEALTH SERVICES,3,Major,Minor,Medical,Medicare,Self-Pay,,,,N,274685.73,56627.35
New York City,Manhattan,7002024,001456,Mount Sinai Hospital,30 to 49,104,F,Other Race,Spanish/Hispanic,16,Urgent,Home w/ Home Health Services,2020,CIR022,SEQUELA OF HEMORRHAGIC CEREBROVASCULAR DISEASE,RHB002,"PHYSICAL, OCCUPATIONAL, AND RESPIRATORY THERAPY TREATMENT",860,REHABILITATION,23,FACTORS INFLUENCING HEALTH STATUS AND OTHER CONTACTS WITH HEALTH SERVICES,3,Major,Major,Medical,Medicare,Medicaid,Self-Pay,,,N,131094.01,27380.52
New York City,Manhattan,7002024,001456,Mount Sinai Hospital,50 to 69,100,M,Black/African American,Not Span/Hispanic,37,Urgent,Home w/ Home Health Services,2020,CIR025,SEQUELA OF CEREBRAL INFARCTION AND OTHER CEREBROVASCULAR DISEASE,RHB002,"PHYSICAL, OCCUPATIONAL, AND RESPIRATORY THERAPY TREATMENT",860,REHABILITATION,23,FACTORS INFLUENCING HEALTH STATUS AND OTHER CONTACTS WITH HEALTH SERVICES,2,Moderate,Moderate,Medical,Medicaid,Self-Pay,,,,N,284185.67,58116.78
New York City,Manhattan,7002024,001456,Mount Sinai Hospital,50 to 69,104,M,Other Race,Spanish/Hispanic,3,Elective,Short-term Hospital,2020,NVS008,PARALYSIS (OTHER THAN CEREBRAL PALSY),RHB002,"PHYSICAL, OCCUPATIONAL, AND RESPIRATORY THERAPY TREATMENT",860,REHABILITATION,23,FACTORS INFLUENCING HEALTH STATUS AND OTHER CONTACTS WITH HEALTH SERVICES,3,Major,Major,Medical,Medicare,Medicaid,Self-Pay,,,N,32123.61,6784.9
New York City,Manhattan,7002024,001456,Mount Sinai Hospital,50 to 69,105,F,Black/African American,Not Span/Hispanic,29,Elective,Home or Self Care,2020,SYM007,MALAISE AND FATIGUE,RHB002,"PHYSICAL, OCCUPATIONAL, AND RESPIRATORY THERAPY TREATMENT",860,REHABILITATION,23,FACTORS INFLUENCING HEALTH STATUS AND OTHER CONTACTS WITH HEALTH SERVICES,2,Moderate,Minor,Medical,Medicaid,Medicaid,Self-Pay,,,N,227161.81,45689.17
New York City,Manhattan,7002024,001456,Mount Sinai Hospital,70 or Older,100,M,White,Not Span/Hispanic,17,Elective,Home or Self Care,2020,CIR025,SEQUELA OF CEREBRAL INFARCTION AND OTHER CEREBROVASCULAR DISEASE,RHB002,"PHYSICAL, OCCUPATIONAL, AND RESPIRATORY THERAPY TREATMENT",860,REHABILITATION,23,FACTORS INFLUENCING HEALTH STATUS AND OTHER CONTACTS WITH HEALTH SERVICES,2,Moderate,Minor,Medical,Medicare,Private Health Insurance,Self-Pay,,,N,130707.55,26219.29
New York City,Manhattan,7002054,001464,New York-Presbyterian Hospital - Columbia Presbyterian Center,70 or Older,OOS,M,Other Race,Not Span/Hispanic,10,Elective,Home or Self Care,2020,SYM007,MALAISE AND FATIGUE,RHB002,"PHYSICAL, OCCUPATIONAL, AND RESPIRATORY THERAPY TREATMENT",860,REHABILITATION,23,FACTORS INFLUENCING HEALTH STATUS AND OTHER CONTACTS WITH HEALTH SERVICES,3,Major,Major,Medical,Medicare,Medicare,Self-Pay,,,N,121896.8,34417.15
New York City,Manhattan,7002024,001456,Mount Sinai Hospital,50 to 69,OOS,M,White,Not Span/Hispanic,10,Urgent,Short-term Hospital,2020,INJ045,"TRAUMATIC BRAIN INJURY (TBI); CONCUSSION, SUBSEQUENT ENCOUNTER",RHB002,"PHYSICAL, OCCUPATIONAL, AND RESPIRATORY THERAPY TREATMENT",860,REHABILITATION,23,FACTORS INFLUENCING HEALTH STATUS AND OTHER CONTACTS WITH HEALTH SERVICES,3,Major,Moderate,Medical,Private Health Insurance,Self-Pay,,,,N,93922.63,18046.18
New York City,Manhattan,7002024,001456,Mount Sinai Hospital,50 to 69,100,M,Black/African American,Not Span/Hispanic,14,Urgent,Home or Self Care,2020,NVS008,PARALYSIS (OTHER THAN CEREBRAL PALSY),RHB002,"PHYSICAL, OCCUPATIONAL, AND RESPIRATORY THERAPY TREATMENT",860,REHABILITATION,23,FACTORS INFLUENCING HEALTH STATUS AND OTHER CONTACTS WITH HEALTH SERVICES,1,Minor,Minor,Medical,Medicaid,Medicaid,Self-Pay,,,N,113700.43,23410
New York City,Manhattan,7002024,001456,Mount Sinai Hospital,50 to 69,OOS,M,Other Race,Not Span/Hispanic,7,Urgent,Home or Self Care,2020,NVS008,PARALYSIS (OTHER THAN CEREBRAL PALSY),RHB002,"PHYSICAL, OCCUPATIONAL, AND RESPIRATORY THERAPY TREATMENT",860,REHABILITATION,23,FACTORS INFLUENCING HEALTH STATUS AND OTHER CONTACTS WITH HEALTH SERVICES,2,Moderate,Minor,Medical,Blue Cross/Blue Shield,Self-Pay,,,,N,55046.67,11639.59
New York City,Manhattan,7002024,001456,Mount Sinai Hospital,70 or Older,112,F,Black/African American,Not Span/Hispanic,24,Urgent,Home w/ Home Health Services,2020,SYM007,MALAISE AND FATIGUE,RHB002,"PHYSICAL, OCCUPATIONAL, AND RESPIRATORY THERAPY TREATMENT",860,REHABILITATION,23,FACTORS INFLUENCING HEALTH STATUS AND OTHER CONTACTS WITH HEALTH SERVICES,3,Major,Minor,Medical,Medicare,Medicare,Self-Pay,,,N,182891.8,37693.86
New York City,Manhattan,7002024,001456,Mount Sinai Hospital,50 to 69,113,F,Black/African American,Not Span/Hispanic,49,Urgent,Skilled Nursing Home,2020,NVS008,PARALYSIS (OTHER THAN CEREBRAL PALSY),RHB002,"PHYSICAL, OCCUPATIONAL, AND RESPIRATORY THERAPY TREATMENT",860,REHABILITATION,23,FACTORS INFLUENCING HEALTH STATUS AND OTHER CONTACTS WITH HEALTH SERVICES,4,Extreme,Major,Medical,Private Health Insurance,Self-Pay,,,,N,413872.66,87015.63
New York City,Manhattan,7002024,001456,Mount Sinai Hospital,50 to 69,114,F,Black/African American,Not Span/Hispanic,20,Elective,Home w/ Home Health Services,2020,NVS008,PARALYSIS (OTHER THAN CEREBRAL PALSY),RHB002,"PHYSICAL, OCCUPATIONAL, AND RESPIRATORY THERAPY TREATMENT",860,REHABILITATION,23,FACTORS INFLUENCING HEALTH STATUS AND OTHER CONTACTS WITH HEALTH SERVICES,3,Major,Major,Medical,Blue Cross/Blue Shield,Self-Pay,,,,N,157298.44,31894.35
New York City,Manhattan,7002053,001463,NYU Langone Hospitals,50 to 69,104,M,White,Not Span/Hispanic,13,Elective,Home w/ Home Health Services,2020,FAC010,OTHER AFTERCARE ENCOUNTER,RHB002,"PHYSICAL, OCCUPATIONAL, AND RESPIRATORY THERAPY TREATMENT",860,REHABILITATION,23,FACTORS INFLUENCING HEALTH STATUS AND OTHER CONTACTS WITH HEALTH SERVICES,3,Major,Minor,Medical,Medicare,Medicare,,,,N,132414.26,40513.67
New York City,Manhattan,7002053,001463,NYU Langone Hospitals,50 to 69,111,M,White,Not Span/Hispanic,14,Elective,Home w/ Home Health Services,2020,INJ069,"COMPLICATION OF CARDIOVASCULAR DEVICE, IMPLANT OR GRAFT, SUBSEQUENT ENCOUNTER",RHB002,"PHYSICAL, OCCUPATIONAL, AND RESPIRATORY THERAPY TREATMENT",860,REHABILITATION,23,FACTORS INFLUENCING HEALTH STATUS AND OTHER CONTACTS WITH HEALTH SERVICES,4,Extreme,Major,Medical,Private Health Insurance,Medicare,,,,N,222848.23,51221.61
New York City,Manhattan,7002053,001463,NYU Langone Hospitals,70 or Older,105,F,White,Not Span/Hispanic,18,Elective,Home w/ Home Health Services,2020,SYM007,MALAISE AND FATIGUE,RHB002,"PHYSICAL, OCCUPATIONAL, AND RESPIRATORY THERAPY TREATMENT",860,REHABILITATION,23,FACTORS INFLUENCING HEALTH STATUS AND OTHER CONTACTS WITH HEALTH SERVICES,3,Major,Major,Medical,Medicare,Medicare,,,,N,304884.06,64568.72
New York City,Manhattan,7002053,001463,NYU Langone Hospitals,70 or Older,100,M,White,Not Span/Hispanic,12,Elective,Home w/ Home Health Services,2020,SYM007,MALAISE AND FATIGUE,RHB002,"PHYSICAL, OCCUPATIONAL, AND RESPIRATORY THERAPY TREATMENT",860,REHABILITATION,23,FACTORS INFLUENCING HEALTH STATUS AND OTHER CONTACTS WITH HEALTH SERVICES,3,Major,Major,Medical,Medicare,Medicare,,,,N,152251.35,40450.46
New York City,Kings,7002053,001304,NYU Langone Hospital-Brooklyn,70 or Older,100,F,White,Not Span/Hispanic,10,Elective,Home w/ Home Health Services,2020,INJ043,"FRACTURE OF THE NECK OF THE FEMUR (HIP), SUBSEQUENT ENCOUNTER",RHB002,"PHYSICAL, OCCUPATIONAL, AND RESPIRATORY THERAPY TREATMENT",860,REHABILITATION,23,FACTORS INFLUENCING HEALTH STATUS AND OTHER CONTACTS WITH HEALTH SERVICES,2,Moderate,Moderate,Medical,Medicare,Blue Cross/Blue Shield,,,,N,101542.95,31312.78
New York City,Kings,7002053,001304,NYU Langone Hospital-Brooklyn,70 or Older,112,F,Other Race,Not Span/Hispanic,6,Elective,Home w/ Home Health Services,2020,INJ045,"TRAUMATIC BRAIN INJURY (TBI); CONCUSSION, SUBSEQUENT ENCOUNTER",RHB002,"PHYSICAL, OCCUPATIONAL, AND RESPIRATORY THERAPY TREATMENT",860,REHABILITATION,23,FACTORS INFLUENCING HEALTH STATUS AND OTHER CONTACTS WITH HEALTH SERVICES,2,Moderate,Minor,Medical,Medicare,,,,,N,67196.35,18961.43
New York City,Kings,7002053,001304,NYU Langone Hospital-Brooklyn,70 or Older,112,M,White,Not Span/Hispanic,13,Elective,Home or Self Care,2020,INJ045,"TRAUMATIC BRAIN INJURY (TBI); CONCUSSION, SUBSEQUENT ENCOUNTER",RHB002,"PHYSICAL, OCCUPATIONAL, AND RESPIRATORY THERAPY TREATMENT",860,REHABILITATION,23,FACTORS INFLUENCING HEALTH STATUS AND OTHER CONTACTS WITH HEALTH SERVICES,3,Major,Moderate,Medical,Medicare,Blue Cross/Blue Shield,,,,N,146436.31,41396.74
New York City,Manhattan,7002053,001446,NYU Langone Orthopedic Hospital,50 to 69,115,M,White,Unknown,10,Elective,Home w/ Home Health Services,2020,FAC010,OTHER AFTERCARE ENCOUNTER,RHB002,"PHYSICAL, OCCUPATIONAL, AND RESPIRATORY THERAPY TREATMENT",860,REHABILITATION,23,FACTORS INFLUENCING HEALTH STATUS AND OTHER CONTACTS WITH HEALTH SERVICES,3,Major,Moderate,Medical,Blue Cross/Blue Shield,,,,,N,125320.33,34018.35
New York City,Kings,7001037,001320,University Hospital of Brooklyn,50 to 69,112,M,Black/African American,Not Span/Hispanic,11,Urgent,Home w/ Home Health Services,2020,FAC010,OTHER AFTERCARE ENCOUNTER,RHB002,"PHYSICAL, OCCUPATIONAL, AND RESPIRATORY THERAPY TREATMENT",860,REHABILITATION,23,FACTORS INFLUENCING HEALTH STATUS AND OTHER CONTACTS WITH HEALTH SERVICES,3,Major,Moderate,Medical,Medicaid,Medicaid,Self-Pay,,,N,56229,40325.2
New York City,Kings,7001037,001320,University Hospital of Brooklyn,70 or Older,112,M,Black/African American,Not Span/Hispanic,14,Urgent,Short-term Hospital,2020,SYM007,MALAISE AND FATIGUE,RHB002,"PHYSICAL, OCCUPATIONAL, AND RESPIRATORY THERAPY TREATMENT",860,REHABILITATION,23,FACTORS INFLUENCING HEALTH STATUS AND OTHER CONTACTS WITH HEALTH SERVICES,2,Moderate,Moderate,Medical,Medicaid,Self-Pay,,,,N,76872.6,53418.6
New York City,Kings,7001037,001320,University Hospital of Brooklyn,70 or Older,112,M,Black/African American,Not Span/Hispanic,15,Urgent,Home w/ Home Health Services,2020,CIR025,SEQUELA OF CEREBRAL INFARCTION AND OTHER CEREBROVASCULAR DISEASE,RHB002,"PHYSICAL, OCCUPATIONAL, AND RESPIRATORY THERAPY TREATMENT",860,REHABILITATION,23,FACTORS INFLUENCING HEALTH STATUS AND OTHER CONTACTS WITH HEALTH SERVICES,2,Moderate,Minor,Medical,Medicare,Medicaid,Self-Pay,,,N,84480,57712.55