Hospital Service Area,Hospital County,Operating Certificate Number,Permanent Facility Id,Facility Name,Age Group,Zip Code - 3 digits,Gender,Race,Ethnicity,Length of Stay,Type of Admission,Patient Disposition,Discharge Year,CCS Diagnosis Code,CCS Diagnosis Description,CCS Procedure Code,CCS Procedure Description,APR DRG Code,APR DRG Description,APR MDC Code,APR MDC Description,APR Severity of Illness Code,APR Severity of Illness Description,APR Risk of Mortality,APR Medical Surgical Description,Payment Typology 1,Payment Typology 2,Payment Typology 3,Birth Weight,Abortion Edit Indicator,Emergency Department Indicator,Total Charges,Total Costs
New York City,Manhattan,7002053,001463,NYU Langone Hospitals,30 to 49,OOS,M,White,Not Span/Hispanic,12,Urgent,Home or Self Care,2017,095,Other nervous system disorders,000,NO PROC,861,"Signs, symptoms & other factors influencing health status",23,"Rehabilitation, Aftercare, Other Factors Influencing Health Status and Other Health Service Contacts",2,Moderate,Minor,Medical,Miscellaneous/Other,,,,N,N,89404.20,50542.51
New York City,Manhattan,7002053,001463,NYU Langone Hospitals,30 to 49,104,M,Black/African American,Unknown,8,Emergency,Home or Self Care,2017,095,Other nervous system disorders,222,BLOOD TRANSFUSION,861,"Signs, symptoms & other factors influencing health status",23,"Rehabilitation, Aftercare, Other Factors Influencing Health Status and Other Health Service Contacts",3,Major,Major,Medical,Medicaid,,,,N,Y,87740.94,37928.32
New York City,Manhattan,7002053,001463,NYU Langone Hospitals,70 or Older,114,F,Other Race,Spanish/Hispanic,1,Emergency,Home or Self Care,2017,259,Residual codes; unclassified,058,HEMODIALYSIS,861,"Signs, symptoms & other factors influencing health status",23,"Rehabilitation, Aftercare, Other Factors Influencing Health Status and Other Health Service Contacts",3,Major,Major,Medical,Medicare,,,,N,Y,31656.30,10377.45
New York City,Manhattan,7002053,001463,NYU Langone Hospitals,70 or Older,112,M,Other Race,Spanish/Hispanic,3,Emergency,Home or Self Care,2017,095,Other nervous system disorders,222,BLOOD TRANSFUSION,861,"Signs, symptoms & other factors influencing health status",23,"Rehabilitation, Aftercare, Other Factors Influencing Health Status and Other Health Service Contacts",2,Moderate,Major,Medical,Medicare,,,,N,Y,30029.28,12898.24
New York City,Manhattan,7002053,001463,NYU Langone Hospitals,70 or Older,112,F,Black/African American,Not Span/Hispanic,2,Emergency,Home w/ Home Health Services,2017,095,Other nervous system disorders,000,NO PROC,861,"Signs, symptoms & other factors influencing health status",23,"Rehabilitation, Aftercare, Other Factors Influencing Health Status and Other Health Service Contacts",3,Major,Major,Medical,Medicare,,,,N,Y,43604.15,11810.03
New York City,Manhattan,7002053,001463,NYU Langone Hospitals,50 to 69,100,F,White,Not Span/Hispanic,2,Emergency,Home or Self Care,2017,151,Other liver diseases,000,NO PROC,861,"Signs, symptoms & other factors influencing health status",23,"Rehabilitation, Aftercare, Other Factors Influencing Health Status and Other Health Service Contacts",1,Minor,Moderate,Medical,Private Health Insurance,,,,N,Y,24753.38,7477.16
New York City,Manhattan,7002053,001463,NYU Langone Hospitals,30 to 49,112,F,Other Race,Spanish/Hispanic,3,Emergency,Home or Self Care,2017,095,Other nervous system disorders,000,NO PROC,861,"Signs, symptoms & other factors influencing health status",23,"Rehabilitation, Aftercare, Other Factors Influencing Health Status and Other Health Service Contacts",2,Moderate,Moderate,Medical,Medicaid,,,,N,Y,27829.62,10407.12
New York City,Manhattan,7002053,001463,NYU Langone Hospitals,70 or Older,100,M,White,Not Span/Hispanic,12,Emergency,Skilled Nursing Home,2017,095,Other nervous system disorders,000,NO PROC,861,"Signs, symptoms & other factors influencing health status",23,"Rehabilitation, Aftercare, Other Factors Influencing Health Status and Other Health Service Contacts",4,Extreme,Extreme,Medical,Medicare,,,,N,Y,129432.31,51293.79
New York City,Manhattan,7002053,001463,NYU Langone Hospitals,50 to 69,100,M,White,Not Span/Hispanic,3,Emergency,Home w/ Home Health Services,2017,095,Other nervous system disorders,000,NO PROC,861,"Signs, symptoms & other factors influencing health status",23,"Rehabilitation, Aftercare, Other Factors Influencing Health Status and Other Health Service Contacts",1,Minor,Minor,Medical,Medicare,,,,N,Y,37805.76,12022.91
New York City,Manhattan,7002053,001463,NYU Langone Hospitals,0 to 17,112,M,Other Race,Unknown,2,Emergency,Home or Self Care,2017,224,Other perinatal conditions,004,DIAGNOSTIC SPINAL TAP,861,"Signs, symptoms & other factors influencing health status",23,"Rehabilitation, Aftercare, Other Factors Influencing Health Status and Other Health Service Contacts",2,Moderate,Minor,Medical,Private Health Insurance,,,03400,N,Y,29915.31,7888.34
New York City,Manhattan,7002053,001463,NYU Langone Hospitals,30 to 49,100,M,Other Race,Not Span/Hispanic,5,Elective,Home or Self Care,2017,259,Residual codes; unclassified,000,NO PROC,861,"Signs, symptoms & other factors influencing health status",23,"Rehabilitation, Aftercare, Other Factors Influencing Health Status and Other Health Service Contacts",2,Moderate,Minor,Medical,Blue Cross/Blue Shield,,,,N,N,50204.12,19057.15
New York City,Manhattan,7002053,001463,NYU Langone Hospitals,0 to 17,112,F,Black/African American,Not Span/Hispanic,6,Emergency,Home w/ Home Health Services,2017,224,Other perinatal conditions,199,ELECTROENCEPHALOGRAM,861,"Signs, symptoms & other factors influencing health status",23,"Rehabilitation, Aftercare, Other Factors Influencing Health Status and Other Health Service Contacts",2,Moderate,Moderate,Medical,Medicaid,,,,N,Y,112149.25,15362.28
New York City,Manhattan,7002053,001463,NYU Langone Hospitals,50 to 69,114,F,Black/African American,Not Span/Hispanic,2,Emergency,Home or Self Care,2017,252,Malaise and fatigue,199,ELECTROENCEPHALOGRAM,861,"Signs, symptoms & other factors influencing health status",23,"Rehabilitation, Aftercare, Other Factors Influencing Health Status and Other Health Service Contacts",1,Minor,Minor,Medical,Blue Cross/Blue Shield,,,,N,Y,59123.54,7822.78
New York City,Manhattan,7002053,001463,NYU Langone Hospitals,50 to 69,112,F,White,Not Span/Hispanic,5,Emergency,Home or Self Care,2017,095,Other nervous system disorders,000,NO PROC,861,"Signs, symptoms & other factors influencing health status",23,"Rehabilitation, Aftercare, Other Factors Influencing Health Status and Other Health Service Contacts",2,Moderate,Moderate,Medical,Medicare,,,,N,Y,37505.33,16317.36
New York City,Manhattan,7002053,001463,NYU Langone Hospitals,0 to 17,112,M,White,Not Span/Hispanic,16,Emergency,Home or Self Care,2017,224,Other perinatal conditions,054,OT VASC CATH; NOT HEART,861,"Signs, symptoms & other factors influencing health status",23,"Rehabilitation, Aftercare, Other Factors Influencing Health Status and Other Health Service Contacts",2,Moderate,Minor,Medical,Private Health Insurance,,,03600,N,Y,117960.34,34815.45
New York City,Manhattan,7002053,001463,NYU Langone Hospitals,30 to 49,111,F,Black/African American,Not Span/Hispanic,5,Emergency,Home w/ Home Health Services,2017,095,Other nervous system disorders,000,NO PROC,861,"Signs, symptoms & other factors influencing health status",23,"Rehabilitation, Aftercare, Other Factors Influencing Health Status and Other Health Service Contacts",3,Major,Moderate,Medical,Blue Cross/Blue Shield,,,,N,Y,74664.51,24354.00
New York City,Manhattan,7002053,001463,NYU Langone Hospitals,30 to 49,100,F,Other Race,Spanish/Hispanic,4,Emergency,Left Against Medical Advice,2017,095,Other nervous system disorders,000,NO PROC,861,"Signs, symptoms & other factors influencing health status",23,"Rehabilitation, Aftercare, Other Factors Influencing Health Status and Other Health Service Contacts",1,Minor,Minor,Medical,Miscellaneous/Other,,,,N,Y,44889.75,16852.41
New York City,Manhattan,7002053,001463,NYU Langone Hospitals,50 to 69,112,M,White,Not Span/Hispanic,3,Emergency,Home w/ Home Health Services,2017,095,Other nervous system disorders,000,NO PROC,861,"Signs, symptoms & other factors influencing health status",23,"Rehabilitation, Aftercare, Other Factors Influencing Health Status and Other Health Service Contacts",2,Moderate,Moderate,Medical,Medicare,,,,N,Y,50121.94,14545.55
New York City,Manhattan,7002053,001463,NYU Langone Hospitals,50 to 69,OOS,F,White,Not Span/Hispanic,2,Emergency,Home w/ Home Health Services,2017,095,Other nervous system disorders,000,NO PROC,861,"Signs, symptoms & other factors influencing health status",23,"Rehabilitation, Aftercare, Other Factors Influencing Health Status and Other Health Service Contacts",1,Minor,Minor,Medical,Private Health Insurance,,,,N,Y,55968.02,13303.54
New York City,Manhattan,7002053,001463,NYU Langone Hospitals,30 to 49,OOS,M,White,Not Span/Hispanic,2,Emergency,Home or Self Care,2017,252,Malaise and fatigue,000,NO PROC,861,"Signs, symptoms & other factors influencing health status",23,"Rehabilitation, Aftercare, Other Factors Influencing Health Status and Other Health Service Contacts",1,Minor,Minor,Medical,Medicare,,,,N,Y,48344.35,13884.24
New York City,Manhattan,7002053,001463,NYU Langone Hospitals,30 to 49,104,M,Black/African American,Unknown,4,Emergency,Home or Self Care,2017,095,Other nervous system disorders,000,NO PROC,861,"Signs, symptoms & other factors influencing health status",23,"Rehabilitation, Aftercare, Other Factors Influencing Health Status and Other Health Service Contacts",3,Major,Moderate,Medical,Blue Cross/Blue Shield,,,,N,Y,67842.58,27371.04
New York City,Manhattan,7002053,001463,NYU Langone Hospitals,0 to 17,100,M,Other Race,Not Span/Hispanic,2,Emergency,Home or Self Care,2017,258,Other screening for suspected conditions (not mental disorders or infectious disease),199,ELECTROENCEPHALOGRAM,861,"Signs, symptoms & other factors influencing health status",23,"Rehabilitation, Aftercare, Other Factors Influencing Health Status and Other Health Service Contacts",3,Major,Moderate,Medical,Medicaid,,,,N,Y,61439.95,7101.03
New York City,Manhattan,7002053,001463,NYU Langone Hospitals,50 to 69,113,M,Other Race,Not Span/Hispanic,6,Emergency,Home w/ Home Health Services,2017,258,Other screening for suspected conditions (not mental disorders or infectious disease),202,ELECTROCARDIOGRAM,861,"Signs, symptoms & other factors influencing health status",23,"Rehabilitation, Aftercare, Other Factors Influencing Health Status and Other Health Service Contacts",3,Major,Major,Medical,Medicaid,,,,N,Y,55995.67,23851.31
New York City,Manhattan,7002053,001463,NYU Langone Hospitals,18 to 29,105,M,White,Not Span/Hispanic,4,Emergency,Home or Self Care,2017,095,Other nervous system disorders,211,THERAPEUTIC RADIOLOGY,861,"Signs, symptoms & other factors influencing health status",23,"Rehabilitation, Aftercare, Other Factors Influencing Health Status and Other Health Service Contacts",3,Major,Moderate,Medical,Private Health Insurance,,,,N,Y,55838.19,22967.95
New York City,Manhattan,7002053,001463,NYU Langone Hospitals,50 to 69,112,F,White,Not Span/Hispanic,1,Emergency,Home or Self Care,2017,252,Malaise and fatigue,058,HEMODIALYSIS,861,"Signs, symptoms & other factors influencing health status",23,"Rehabilitation, Aftercare, Other Factors Influencing Health Status and Other Health Service Contacts",3,Major,Moderate,Medical,Medicare,,,,N,Y,19342.31,8005.19
New York City,Manhattan,7002053,001463,NYU Langone Hospitals,50 to 69,104,F,White,Not Span/Hispanic,11,Urgent,Hospice - Medical Facility,2017,095,Other nervous system disorders,211,THERAPEUTIC RADIOLOGY,861,"Signs, symptoms & other factors influencing health status",23,"Rehabilitation, Aftercare, Other Factors Influencing Health Status and Other Health Service Contacts",2,Moderate,Moderate,Medical,Private Health Insurance,,,,N,N,97234.36,48411.60
New York City,Manhattan,7002053,001463,NYU Langone Hospitals,70 or Older,OOS,F,White,Not Span/Hispanic,4,Elective,Home w/ Home Health Services,2017,252,Malaise and fatigue,000,NO PROC,861,"Signs, symptoms & other factors influencing health status",23,"Rehabilitation, Aftercare, Other Factors Influencing Health Status and Other Health Service Contacts",3,Major,Major,Medical,Medicare,,,,N,N,37276.83,8763.69
New York City,Manhattan,7002053,001463,NYU Langone Hospitals,50 to 69,100,F,Black/African American,Not Span/Hispanic,3,Emergency,Home or Self Care,2017,095,Other nervous system disorders,000,NO PROC,861,"Signs, symptoms & other factors influencing health status",23,"Rehabilitation, Aftercare, Other Factors Influencing Health Status and Other Health Service Contacts",2,Moderate,Minor,Medical,Private Health Insurance,,,,N,Y,41101.27,13558.08
New York City,Manhattan,7002053,001463,NYU Langone Hospitals,70 or Older,103,F,White,Not Span/Hispanic,4,Urgent,Hospice - Medical Facility,2017,095,Other nervous system disorders,000,NO PROC,861,"Signs, symptoms & other factors influencing health status",23,"Rehabilitation, Aftercare, Other Factors Influencing Health Status and Other Health Service Contacts",4,Extreme,Major,Medical,Medicare,,,,N,N,23265.23,13172.84
New York City,Manhattan,7002053,001463,NYU Langone Hospitals,50 to 69,112,M,White,Not Span/Hispanic,2,Emergency,Home or Self Care,2017,258,Other screening for suspected conditions (not mental disorders or infectious disease),000,NO PROC,861,"Signs, symptoms & other factors influencing health status",23,"Rehabilitation, Aftercare, Other Factors Influencing Health Status and Other Health Service Contacts",1,Minor,Minor,Medical,Blue Cross/Blue Shield,,,,N,Y,19054.42,6633.89
New York City,Manhattan,7002053,001463,NYU Langone Hospitals,30 to 49,100,M,Other Race,Unknown,3,Urgent,Skilled Nursing Home,2017,252,Malaise and fatigue,000,NO PROC,861,"Signs, symptoms & other factors influencing health status",23,"Rehabilitation, Aftercare, Other Factors Influencing Health Status and Other Health Service Contacts",3,Major,Moderate,Medical,Medicare,,,,N,N,33063.00,11542.76
New York City,Manhattan,7002053,001463,NYU Langone Hospitals,0 to 17,100,M,Other Race,Spanish/Hispanic,69,Emergency,Medicare Cert Long Term Care Hospital,2017,259,Residual codes; unclassified,199,ELECTROENCEPHALOGRAM,861,"Signs, symptoms & other factors influencing health status",23,"Rehabilitation, Aftercare, Other Factors Influencing Health Status and Other Health Service Contacts",3,Major,Minor,Medical,Medicaid,,,,N,Y,515471.32,222561.71
New York City,Manhattan,7002053,001463,NYU Langone Hospitals,70 or Older,112,F,Black/African American,Not Span/Hispanic,6,Emergency,Skilled Nursing Home,2017,259,Residual codes; unclassified,000,NO PROC,861,"Signs, symptoms & other factors influencing health status",23,"Rehabilitation, Aftercare, Other Factors Influencing Health Status and Other Health Service Contacts",3,Major,Major,Medical,Private Health Insurance,,,,N,Y,56734.59,21662.00
New York City,Manhattan,7002053,001463,NYU Langone Hospitals,50 to 69,OOS,M,White,Not Span/Hispanic,4,Emergency,Home or Self Care,2017,095,Other nervous system disorders,000,NO PROC,861,"Signs, symptoms & other factors influencing health status",23,"Rehabilitation, Aftercare, Other Factors Influencing Health Status and Other Health Service Contacts",3,Major,Major,Medical,Private Health Insurance,,,,N,Y,37859.98,17896.72
New York City,Manhattan,7002053,001463,NYU Langone Hospitals,50 to 69,112,M,Other Race,Not Span/Hispanic,11,Emergency,Home or Self Care,2017,095,Other nervous system disorders,070,UP GASTRO ENDOSC/BIOPSY,861,"Signs, symptoms & other factors influencing health status",23,"Rehabilitation, Aftercare, Other Factors Influencing Health Status and Other Health Service Contacts",4,Extreme,Major,Medical,Private Health Insurance,,,,N,Y,132481.95,53453.79
New York City,Manhattan,7002053,001463,NYU Langone Hospitals,0 to 17,104,F,Other Race,Unknown,2,Emergency,Home or Self Care,2017,224,Other perinatal conditions,004,DIAGNOSTIC SPINAL TAP,861,"Signs, symptoms & other factors influencing health status",23,"Rehabilitation, Aftercare, Other Factors Influencing Health Status and Other Health Service Contacts",1,Minor,Minor,Medical,Blue Cross/Blue Shield,,,04400,N,Y,22052.71,6349.22
New York City,Manhattan,7002053,001463,NYU Langone Hospitals,50 to 69,113,M,White,Not Span/Hispanic,12,Emergency,Home or Self Care,2017,095,Other nervous system disorders,222,BLOOD TRANSFUSION,861,"Signs, symptoms & other factors influencing health status",23,"Rehabilitation, Aftercare, Other Factors Influencing Health Status and Other Health Service Contacts",3,Major,Major,Medical,Medicare,,,,N,Y,102790.44,43355.93
New York City,Manhattan,7002053,001463,NYU Langone Hospitals,70 or Older,112,M,Other Race,Spanish/Hispanic,5,Emergency,Home w/ Home Health Services,2017,095,Other nervous system disorders,000,NO PROC,861,"Signs, symptoms & other factors influencing health status",23,"Rehabilitation, Aftercare, Other Factors Influencing Health Status and Other Health Service Contacts",2,Moderate,Major,Medical,Medicare,,,,N,Y,37266.63,14160.29
New York City,Manhattan,7002053,001463,NYU Langone Hospitals,70 or Older,112,F,White,Not Span/Hispanic,4,Emergency,Skilled Nursing Home,2017,252,Malaise and fatigue,000,NO PROC,861,"Signs, symptoms & other factors influencing health status",23,"Rehabilitation, Aftercare, Other Factors Influencing Health Status and Other Health Service Contacts",2,Moderate,Major,Medical,Medicare,,,,N,Y,38113.17,14554.57
New York City,Manhattan,7002053,001463,NYU Langone Hospitals,0 to 17,OOS,M,White,Not Span/Hispanic,3,Elective,Home or Self Care,2017,252,Malaise and fatigue,199,ELECTROENCEPHALOGRAM,861,"Signs, symptoms & other factors influencing health status",23,"Rehabilitation, Aftercare, Other Factors Influencing Health Status and Other Health Service Contacts",2,Moderate,Minor,Medical,Blue Cross/Blue Shield,,,,N,N,59942.48,10914.43
New York City,Manhattan,7002053,001463,NYU Langone Hospitals,50 to 69,100,F,White,Not Span/Hispanic,1,Emergency,Hospice - Home,2017,095,Other nervous system disorders,222,BLOOD TRANSFUSION,861,"Signs, symptoms & other factors influencing health status",23,"Rehabilitation, Aftercare, Other Factors Influencing Health Status and Other Health Service Contacts",3,Major,Major,Medical,Medicare,,,,N,Y,14341.66,5284.34
New York City,Manhattan,7002053,001463,NYU Langone Hospitals,70 or Older,100,M,Black/African American,Not Span/Hispanic,4,Emergency,Home or Self Care,2017,095,Other nervous system disorders,000,NO PROC,861,"Signs, symptoms & other factors influencing health status",23,"Rehabilitation, Aftercare, Other Factors Influencing Health Status and Other Health Service Contacts",2,Moderate,Major,Medical,Medicare,,,,N,Y,30259.00,12702.02
New York City,Manhattan,7002053,001463,NYU Langone Hospitals,18 to 29,100,F,White,Unknown,1,Elective,Home or Self Care,2017,095,Other nervous system disorders,199,ELECTROENCEPHALOGRAM,861,"Signs, symptoms & other factors influencing health status",23,"Rehabilitation, Aftercare, Other Factors Influencing Health Status and Other Health Service Contacts",1,Minor,Minor,Medical,Self-Pay,,,,N,N,33615.65,7310.52
New York City,Manhattan,7002053,001463,NYU Langone Hospitals,50 to 69,115,M,White,Not Span/Hispanic,8,Emergency,Skilled Nursing Home,2017,259,Residual codes; unclassified,000,NO PROC,861,"Signs, symptoms & other factors influencing health status",23,"Rehabilitation, Aftercare, Other Factors Influencing Health Status and Other Health Service Contacts",2,Moderate,Major,Medical,Medicare,,,,N,Y,74406.25,28684.57
New York City,Manhattan,7002053,001463,NYU Langone Hospitals,70 or Older,112,F,White,Not Span/Hispanic,4,Emergency,Skilled Nursing Home,2017,252,Malaise and fatigue,000,NO PROC,861,"Signs, symptoms & other factors influencing health status",23,"Rehabilitation, Aftercare, Other Factors Influencing Health Status and Other Health Service Contacts",2,Moderate,Major,Medical,Medicare,,,,N,Y,55774.39,14773.15
New York City,Manhattan,7002053,001463,NYU Langone Hospitals,70 or Older,113,M,White,Not Span/Hispanic,5,Emergency,Inpatient Rehabilitation Facility,2017,252,Malaise and fatigue,171,SUTURE SKIN/SUBCUT TISS,861,"Signs, symptoms & other factors influencing health status",23,"Rehabilitation, Aftercare, Other Factors Influencing Health Status and Other Health Service Contacts",3,Major,Moderate,Medical,Medicare,,,,N,N,38389.46,16305.42
New York City,Manhattan,7002053,001463,NYU Langone Hospitals,0 to 17,112,F,Other Race,Not Span/Hispanic,8,Emergency,Home or Self Care,2017,224,Other perinatal conditions,228,PROPHYLACTIC VAC/INOCUL,861,"Signs, symptoms & other factors influencing health status",23,"Rehabilitation, Aftercare, Other Factors Influencing Health Status and Other Health Service Contacts",3,Major,Minor,Medical,Federal/State/Local/VA,,,,N,Y,106075.20,34241.06
New York City,Manhattan,7002053,001463,NYU Langone Hospitals,70 or Older,101,F,White,Not Span/Hispanic,3,Emergency,Skilled Nursing Home,2017,252,Malaise and fatigue,000,NO PROC,861,"Signs, symptoms & other factors influencing health status",23,"Rehabilitation, Aftercare, Other Factors Influencing Health Status and Other Health Service Contacts",2,Moderate,Moderate,Medical,Medicare,,,,N,Y,45635.73,16242.96
New York City,Manhattan,7002053,001463,NYU Langone Hospitals,70 or Older,100,F,White,Not Span/Hispanic,5,Emergency,Inpatient Rehabilitation Facility,2017,259,Residual codes; unclassified,199,ELECTROENCEPHALOGRAM,861,"Signs, symptoms & other factors influencing health status",23,"Rehabilitation, Aftercare, Other Factors Influencing Health Status and Other Health Service Contacts",3,Major,Major,Medical,Medicare,,,,N,Y,100074.40,20235.00
New York City,Manhattan,7002053,001463,NYU Langone Hospitals,70 or Older,112,F,Black/African American,Not Span/Hispanic,5,Emergency,Home or Self Care,2017,095,Other nervous system disorders,000,NO PROC,861,"Signs, symptoms & other factors influencing health status",23,"Rehabilitation, Aftercare, Other Factors Influencing Health Status and Other Health Service Contacts",2,Moderate,Moderate,Medical,Medicare,,,,N,Y,44519.22,19607.75
New York City,Manhattan,7002053,001463,NYU Langone Hospitals,0 to 17,112,F,Other Race,Spanish/Hispanic,2,Emergency,Home or Self Care,2017,259,Residual codes; unclassified,199,ELECTROENCEPHALOGRAM,861,"Signs, symptoms & other factors influencing health status",23,"Rehabilitation, Aftercare, Other Factors Influencing Health Status and Other Health Service Contacts",4,Extreme,Major,Medical,Medicaid,,,,N,Y,45787.15,6576.32
New York City,Manhattan,7002053,001463,NYU Langone Hospitals,0 to 17,112,M,White,Not Span/Hispanic,4,Emergency,Home or Self Care,2017,224,Other perinatal conditions,231,OTHER THERAPEUTIC PRCS,861,"Signs, symptoms & other factors influencing health status",23,"Rehabilitation, Aftercare, Other Factors Influencing Health Status and Other Health Service Contacts",3,Major,Major,Medical,Private Health Insurance,,,04100,N,Y,37637.68,10814.36
New York City,Manhattan,7002053,001463,NYU Langone Hospitals,50 to 69,112,M,White,Not Span/Hispanic,1,Emergency,Home or Self Care,2017,258,Other screening for suspected conditions (not mental disorders or infectious disease),193,DX ULTRASOUND HEART,861,"Signs, symptoms & other factors influencing health status",23,"Rehabilitation, Aftercare, Other Factors Influencing Health Status and Other Health Service Contacts",2,Moderate,Minor,Medical,Medicare,,,,N,Y,20384.26,6765.08
New York City,Manhattan,7002053,001463,NYU Langone Hospitals,70 or Older,114,M,Other Race,Spanish/Hispanic,3,Emergency,Home or Self Care,2017,095,Other nervous system disorders,000,NO PROC,861,"Signs, symptoms & other factors influencing health status",23,"Rehabilitation, Aftercare, Other Factors Influencing Health Status and Other Health Service Contacts",3,Major,Major,Medical,Medicare,,,,N,Y,33161.39,12214.44