Hospital Service Area,Hospital County,Operating Certificate Number,Permanent Facility Id,Facility Name,Age Group,Zip Code - 3 digits,Gender,Race,Ethnicity,Length of Stay,Type of Admission,Patient Disposition,Discharge Year,CCS Diagnosis Code,CCS Diagnosis Description,CCS Procedure Code,CCS Procedure Description,APR DRG Code,APR DRG Description,APR MDC Code,APR MDC Description,APR Severity of Illness Code,APR Severity of Illness Description,APR Risk of Mortality,APR Medical Surgical Description,Payment Typology 1,Payment Typology 2,Payment Typology 3,Birth Weight,Abortion Edit Indicator,Emergency Department Indicator,Total Charges,Total Costs
New York City,Kings,7002053,001304,NYU Langone Hospital-Brooklyn,70 or Older,112,M,Black/African American,Not Span/Hispanic,1,Emergency,Home or Self Care,2019,SYM017,ABNORMAL FINDINGS WITHOUT DIAGNOSIS,,,861,"SIGNS, SYMPTOMS & OTHER FACTORS INFLUENCING HEALTH STATUS",23,FACTORS INFLUENCING HEALTH STATUS AND OTHER CONTACTS WITH HEALTH SERVICES,1,Minor,Minor,Medical,Miscellaneous/Other,Medicare,Blue Cross/Blue Shield,,,true,15339.93,4510.18
New York City,Kings,7002053,001304,NYU Langone Hospital-Brooklyn,0 to 17,112,F,White,Unknown,2,Emergency,Home or Self Care,2019,SYM016,OTHER GENERAL SIGNS AND SYMPTOMS,CNS002,LUMBAR PUNCTURE,861,"SIGNS, SYMPTOMS & OTHER FACTORS INFLUENCING HEALTH STATUS",23,FACTORS INFLUENCING HEALTH STATUS AND OTHER CONTACTS WITH HEALTH SERVICES,1,Minor,Minor,Medical,Medicaid,,,,,true,26553.06,7349.5
New York City,Kings,7002053,001304,NYU Langone Hospital-Brooklyn,0 to 17,112,M,Other Race,Not Span/Hispanic,1,Emergency,Home or Self Care,2019,FAC003,"ENCOUNTER FOR OBSERVATION AND EXAMINATION FOR CONDITIONS RULED OUT (EXCLUDES INFECTIOUS DISEASE, NEOPLASM, MENTAL DISORDERS)",,,861,"SIGNS, SYMPTOMS & OTHER FACTORS INFLUENCING HEALTH STATUS",23,FACTORS INFLUENCING HEALTH STATUS AND OTHER CONTACTS WITH HEALTH SERVICES,1,Minor,Minor,Medical,Medicaid,,,,,true,11699.31,3542.72
New York City,Kings,7002053,001304,NYU Langone Hospital-Brooklyn,50 to 69,112,F,White,Not Span/Hispanic,4,Emergency,Home w/ Home Health Services,2019,NEO074,CONDITIONS DUE TO NEOPLASM OR THE TREATMENT OF NEOPLASM,,,861,"SIGNS, SYMPTOMS & OTHER FACTORS INFLUENCING HEALTH STATUS",23,FACTORS INFLUENCING HEALTH STATUS AND OTHER CONTACTS WITH HEALTH SERVICES,2,Moderate,Moderate,Medical,Medicare,Medicaid,,,,true,31437.49,13632.8
New York City,Kings,7002053,001304,NYU Langone Hospital-Brooklyn,50 to 69,112,M,White,Not Span/Hispanic,14,Emergency,Home or Self Care,2019,SYM007,MALAISE AND FATIGUE,,,861,"SIGNS, SYMPTOMS & OTHER FACTORS INFLUENCING HEALTH STATUS",23,FACTORS INFLUENCING HEALTH STATUS AND OTHER CONTACTS WITH HEALTH SERVICES,2,Moderate,Moderate,Medical,Medicare,Blue Cross/Blue Shield,,,,true,113888.24,51567.38
New York City,Kings,7002053,001304,NYU Langone Hospital-Brooklyn,30 to 49,112,M,Other Race,Spanish/Hispanic,5,Emergency,Home or Self Care,2019,SYM007,MALAISE AND FATIGUE,,,861,"SIGNS, SYMPTOMS & OTHER FACTORS INFLUENCING HEALTH STATUS",23,FACTORS INFLUENCING HEALTH STATUS AND OTHER CONTACTS WITH HEALTH SERVICES,2,Moderate,Minor,Medical,Medicaid,,,,,true,76990.82,21652.37
New York City,Kings,7002053,001304,NYU Langone Hospital-Brooklyn,50 to 69,112,M,White,Not Span/Hispanic,1,Emergency,Hospice - Medical Facility,2019,NEO074,CONDITIONS DUE TO NEOPLASM OR THE TREATMENT OF NEOPLASM,,,861,"SIGNS, SYMPTOMS & OTHER FACTORS INFLUENCING HEALTH STATUS",23,FACTORS INFLUENCING HEALTH STATUS AND OTHER CONTACTS WITH HEALTH SERVICES,3,Major,Major,Medical,Medicaid,,,,,true,39195.29,12854.85
New York City,Kings,7002053,001304,NYU Langone Hospital-Brooklyn,50 to 69,112,F,Other Race,Spanish/Hispanic,13,Emergency,Home w/ Home Health Services,2019,NEO074,CONDITIONS DUE TO NEOPLASM OR THE TREATMENT OF NEOPLASM,,,861,"SIGNS, SYMPTOMS & OTHER FACTORS INFLUENCING HEALTH STATUS",23,FACTORS INFLUENCING HEALTH STATUS AND OTHER CONTACTS WITH HEALTH SERVICES,3,Major,Major,Medical,Medicaid,,,,,true,146872.18,60004.17
New York City,Kings,7002053,001304,NYU Langone Hospital-Brooklyn,70 or Older,112,M,Other Race,Not Span/Hispanic,3,Emergency,Home or Self Care,2019,SYM007,MALAISE AND FATIGUE,,,861,"SIGNS, SYMPTOMS & OTHER FACTORS INFLUENCING HEALTH STATUS",23,FACTORS INFLUENCING HEALTH STATUS AND OTHER CONTACTS WITH HEALTH SERVICES,2,Moderate,Moderate,Medical,Medicare,,,,,true,74028.73,20443.21
New York City,Kings,7002053,001304,NYU Langone Hospital-Brooklyn,70 or Older,112,F,White,Not Span/Hispanic,6,Emergency,Psychiatric Hospital or Unit of Hosp,2019,SYM010,NERVOUS SYSTEM SIGNS AND SYMPTOMS,IMG007,COMPUTERIZED TOMOGRAPHY (CT) WITHOUT CONTRAST,861,"SIGNS, SYMPTOMS & OTHER FACTORS INFLUENCING HEALTH STATUS",23,FACTORS INFLUENCING HEALTH STATUS AND OTHER CONTACTS WITH HEALTH SERVICES,3,Major,Major,Medical,Blue Cross/Blue Shield,Medicare,,,,true,57521.25,21908.31
New York City,Kings,7002053,001304,NYU Langone Hospital-Brooklyn,70 or Older,112,M,Other Race,Not Span/Hispanic,1,Emergency,Home or Self Care,2019,SYM007,MALAISE AND FATIGUE,,,861,"SIGNS, SYMPTOMS & OTHER FACTORS INFLUENCING HEALTH STATUS",23,FACTORS INFLUENCING HEALTH STATUS AND OTHER CONTACTS WITH HEALTH SERVICES,2,Moderate,Moderate,Medical,Medicare,,,,,true,22260.34,5735.55
New York City,Kings,7002053,001304,NYU Langone Hospital-Brooklyn,70 or Older,112,F,Other Race,Not Span/Hispanic,4,Emergency,Home w/ Home Health Services,2019,NEO074,CONDITIONS DUE TO NEOPLASM OR THE TREATMENT OF NEOPLASM,,,861,"SIGNS, SYMPTOMS & OTHER FACTORS INFLUENCING HEALTH STATUS",23,FACTORS INFLUENCING HEALTH STATUS AND OTHER CONTACTS WITH HEALTH SERVICES,2,Moderate,Moderate,Medical,Medicare,Medicaid,,,,true,54445.8,14422.89
New York City,Kings,7002053,001304,NYU Langone Hospital-Brooklyn,50 to 69,112,F,White,Not Span/Hispanic,7,Emergency,Home or Self Care,2019,NEO074,CONDITIONS DUE TO NEOPLASM OR THE TREATMENT OF NEOPLASM,,,861,"SIGNS, SYMPTOMS & OTHER FACTORS INFLUENCING HEALTH STATUS",23,FACTORS INFLUENCING HEALTH STATUS AND OTHER CONTACTS WITH HEALTH SERVICES,3,Major,Major,Medical,Blue Cross/Blue Shield,,,,,true,79691.07,33659.96
New York City,Kings,7002053,001304,NYU Langone Hospital-Brooklyn,50 to 69,112,F,Other Race,Not Span/Hispanic,2,Elective,Home or Self Care,2019,SYM010,NERVOUS SYSTEM SIGNS AND SYMPTOMS,MAM011,ELECTROENCEPHALOGRAM (EEG),861,"SIGNS, SYMPTOMS & OTHER FACTORS INFLUENCING HEALTH STATUS",23,FACTORS INFLUENCING HEALTH STATUS AND OTHER CONTACTS WITH HEALTH SERVICES,2,Moderate,Minor,Medical,Medicaid,,,,,false,78304.01,14022.45
New York City,Kings,7002053,001304,NYU Langone Hospital-Brooklyn,30 to 49,112,F,Other Race,Not Span/Hispanic,2,Emergency,Home or Self Care,2019,NVS019,NERVOUS SYSTEM PAIN AND PAIN SYNDROMES,,,861,"SIGNS, SYMPTOMS & OTHER FACTORS INFLUENCING HEALTH STATUS",23,FACTORS INFLUENCING HEALTH STATUS AND OTHER CONTACTS WITH HEALTH SERVICES,1,Minor,Minor,Medical,Private Health Insurance,,,,,true,28118.58,8477.91
New York City,Kings,7002053,001304,NYU Langone Hospital-Brooklyn,30 to 49,117,M,White,Not Span/Hispanic,2,Emergency,Home or Self Care,2019,SYM007,MALAISE AND FATIGUE,,,861,"SIGNS, SYMPTOMS & OTHER FACTORS INFLUENCING HEALTH STATUS",23,FACTORS INFLUENCING HEALTH STATUS AND OTHER CONTACTS WITH HEALTH SERVICES,1,Minor,Minor,Medical,Private Health Insurance,,,,,true,90021.78,18845.14
New York City,Kings,7002053,001304,NYU Langone Hospital-Brooklyn,50 to 69,112,F,White,Not Span/Hispanic,2,Emergency,Home w/ Home Health Services,2019,SYM016,OTHER GENERAL SIGNS AND SYMPTOMS,,,861,"SIGNS, SYMPTOMS & OTHER FACTORS INFLUENCING HEALTH STATUS",23,FACTORS INFLUENCING HEALTH STATUS AND OTHER CONTACTS WITH HEALTH SERVICES,2,Moderate,Moderate,Medical,Medicare,Medicaid,,,,true,54241.14,17194.47
New York City,Kings,7002053,001304,NYU Langone Hospital-Brooklyn,0 to 17,112,M,Other Race,Spanish/Hispanic,2,Elective,Home or Self Care,2019,FAC003,"ENCOUNTER FOR OBSERVATION AND EXAMINATION FOR CONDITIONS RULED OUT (EXCLUDES INFECTIOUS DISEASE, NEOPLASM, MENTAL DISORDERS)",MAM011,ELECTROENCEPHALOGRAM (EEG),861,"SIGNS, SYMPTOMS & OTHER FACTORS INFLUENCING HEALTH STATUS",23,FACTORS INFLUENCING HEALTH STATUS AND OTHER CONTACTS WITH HEALTH SERVICES,2,Moderate,Minor,Medical,Medicaid,,,,,false,68059.54,13564.53
New York City,Kings,7002053,001304,NYU Langone Hospital-Brooklyn,30 to 49,112,M,Other Race,Spanish/Hispanic,3,Emergency,Home or Self Care,2019,NVS019,NERVOUS SYSTEM PAIN AND PAIN SYNDROMES,PLC001,IMMOBILIZATION BY SPLINT OR OTHER EXTERNAL DEVICE,861,"SIGNS, SYMPTOMS & OTHER FACTORS INFLUENCING HEALTH STATUS",23,FACTORS INFLUENCING HEALTH STATUS AND OTHER CONTACTS WITH HEALTH SERVICES,1,Minor,Minor,Medical,Miscellaneous/Other,,,,,true,47139.66,13664.09
New York City,Kings,7002053,001304,NYU Langone Hospital-Brooklyn,70 or Older,112,M,White,Not Span/Hispanic,3,Emergency,Home w/ Home Health Services,2019,SYM007,MALAISE AND FATIGUE,,,861,"SIGNS, SYMPTOMS & OTHER FACTORS INFLUENCING HEALTH STATUS",23,FACTORS INFLUENCING HEALTH STATUS AND OTHER CONTACTS WITH HEALTH SERVICES,3,Major,Major,Medical,Blue Cross/Blue Shield,Medicaid,,,,true,33922.28,11517.22
New York City,Kings,7002053,001304,NYU Langone Hospital-Brooklyn,70 or Older,112,F,Other Race,Not Span/Hispanic,2,Emergency,Home or Self Care,2019,SYM007,MALAISE AND FATIGUE,,,861,"SIGNS, SYMPTOMS & OTHER FACTORS INFLUENCING HEALTH STATUS",23,FACTORS INFLUENCING HEALTH STATUS AND OTHER CONTACTS WITH HEALTH SERVICES,2,Moderate,Moderate,Medical,Medicare,Medicaid,,,,true,29722.27,8544.67
New York City,Kings,7002053,001304,NYU Langone Hospital-Brooklyn,70 or Older,112,M,Other Race,Not Span/Hispanic,2,Emergency,Home w/ Home Health Services,2019,SYM007,MALAISE AND FATIGUE,,,861,"SIGNS, SYMPTOMS & OTHER FACTORS INFLUENCING HEALTH STATUS",23,FACTORS INFLUENCING HEALTH STATUS AND OTHER CONTACTS WITH HEALTH SERVICES,1,Minor,Moderate,Medical,Medicare,Medicaid,,,,true,34679.03,8967.87
New York City,Kings,7002053,001304,NYU Langone Hospital-Brooklyn,50 to 69,112,F,White,Not Span/Hispanic,6,Emergency,Inpatient Rehabilitation Facility,2019,NVS019,NERVOUS SYSTEM PAIN AND PAIN SYNDROMES,,,861,"SIGNS, SYMPTOMS & OTHER FACTORS INFLUENCING HEALTH STATUS",23,FACTORS INFLUENCING HEALTH STATUS AND OTHER CONTACTS WITH HEALTH SERVICES,2,Moderate,Minor,Medical,Medicare,Blue Cross/Blue Shield,,,,true,59693.39,21555.98
New York City,Kings,7002053,001304,NYU Langone Hospital-Brooklyn,30 to 49,103,F,White,Not Span/Hispanic,2,Elective,Home or Self Care,2019,SYM010,NERVOUS SYSTEM SIGNS AND SYMPTOMS,MAM011,ELECTROENCEPHALOGRAM (EEG),861,"SIGNS, SYMPTOMS & OTHER FACTORS INFLUENCING HEALTH STATUS",23,FACTORS INFLUENCING HEALTH STATUS AND OTHER CONTACTS WITH HEALTH SERVICES,1,Minor,Minor,Medical,Private Health Insurance,,,,,false,70126.7,13795.31
New York City,Kings,7002053,001304,NYU Langone Hospital-Brooklyn,50 to 69,112,M,White,Spanish/Hispanic,6,Emergency,Home or Self Care,2019,SYM016,OTHER GENERAL SIGNS AND SYMPTOMS,,,861,"SIGNS, SYMPTOMS & OTHER FACTORS INFLUENCING HEALTH STATUS",23,FACTORS INFLUENCING HEALTH STATUS AND OTHER CONTACTS WITH HEALTH SERVICES,4,Extreme,Major,Medical,Medicaid,,,,,true,69162.82,23020.43
New York City,Kings,7002053,001304,NYU Langone Hospital-Brooklyn,18 to 29,112,F,Other Race,Not Span/Hispanic,1,Emergency,Home or Self Care,2019,SYM007,MALAISE AND FATIGUE,,,861,"SIGNS, SYMPTOMS & OTHER FACTORS INFLUENCING HEALTH STATUS",23,FACTORS INFLUENCING HEALTH STATUS AND OTHER CONTACTS WITH HEALTH SERVICES,1,Minor,Minor,Medical,Self-Pay,,,,,true,53615.99,7761.1
New York City,Kings,7002053,001304,NYU Langone Hospital-Brooklyn,70 or Older,112,F,White,Not Span/Hispanic,3,Emergency,Skilled Nursing Home,2019,SYM007,MALAISE AND FATIGUE,,,861,"SIGNS, SYMPTOMS & OTHER FACTORS INFLUENCING HEALTH STATUS",23,FACTORS INFLUENCING HEALTH STATUS AND OTHER CONTACTS WITH HEALTH SERVICES,3,Major,Major,Medical,Medicare,Medicare,,,,true,55303.75,17243.36
New York City,Kings,7002053,001304,NYU Langone Hospital-Brooklyn,70 or Older,103,F,Other Race,Not Span/Hispanic,3,Emergency,Home w/ Home Health Services,2019,SYM010,NERVOUS SYSTEM SIGNS AND SYMPTOMS,MAM011,ELECTROENCEPHALOGRAM (EEG),861,"SIGNS, SYMPTOMS & OTHER FACTORS INFLUENCING HEALTH STATUS",23,FACTORS INFLUENCING HEALTH STATUS AND OTHER CONTACTS WITH HEALTH SERVICES,3,Major,Moderate,Medical,Medicare,Medicaid,,,,true,46133.83,12827.7
New York City,Kings,7002053,001304,NYU Langone Hospital-Brooklyn,70 or Older,112,F,Other Race,Spanish/Hispanic,4,Emergency,Skilled Nursing Home,2019,NVS019,NERVOUS SYSTEM PAIN AND PAIN SYNDROMES,,,861,"SIGNS, SYMPTOMS & OTHER FACTORS INFLUENCING HEALTH STATUS",23,FACTORS INFLUENCING HEALTH STATUS AND OTHER CONTACTS WITH HEALTH SERVICES,3,Major,Major,Medical,Medicare,Medicaid,,,,true,36953.94,14534.57
New York City,Kings,7002053,001304,NYU Langone Hospital-Brooklyn,50 to 69,112,M,Other Race,Not Span/Hispanic,7,Emergency,Skilled Nursing Home,2019,NVS019,NERVOUS SYSTEM PAIN AND PAIN SYNDROMES,ESA001,HEMODIALYSIS,861,"SIGNS, SYMPTOMS & OTHER FACTORS INFLUENCING HEALTH STATUS",23,FACTORS INFLUENCING HEALTH STATUS AND OTHER CONTACTS WITH HEALTH SERVICES,2,Moderate,Moderate,Medical,Miscellaneous/Other,Medicare,,,,true,102043.31,30581.02
New York City,Kings,7002053,001304,NYU Langone Hospital-Brooklyn,50 to 69,112,M,Other Race,Not Span/Hispanic,1,Emergency,Home or Self Care,2019,SYM007,MALAISE AND FATIGUE,IMG005,MAGNETIC RESONANCE IMAGING (MRI),861,"SIGNS, SYMPTOMS & OTHER FACTORS INFLUENCING HEALTH STATUS",23,FACTORS INFLUENCING HEALTH STATUS AND OTHER CONTACTS WITH HEALTH SERVICES,2,Moderate,Minor,Medical,Medicare,Medicaid,,,,true,57933.35,10744.62
New York City,Kings,7002053,001304,NYU Langone Hospital-Brooklyn,70 or Older,112,M,White,Not Span/Hispanic,2,Emergency,Home w/ Home Health Services,2019,SYM007,MALAISE AND FATIGUE,,,861,"SIGNS, SYMPTOMS & OTHER FACTORS INFLUENCING HEALTH STATUS",23,FACTORS INFLUENCING HEALTH STATUS AND OTHER CONTACTS WITH HEALTH SERVICES,4,Extreme,Major,Medical,Medicaid,Medicaid,,,,true,25225.62,8128
New York City,Kings,7002053,001304,NYU Langone Hospital-Brooklyn,70 or Older,112,F,Multi-racial,Not Span/Hispanic,1,Emergency,Home w/ Home Health Services,2019,SYM010,NERVOUS SYSTEM SIGNS AND SYMPTOMS,,,861,"SIGNS, SYMPTOMS & OTHER FACTORS INFLUENCING HEALTH STATUS",23,FACTORS INFLUENCING HEALTH STATUS AND OTHER CONTACTS WITH HEALTH SERVICES,2,Moderate,Moderate,Medical,Medicare,Medicaid,,,,true,61461.73,17910.92
New York City,Kings,7002053,001304,NYU Langone Hospital-Brooklyn,50 to 69,112,F,Other Race,Spanish/Hispanic,4,Emergency,Home or Self Care,2019,NVS019,NERVOUS SYSTEM PAIN AND PAIN SYNDROMES,,,861,"SIGNS, SYMPTOMS & OTHER FACTORS INFLUENCING HEALTH STATUS",23,FACTORS INFLUENCING HEALTH STATUS AND OTHER CONTACTS WITH HEALTH SERVICES,2,Moderate,Minor,Medical,Private Health Insurance,,,,,true,48780.61,19221.89
New York City,Kings,7002053,001304,NYU Langone Hospital-Brooklyn,70 or Older,112,F,White,Not Span/Hispanic,2,Emergency,Skilled Nursing Home,2019,SYM007,MALAISE AND FATIGUE,,,861,"SIGNS, SYMPTOMS & OTHER FACTORS INFLUENCING HEALTH STATUS",23,FACTORS INFLUENCING HEALTH STATUS AND OTHER CONTACTS WITH HEALTH SERVICES,1,Minor,Moderate,Medical,Private Health Insurance,,,,,true,28938.21,11694.03
New York City,Kings,7002053,001304,NYU Langone Hospital-Brooklyn,50 to 69,112,M,White,Not Span/Hispanic,2,Emergency,Home or Self Care,2019,SYM007,MALAISE AND FATIGUE,URN006,BLADDER CATHETERIZATION AND DRAINAGE,861,"SIGNS, SYMPTOMS & OTHER FACTORS INFLUENCING HEALTH STATUS",23,FACTORS INFLUENCING HEALTH STATUS AND OTHER CONTACTS WITH HEALTH SERVICES,2,Moderate,Minor,Medical,Medicare,Blue Cross/Blue Shield,,,,true,61882.65,16693.35
New York City,Kings,7002053,001304,NYU Langone Hospital-Brooklyn,70 or Older,112,M,Other Race,Not Span/Hispanic,1,Emergency,Home or Self Care,2019,SYM007,MALAISE AND FATIGUE,,,861,"SIGNS, SYMPTOMS & OTHER FACTORS INFLUENCING HEALTH STATUS",23,FACTORS INFLUENCING HEALTH STATUS AND OTHER CONTACTS WITH HEALTH SERVICES,2,Moderate,Moderate,Medical,Private Health Insurance,,,,,true,30575.29,9788.75
New York City,Kings,7002053,001304,NYU Langone Hospital-Brooklyn,70 or Older,100,M,White,Not Span/Hispanic,1,Emergency,Home or Self Care,2019,NEO074,CONDITIONS DUE TO NEOPLASM OR THE TREATMENT OF NEOPLASM,,,861,"SIGNS, SYMPTOMS & OTHER FACTORS INFLUENCING HEALTH STATUS",23,FACTORS INFLUENCING HEALTH STATUS AND OTHER CONTACTS WITH HEALTH SERVICES,2,Moderate,Major,Medical,Medicare,Blue Cross/Blue Shield,,,,true,45173.33,5947.01
New York City,Kings,7002053,001304,NYU Langone Hospital-Brooklyn,0 to 17,112,M,White,Spanish/Hispanic,1,Emergency,Home or Self Care,2019,SYM016,OTHER GENERAL SIGNS AND SYMPTOMS,,,861,"SIGNS, SYMPTOMS & OTHER FACTORS INFLUENCING HEALTH STATUS",23,FACTORS INFLUENCING HEALTH STATUS AND OTHER CONTACTS WITH HEALTH SERVICES,1,Minor,Minor,Medical,Medicaid,,,02600,,true,11923.04,3558.82
New York City,Kings,7002053,001304,NYU Langone Hospital-Brooklyn,70 or Older,112,F,White,Not Span/Hispanic,10,Emergency,Skilled Nursing Home,2019,SYM010,NERVOUS SYSTEM SIGNS AND SYMPTOMS,,,861,"SIGNS, SYMPTOMS & OTHER FACTORS INFLUENCING HEALTH STATUS",23,FACTORS INFLUENCING HEALTH STATUS AND OTHER CONTACTS WITH HEALTH SERVICES,3,Major,Major,Medical,Medicaid,Medicaid,,,,true,142213.34,51282.57
New York City,Kings,7002053,001304,NYU Langone Hospital-Brooklyn,30 to 49,112,M,White,Not Span/Hispanic,1,Emergency,Left Against Medical Advice,2019,SYM010,NERVOUS SYSTEM SIGNS AND SYMPTOMS,ADM021,"ADMINISTRATION OF THERAPEUTIC SUBSTANCES, NEC",861,"SIGNS, SYMPTOMS & OTHER FACTORS INFLUENCING HEALTH STATUS",23,FACTORS INFLUENCING HEALTH STATUS AND OTHER CONTACTS WITH HEALTH SERVICES,4,Extreme,Major,Medical,Medicaid,,,,,true,29735.64,6575.4
New York City,Kings,7002053,001304,NYU Langone Hospital-Brooklyn,70 or Older,112,F,Black/African American,Spanish/Hispanic,2,Elective,Home or Self Care,2019,SYM010,NERVOUS SYSTEM SIGNS AND SYMPTOMS,MAM011,ELECTROENCEPHALOGRAM (EEG),861,"SIGNS, SYMPTOMS & OTHER FACTORS INFLUENCING HEALTH STATUS",23,FACTORS INFLUENCING HEALTH STATUS AND OTHER CONTACTS WITH HEALTH SERVICES,1,Minor,Minor,Medical,Private Health Insurance,Medicaid,,,,false,48790.59,13179.8
New York City,Kings,7002053,001304,NYU Langone Hospital-Brooklyn,50 to 69,112,M,White,Not Span/Hispanic,1,Emergency,Left Against Medical Advice,2019,SYM010,NERVOUS SYSTEM SIGNS AND SYMPTOMS,,,861,"SIGNS, SYMPTOMS & OTHER FACTORS INFLUENCING HEALTH STATUS",23,FACTORS INFLUENCING HEALTH STATUS AND OTHER CONTACTS WITH HEALTH SERVICES,2,Moderate,Minor,Medical,Medicare,Medicaid,Blue Cross/Blue Shield,,,true,32193.51,7404.06
New York City,Kings,7002053,001304,NYU Langone Hospital-Brooklyn,70 or Older,112,F,White,Not Span/Hispanic,1,Emergency,Skilled Nursing Home,2019,SYM007,MALAISE AND FATIGUE,,,861,"SIGNS, SYMPTOMS & OTHER FACTORS INFLUENCING HEALTH STATUS",23,FACTORS INFLUENCING HEALTH STATUS AND OTHER CONTACTS WITH HEALTH SERVICES,2,Moderate,Moderate,Medical,Medicaid,,,,,true,33673.9,9837.74
New York City,Kings,7002053,001304,NYU Langone Hospital-Brooklyn,50 to 69,112,M,Other Race,Not Span/Hispanic,1,Emergency,Left Against Medical Advice,2019,SYM007,MALAISE AND FATIGUE,IMG005,MAGNETIC RESONANCE IMAGING (MRI),861,"SIGNS, SYMPTOMS & OTHER FACTORS INFLUENCING HEALTH STATUS",23,FACTORS INFLUENCING HEALTH STATUS AND OTHER CONTACTS WITH HEALTH SERVICES,1,Minor,Minor,Medical,Medicaid,,,,,true,25742.94,4727.29
New York City,Kings,7002053,001304,NYU Langone Hospital-Brooklyn,50 to 69,112,M,Black/African American,Not Span/Hispanic,2,Emergency,Home or Self Care,2019,SYM017,ABNORMAL FINDINGS WITHOUT DIAGNOSIS,,,861,"SIGNS, SYMPTOMS & OTHER FACTORS INFLUENCING HEALTH STATUS",23,FACTORS INFLUENCING HEALTH STATUS AND OTHER CONTACTS WITH HEALTH SERVICES,2,Moderate,Moderate,Medical,Medicaid,,,,,true,27495.66,8400.91
New York City,Kings,7002053,001304,NYU Langone Hospital-Brooklyn,50 to 69,112,M,Other Race,Not Span/Hispanic,3,Emergency,Home w/ Home Health Services,2019,SYM007,MALAISE AND FATIGUE,,,861,"SIGNS, SYMPTOMS & OTHER FACTORS INFLUENCING HEALTH STATUS",23,FACTORS INFLUENCING HEALTH STATUS AND OTHER CONTACTS WITH HEALTH SERVICES,2,Moderate,Moderate,Medical,Medicare,Medicaid,,,,true,49493.33,12772.14
New York City,Kings,7002053,001304,NYU Langone Hospital-Brooklyn,70 or Older,112,M,Black/African American,Not Span/Hispanic,4,Emergency,Skilled Nursing Home,2019,SYM007,MALAISE AND FATIGUE,,,861,"SIGNS, SYMPTOMS & OTHER FACTORS INFLUENCING HEALTH STATUS",23,FACTORS INFLUENCING HEALTH STATUS AND OTHER CONTACTS WITH HEALTH SERVICES,2,Moderate,Moderate,Medical,Medicaid,Medicaid,,,,true,56634.05,16297.44
New York City,Kings,7002053,001304,NYU Langone Hospital-Brooklyn,50 to 69,112,M,Other Race,Not Span/Hispanic,1,Emergency,Home or Self Care,2019,SYM017,ABNORMAL FINDINGS WITHOUT DIAGNOSIS,,,861,"SIGNS, SYMPTOMS & OTHER FACTORS INFLUENCING HEALTH STATUS",23,FACTORS INFLUENCING HEALTH STATUS AND OTHER CONTACTS WITH HEALTH SERVICES,1,Minor,Minor,Medical,Medicaid,,,,,true,17905.84,4832.15
New York City,Kings,7002053,001304,NYU Langone Hospital-Brooklyn,70 or Older,112,F,Other Race,Not Span/Hispanic,4,Emergency,Home w/ Home Health Services,2019,SYM010,NERVOUS SYSTEM SIGNS AND SYMPTOMS,,,861,"SIGNS, SYMPTOMS & OTHER FACTORS INFLUENCING HEALTH STATUS",23,FACTORS INFLUENCING HEALTH STATUS AND OTHER CONTACTS WITH HEALTH SERVICES,1,Minor,Moderate,Medical,Medicare,Medicaid,,,,true,52965.12,15768.76
New York City,Kings,7002053,001304,NYU Langone Hospital-Brooklyn,30 to 49,112,F,Other Race,Unknown,1,Emergency,Home or Self Care,2019,NVS019,NERVOUS SYSTEM PAIN AND PAIN SYNDROMES,,,861,"SIGNS, SYMPTOMS & OTHER FACTORS INFLUENCING HEALTH STATUS",23,FACTORS INFLUENCING HEALTH STATUS AND OTHER CONTACTS WITH HEALTH SERVICES,2,Moderate,Minor,Medical,Miscellaneous/Other,Private Health Insurance,,,,true,30029.19,6472.34
New York City,Kings,7002053,001304,NYU Langone Hospital-Brooklyn,70 or Older,112,F,Other Race,Spanish/Hispanic,1,Emergency,Home w/ Home Health Services,2019,SYM007,MALAISE AND FATIGUE,,,861,"SIGNS, SYMPTOMS & OTHER FACTORS INFLUENCING HEALTH STATUS",23,FACTORS INFLUENCING HEALTH STATUS AND OTHER CONTACTS WITH HEALTH SERVICES,1,Minor,Moderate,Medical,Private Health Insurance,Medicaid,,,,true,15994.66,4584.24
New York City,Kings,7002053,001304,NYU Langone Hospital-Brooklyn,70 or Older,112,M,White,Not Span/Hispanic,2,Emergency,Home or Self Care,2019,SYM007,MALAISE AND FATIGUE,ADM005,ADMINISTRATION OF THROMBOLYTICS AND PLATELET INHIBITORS,861,"SIGNS, SYMPTOMS & OTHER FACTORS INFLUENCING HEALTH STATUS",23,FACTORS INFLUENCING HEALTH STATUS AND OTHER CONTACTS WITH HEALTH SERVICES,2,Moderate,Major,Medical,Medicare,Medicare,,,,true,198624.87,18805.77
New York City,Kings,7002053,001304,NYU Langone Hospital-Brooklyn,30 to 49,112,M,Other Race,Spanish/Hispanic,2,Emergency,Home or Self Care,2019,SYM017,ABNORMAL FINDINGS WITHOUT DIAGNOSIS,,,861,"SIGNS, SYMPTOMS & OTHER FACTORS INFLUENCING HEALTH STATUS",23,FACTORS INFLUENCING HEALTH STATUS AND OTHER CONTACTS WITH HEALTH SERVICES,1,Minor,Minor,Medical,Medicaid,,,,,true,31129.58,8965.2
New York City,Kings,7002053,001304,NYU Langone Hospital-Brooklyn,50 to 69,103,M,Other Race,Not Span/Hispanic,4,Emergency,Home or Self Care,2019,NEO074,CONDITIONS DUE TO NEOPLASM OR THE TREATMENT OF NEOPLASM,,,861,"SIGNS, SYMPTOMS & OTHER FACTORS INFLUENCING HEALTH STATUS",23,FACTORS INFLUENCING HEALTH STATUS AND OTHER CONTACTS WITH HEALTH SERVICES,3,Major,Major,Medical,Medicaid,,,,,true,50875.2,16011.21
New York City,Kings,7002053,001304,NYU Langone Hospital-Brooklyn,50 to 69,112,M,White,Not Span/Hispanic,1,Emergency,Home or Self Care,2019,SYM010,NERVOUS SYSTEM SIGNS AND SYMPTOMS,ADM001,TRANSFUSION OF BLOOD AND BLOOD PRODUCTS,861,"SIGNS, SYMPTOMS & OTHER FACTORS INFLUENCING HEALTH STATUS",23,FACTORS INFLUENCING HEALTH STATUS AND OTHER CONTACTS WITH HEALTH SERVICES,3,Major,Major,Medical,Private Health Insurance,,,,,true,30934.57,6404.98