Hospital Service Area,Hospital County,Operating Certificate Number,Permanent Facility Id,Facility Name,Age Group,Zip Code - 3 digits,Gender,Race,Ethnicity,Length of Stay,Type of Admission,Patient Disposition,Discharge Year,CCS Diagnosis Code,CCS Diagnosis Description,CCS Procedure Code,CCS Procedure Description,APR DRG Code,APR DRG Description,APR MDC Code,APR MDC Description,APR Severity of Illness Code,APR Severity of Illness Description,APR Risk of Mortality,APR Medical Surgical Description,Payment Typology 1,Payment Typology 2,Payment Typology 3,Birth Weight,Abortion Edit Indicator,Emergency Department Indicator,Total Charges,Total Costs
New York City,Bronx,7000006,001169,Montefiore Medical Center - Henry & Lucy Moses Div,50 to 69,104,M,Black/African American,Not Span/Hispanic,3,Emergency,Home w/ Home Health Services,2020,SYM016,OTHER GENERAL SIGNS AND SYMPTOMS,,,861,"SIGNS, SYMPTOMS & OTHER FACTORS INFLUENCING HEALTH STATUS",23,FACTORS INFLUENCING HEALTH STATUS AND OTHER CONTACTS WITH HEALTH SERVICES,2,Moderate,Moderate,Medical,Medicare,Medicaid,,,,Y,55663.96,8855.38
Hudson Valley,Rockland,4329000,000779,Good Samaritan Hospital of Suffern,70 or Older,109,F,White,Not Span/Hispanic,5,Emergency,Home or Self Care,2020,SYM016,OTHER GENERAL SIGNS AND SYMPTOMS,,,861,"SIGNS, SYMPTOMS & OTHER FACTORS INFLUENCING HEALTH STATUS",23,FACTORS INFLUENCING HEALTH STATUS AND OTHER CONTACTS WITH HEALTH SERVICES,1,Minor,Moderate,Medical,Medicare,,,,,Y,78327.59,9614.41
Hudson Valley,Orange,3535001,000708,Bon Secours Community Hospital,70 or Older,127,M,White,Not Span/Hispanic,5,Emergency,Skilled Nursing Home,2020,SYM007,MALAISE AND FATIGUE,,,861,"SIGNS, SYMPTOMS & OTHER FACTORS INFLUENCING HEALTH STATUS",23,FACTORS INFLUENCING HEALTH STATUS AND OTHER CONTACTS WITH HEALTH SERVICES,2,Moderate,Minor,Medical,Medicare,Private Health Insurance,,,,Y,61904.31,8504.13
New York City,Manhattan,7002024,001456,Mount Sinai Hospital,50 to 69,104,M,Black/African American,Not Span/Hispanic,14,Emergency,Home or Self Care,2020,NEO074,CONDITIONS DUE TO NEOPLASM OR THE TREATMENT OF NEOPLASM,URN003,URETER AND OTHER URINARY TRACT DILATION,861,"SIGNS, SYMPTOMS & OTHER FACTORS INFLUENCING HEALTH STATUS",23,FACTORS INFLUENCING HEALTH STATUS AND OTHER CONTACTS WITH HEALTH SERVICES,3,Major,Major,Medical,Blue Cross/Blue Shield,Self-Pay,,,,Y,186633.71,46804.06
New York City,Bronx,7000006,001169,Montefiore Medical Center - Henry & Lucy Moses Div,50 to 69,104,F,Other Race,Spanish/Hispanic,2,Emergency,Home w/ Home Health Services,2020,NVS019,NERVOUS SYSTEM PAIN AND PAIN SYNDROMES,,,861,"SIGNS, SYMPTOMS & OTHER FACTORS INFLUENCING HEALTH STATUS",23,FACTORS INFLUENCING HEALTH STATUS AND OTHER CONTACTS WITH HEALTH SERVICES,2,Moderate,Moderate,Medical,Medicaid,,,,,Y,30662.27,5111.94
New York City,Bronx,7000006,001169,Montefiore Medical Center - Henry & Lucy Moses Div,30 to 49,104,M,Black/African American,Not Span/Hispanic,1,Emergency,Home or Self Care,2020,NVS019,NERVOUS SYSTEM PAIN AND PAIN SYNDROMES,,,861,"SIGNS, SYMPTOMS & OTHER FACTORS INFLUENCING HEALTH STATUS",23,FACTORS INFLUENCING HEALTH STATUS AND OTHER CONTACTS WITH HEALTH SERVICES,1,Minor,Minor,Medical,Medicaid,,,,,Y,31414.4,3796.62
New York City,Bronx,7000006,003058,Montefiore Med Center - Jack D Weiler Hosp of A Einstein College Div,0 to 17,104,F,Other Race,Unknown,120 +,Emergency,Facility w/ Custodial/Supportive Care,2020,PNL013,OTHER SPECIFIED AND UNSPECIFIED PERINATAL CONDITIONS,ESA004,NON-INVASIVE VENTILATION,861,"SIGNS, SYMPTOMS & OTHER FACTORS INFLUENCING HEALTH STATUS",23,FACTORS INFLUENCING HEALTH STATUS AND OTHER CONTACTS WITH HEALTH SERVICES,4,Extreme,Major,Medical,Private Health Insurance,Medicaid,,03700,,N,2573414.1,329922.69
New York City,Bronx,7000006,001169,Montefiore Medical Center - Henry & Lucy Moses Div,50 to 69,104,M,Black/African American,Not Span/Hispanic,2,Emergency,Home w/ Home Health Services,2020,NEO074,CONDITIONS DUE TO NEOPLASM OR THE TREATMENT OF NEOPLASM,,,861,"SIGNS, SYMPTOMS & OTHER FACTORS INFLUENCING HEALTH STATUS",23,FACTORS INFLUENCING HEALTH STATUS AND OTHER CONTACTS WITH HEALTH SERVICES,2,Moderate,Major,Medical,Private Health Insurance,Medicare,,,,Y,36888.45,5336.74
Capital/Adirond,Otsego,3801000,000739,A.O. Fox Memorial Hospital,70 or Older,138,M,White,Not Span/Hispanic,5,Emergency,Skilled Nursing Home,2020,SYM007,MALAISE AND FATIGUE,,,861,"SIGNS, SYMPTOMS & OTHER FACTORS INFLUENCING HEALTH STATUS",23,FACTORS INFLUENCING HEALTH STATUS AND OTHER CONTACTS WITH HEALTH SERVICES,2,Moderate,Moderate,Medical,Medicare,,,,,Y,11397.89,7760.9
New York City,Bronx,7000006,001169,Montefiore Medical Center - Henry & Lucy Moses Div,70 or Older,104,F,Black/African American,Not Span/Hispanic,4,Emergency,Home w/ Home Health Services,2020,SYM010,NERVOUS SYSTEM SIGNS AND SYMPTOMS,CNS002,LUMBAR PUNCTURE,861,"SIGNS, SYMPTOMS & OTHER FACTORS INFLUENCING HEALTH STATUS",23,FACTORS INFLUENCING HEALTH STATUS AND OTHER CONTACTS WITH HEALTH SERVICES,2,Moderate,Moderate,Medical,Medicare,,,,,Y,77090.91,11256.78
Hudson Valley,Westchester,5903001,001061,Montefiore Mount Vernon Hospital,50 to 69,105,F,Black/African American,Unknown,2,Emergency,Court/Law Enforcement,2020,SYM007,MALAISE AND FATIGUE,,,861,"SIGNS, SYMPTOMS & OTHER FACTORS INFLUENCING HEALTH STATUS",23,FACTORS INFLUENCING HEALTH STATUS AND OTHER CONTACTS WITH HEALTH SERVICES,2,Moderate,Minor,Medical,Medicaid,Self-Pay,,,,Y,18231.3,6077.34
New York City,Bronx,7000006,003058,Montefiore Med Center - Jack D Weiler Hosp of A Einstein College Div,70 or Older,104,M,Other Race,Spanish/Hispanic,6,Emergency,Home w/ Home Health Services,2020,SYM007,MALAISE AND FATIGUE,,,861,"SIGNS, SYMPTOMS & OTHER FACTORS INFLUENCING HEALTH STATUS",23,FACTORS INFLUENCING HEALTH STATUS AND OTHER CONTACTS WITH HEALTH SERVICES,1,Minor,Moderate,Medical,Medicare,,,,,Y,60606.39,11985.01
New York City,Bronx,7000006,001168,Montefiore Medical Center-Wakefield Hospital,18 to 29,104,F,Black/African American,Not Span/Hispanic,1,Emergency,Home or Self Care,2020,SYM017,ABNORMAL FINDINGS WITHOUT DIAGNOSIS,ADM021,"ADMINISTRATION OF THERAPEUTIC SUBSTANCES, NEC",861,"SIGNS, SYMPTOMS & OTHER FACTORS INFLUENCING HEALTH STATUS",23,FACTORS INFLUENCING HEALTH STATUS AND OTHER CONTACTS WITH HEALTH SERVICES,1,Minor,Minor,Medical,Private Health Insurance,,,,,Y,36006.97,4325.34
New York City,Bronx,7000006,001169,Montefiore Medical Center - Henry & Lucy Moses Div,50 to 69,104,F,Other Race,Unknown,3,Emergency,Home or Self Care,2020,NEO074,CONDITIONS DUE TO NEOPLASM OR THE TREATMENT OF NEOPLASM,,,861,"SIGNS, SYMPTOMS & OTHER FACTORS INFLUENCING HEALTH STATUS",23,FACTORS INFLUENCING HEALTH STATUS AND OTHER CONTACTS WITH HEALTH SERVICES,2,Moderate,Major,Medical,Medicaid,,,,,Y,41072.14,7285.52
New York City,Bronx,7000006,001169,Montefiore Medical Center - Henry & Lucy Moses Div,50 to 69,104,F,Black/African American,Spanish/Hispanic,1,Emergency,Home or Self Care,2020,SYM007,MALAISE AND FATIGUE,,,861,"SIGNS, SYMPTOMS & OTHER FACTORS INFLUENCING HEALTH STATUS",23,FACTORS INFLUENCING HEALTH STATUS AND OTHER CONTACTS WITH HEALTH SERVICES,1,Minor,Minor,Medical,Private Health Insurance,,,,,Y,31594.49,3578.72
New York City,Bronx,7000006,001169,Montefiore Medical Center - Henry & Lucy Moses Div,0 to 17,104,M,Black/African American,Not Span/Hispanic,1,Emergency,Home or Self Care,2020,FAC003,"ENCOUNTER FOR OBSERVATION AND EXAMINATION FOR CONDITIONS RULED OUT (EXCLUDES INFECTIOUS DISEASE, NEOPLASM, MENTAL DISORDERS)",IMG005,MAGNETIC RESONANCE IMAGING (MRI),861,"SIGNS, SYMPTOMS & OTHER FACTORS INFLUENCING HEALTH STATUS",23,FACTORS INFLUENCING HEALTH STATUS AND OTHER CONTACTS WITH HEALTH SERVICES,2,Moderate,Minor,Medical,Medicaid,,,,,N,27485.78,5995.91
New York City,Bronx,7000006,001169,Montefiore Medical Center - Henry & Lucy Moses Div,70 or Older,107,F,Other Race,Unknown,2,Emergency,Home or Self Care,2020,SYM017,ABNORMAL FINDINGS WITHOUT DIAGNOSIS,,,861,"SIGNS, SYMPTOMS & OTHER FACTORS INFLUENCING HEALTH STATUS",23,FACTORS INFLUENCING HEALTH STATUS AND OTHER CONTACTS WITH HEALTH SERVICES,2,Moderate,Moderate,Medical,Medicare,Private Health Insurance,,,,N,22055.18,4272.94
New York City,Bronx,7000006,003058,Montefiore Med Center - Jack D Weiler Hosp of A Einstein College Div,70 or Older,104,M,White,Not Span/Hispanic,3,Emergency,Skilled Nursing Home,2020,SYM007,MALAISE AND FATIGUE,SKB006,SKIN LACERATION REPAIR (EXCLUDING PERINEUM),861,"SIGNS, SYMPTOMS & OTHER FACTORS INFLUENCING HEALTH STATUS",23,FACTORS INFLUENCING HEALTH STATUS AND OTHER CONTACTS WITH HEALTH SERVICES,2,Moderate,Minor,Medical,Medicare,Private Health Insurance,,,,Y,28402.85,4777.9
New York City,Manhattan,7002032,001469,Mount Sinai Morningside,30 to 49,113,M,Other Race,Spanish/Hispanic,3,Emergency,Home or Self Care,2020,NVS019,NERVOUS SYSTEM PAIN AND PAIN SYNDROMES,ADM021,"ADMINISTRATION OF THERAPEUTIC SUBSTANCES, NEC",861,"SIGNS, SYMPTOMS & OTHER FACTORS INFLUENCING HEALTH STATUS",23,FACTORS INFLUENCING HEALTH STATUS AND OTHER CONTACTS WITH HEALTH SERVICES,2,Moderate,Minor,Medical,Private Health Insurance,Self-Pay,,,,Y,35020.75,7719.64
New York City,Kings,7002002,001324,Mount Sinai Brooklyn,70 or Older,112,F,White,Unknown,4,Emergency,Skilled Nursing Home,2020,SYM007,MALAISE AND FATIGUE,,,861,"SIGNS, SYMPTOMS & OTHER FACTORS INFLUENCING HEALTH STATUS",23,FACTORS INFLUENCING HEALTH STATUS AND OTHER CONTACTS WITH HEALTH SERVICES,2,Moderate,Minor,Medical,Medicare,Self-Pay,,,,Y,44917.66,8286.59
New York City,Manhattan,7002032,001469,Mount Sinai Morningside,50 to 69,100,M,Other Race,Spanish/Hispanic,3,Urgent,Home w/ Home Health Services,2020,NVS019,NERVOUS SYSTEM PAIN AND PAIN SYNDROMES,ADM017,ADMINISTRATION OF NUTRITIONAL AND ELECTROLYTIC SUBSTANCES,861,"SIGNS, SYMPTOMS & OTHER FACTORS INFLUENCING HEALTH STATUS",23,FACTORS INFLUENCING HEALTH STATUS AND OTHER CONTACTS WITH HEALTH SERVICES,3,Major,Major,Medical,Medicaid,Medicaid,Self-Pay,,,N,32004.91,6815.05
New York City,Manhattan,7002032,001469,Mount Sinai Morningside,70 or Older,100,M,Other Race,Spanish/Hispanic,3,Emergency,Home or Self Care,2020,SYM010,NERVOUS SYSTEM SIGNS AND SYMPTOMS,MAM011,ELECTROENCEPHALOGRAM (EEG),861,"SIGNS, SYMPTOMS & OTHER FACTORS INFLUENCING HEALTH STATUS",23,FACTORS INFLUENCING HEALTH STATUS AND OTHER CONTACTS WITH HEALTH SERVICES,2,Moderate,Moderate,Medical,Medicare,Medicaid,Self-Pay,,,Y,45159.39,9534.55
New York City,Manhattan,7002032,001469,Mount Sinai Morningside,70 or Older,100,M,Black/African American,Not Span/Hispanic,3,Emergency,Home w/ Home Health Services,2020,SYM007,MALAISE AND FATIGUE,ADM021,"ADMINISTRATION OF THERAPEUTIC SUBSTANCES, NEC",861,"SIGNS, SYMPTOMS & OTHER FACTORS INFLUENCING HEALTH STATUS",23,FACTORS INFLUENCING HEALTH STATUS AND OTHER CONTACTS WITH HEALTH SERVICES,1,Minor,Minor,Medical,Private Health Insurance,Medicare,Self-Pay,,,Y,35267.85,7598.84
New York City,Kings,7002002,001324,Mount Sinai Brooklyn,18 to 29,112,M,Black/African American,Unknown,69,Emergency,Skilled Nursing Home,2020,SYM010,NERVOUS SYSTEM SIGNS AND SYMPTOMS,ADM017,ADMINISTRATION OF NUTRITIONAL AND ELECTROLYTIC SUBSTANCES,861,"SIGNS, SYMPTOMS & OTHER FACTORS INFLUENCING HEALTH STATUS",23,FACTORS INFLUENCING HEALTH STATUS AND OTHER CONTACTS WITH HEALTH SERVICES,3,Major,Moderate,Medical,Medicaid,Self-Pay,,,,Y,666919.72,83433.23
New York City,Manhattan,7002002,001439,Mount Sinai Beth Israel,30 to 49,100,F,Other Race,Spanish/Hispanic,2,Emergency,Home or Self Care,2020,NVS019,NERVOUS SYSTEM PAIN AND PAIN SYNDROMES,ADM021,"ADMINISTRATION OF THERAPEUTIC SUBSTANCES, NEC",861,"SIGNS, SYMPTOMS & OTHER FACTORS INFLUENCING HEALTH STATUS",23,FACTORS INFLUENCING HEALTH STATUS AND OTHER CONTACTS WITH HEALTH SERVICES,1,Minor,Minor,Medical,Medicaid,Medicaid,Self-Pay,,,N,30101.11,5480.25
New York City,Manhattan,7002032,001466,Mount Sinai West,30 to 49,112,M,Other Race,Not Span/Hispanic,7,Emergency,Home or Self Care,2020,SYM017,ABNORMAL FINDINGS WITHOUT DIAGNOSIS,IMG008,ULTRASONOGRAPHY,861,"SIGNS, SYMPTOMS & OTHER FACTORS INFLUENCING HEALTH STATUS",23,FACTORS INFLUENCING HEALTH STATUS AND OTHER CONTACTS WITH HEALTH SERVICES,3,Major,Moderate,Medical,Medicaid,Medicaid,Self-Pay,,,Y,79894.2,16704.22
New York City,Manhattan,7002032,001466,Mount Sinai West,70 or Older,112,M,White,Spanish/Hispanic,1,Emergency,Home or Self Care,2020,NVS019,NERVOUS SYSTEM PAIN AND PAIN SYNDROMES,IMG009,PLAIN RADIOGRAPHY,861,"SIGNS, SYMPTOMS & OTHER FACTORS INFLUENCING HEALTH STATUS",23,FACTORS INFLUENCING HEALTH STATUS AND OTHER CONTACTS WITH HEALTH SERVICES,1,Minor,Minor,Medical,Medicare,Medicare,Self-Pay,,,N,10493.57,2238.58
New York City,Manhattan,7002002,001439,Mount Sinai Beth Israel,70 or Older,112,F,Other Race,Unknown,3,Emergency,Skilled Nursing Home,2020,SYM007,MALAISE AND FATIGUE,IMG008,ULTRASONOGRAPHY,861,"SIGNS, SYMPTOMS & OTHER FACTORS INFLUENCING HEALTH STATUS",23,FACTORS INFLUENCING HEALTH STATUS AND OTHER CONTACTS WITH HEALTH SERVICES,2,Moderate,Major,Medical,Medicare,Medicaid,Self-Pay,,,Y,42012.08,9636.09
New York City,Manhattan,7002032,001466,Mount Sinai West,50 to 69,112,M,Black/African American,Not Span/Hispanic,3,Emergency,Home or Self Care,2020,NEO074,CONDITIONS DUE TO NEOPLASM OR THE TREATMENT OF NEOPLASM,ADM014,REGIONAL ANESTHESIA,861,"SIGNS, SYMPTOMS & OTHER FACTORS INFLUENCING HEALTH STATUS",23,FACTORS INFLUENCING HEALTH STATUS AND OTHER CONTACTS WITH HEALTH SERVICES,2,Moderate,Moderate,Medical,Medicare,Medicare,Medicaid,,,Y,34826.36,8252.17
Hudson Valley,Westchester,5901000,001039,NewYork-Presbyterian/Hudson Valley Hospital,50 to 69,105,M,White,Not Span/Hispanic,1,Emergency,Home or Self Care,2020,FAC025,OTHER SPECIFIED STATUS,ADM021,"ADMINISTRATION OF THERAPEUTIC SUBSTANCES, NEC",861,"SIGNS, SYMPTOMS & OTHER FACTORS INFLUENCING HEALTH STATUS",23,FACTORS INFLUENCING HEALTH STATUS AND OTHER CONTACTS WITH HEALTH SERVICES,1,Minor,Minor,Medical,Medicaid,,,,,Y,11753.04,4516.7
New York City,Bronx,7000006,003058,Montefiore Med Center - Jack D Weiler Hosp of A Einstein College Div,30 to 49,104,M,Other Race,Spanish/Hispanic,13,Emergency,Home w/ Home Health Services,2020,SYM017,ABNORMAL FINDINGS WITHOUT DIAGNOSIS,ESA001,HEMODIALYSIS,861,"SIGNS, SYMPTOMS & OTHER FACTORS INFLUENCING HEALTH STATUS",23,FACTORS INFLUENCING HEALTH STATUS AND OTHER CONTACTS WITH HEALTH SERVICES,2,Moderate,Major,Medical,Medicare,Medicaid,,,,Y,166211.1,32051.99
Hudson Valley,Westchester,5901000,001039,NewYork-Presbyterian/Hudson Valley Hospital,70 or Older,105,F,White,Not Span/Hispanic,7,Emergency,Skilled Nursing Home,2020,SYM007,MALAISE AND FATIGUE,ADM021,"ADMINISTRATION OF THERAPEUTIC SUBSTANCES, NEC",861,"SIGNS, SYMPTOMS & OTHER FACTORS INFLUENCING HEALTH STATUS",23,FACTORS INFLUENCING HEALTH STATUS AND OTHER CONTACTS WITH HEALTH SERVICES,2,Moderate,Moderate,Medical,Medicare,,,,,Y,29660.23,12444.83
New York City,Manhattan,7002024,001456,Mount Sinai Hospital,30 to 49,100,F,Black/African American,Not Span/Hispanic,3,Emergency,Home or Self Care,2020,SYM017,ABNORMAL FINDINGS WITHOUT DIAGNOSIS,IMG004,FLUOROSCOPY OF NON-CIRCULATORY ORGANS,861,"SIGNS, SYMPTOMS & OTHER FACTORS INFLUENCING HEALTH STATUS",23,FACTORS INFLUENCING HEALTH STATUS AND OTHER CONTACTS WITH HEALTH SERVICES,1,Minor,Minor,Medical,Blue Cross/Blue Shield,Self-Pay,,,,Y,42244.25,9516.68
New York City,Manhattan,7002024,001456,Mount Sinai Hospital,30 to 49,104,F,White,Not Span/Hispanic,3,Urgent,Home or Self Care,2020,SYM010,NERVOUS SYSTEM SIGNS AND SYMPTOMS,MAM011,ELECTROENCEPHALOGRAM (EEG),861,"SIGNS, SYMPTOMS & OTHER FACTORS INFLUENCING HEALTH STATUS",23,FACTORS INFLUENCING HEALTH STATUS AND OTHER CONTACTS WITH HEALTH SERVICES,1,Minor,Minor,Medical,"Managed Care, Unspecified",Medicaid,Self-Pay,,,N,42693.07,9001.43
New York City,Manhattan,7002024,001456,Mount Sinai Hospital,70 or Older,100,M,Black/African American,Not Span/Hispanic,37,Emergency,Hospice - Medical Facility,2020,NEO074,CONDITIONS DUE TO NEOPLASM OR THE TREATMENT OF NEOPLASM,ADM001,TRANSFUSION OF BLOOD AND BLOOD PRODUCTS,861,"SIGNS, SYMPTOMS & OTHER FACTORS INFLUENCING HEALTH STATUS",23,FACTORS INFLUENCING HEALTH STATUS AND OTHER CONTACTS WITH HEALTH SERVICES,4,Extreme,Major,Medical,Medicare,Blue Cross/Blue Shield,Self-Pay,,,Y,501289.64,122069.41
New York City,Bronx,7000006,001169,Montefiore Medical Center - Henry & Lucy Moses Div,70 or Older,104,M,White,Not Span/Hispanic,8,Emergency,Hospice - Medical Facility,2020,NEO074,CONDITIONS DUE TO NEOPLASM OR THE TREATMENT OF NEOPLASM,,,861,"SIGNS, SYMPTOMS & OTHER FACTORS INFLUENCING HEALTH STATUS",23,FACTORS INFLUENCING HEALTH STATUS AND OTHER CONTACTS WITH HEALTH SERVICES,2,Moderate,Major,Medical,Medicare,Medicaid,,,,Y,101939.26,18656.64
New York City,Bronx,7000006,001169,Montefiore Medical Center - Henry & Lucy Moses Div,70 or Older,104,F,Other Race,Spanish/Hispanic,3,Emergency,Home or Self Care,2020,SYM010,NERVOUS SYSTEM SIGNS AND SYMPTOMS,CNS002,LUMBAR PUNCTURE,861,"SIGNS, SYMPTOMS & OTHER FACTORS INFLUENCING HEALTH STATUS",23,FACTORS INFLUENCING HEALTH STATUS AND OTHER CONTACTS WITH HEALTH SERVICES,2,Moderate,Minor,Medical,Medicare,Medicaid,,,,Y,60836.53,8542.5
New York City,Bronx,7000006,001169,Montefiore Medical Center - Henry & Lucy Moses Div,0 to 17,104,M,Other Race,Spanish/Hispanic,4,Emergency,Home or Self Care,2020,SYM007,MALAISE AND FATIGUE,,,861,"SIGNS, SYMPTOMS & OTHER FACTORS INFLUENCING HEALTH STATUS",23,FACTORS INFLUENCING HEALTH STATUS AND OTHER CONTACTS WITH HEALTH SERVICES,1,Minor,Minor,Medical,Medicaid,,,,,N,58456.1,13191.59
New York City,Bronx,7000006,003058,Montefiore Med Center - Jack D Weiler Hosp of A Einstein College Div,70 or Older,104,F,White,Not Span/Hispanic,5,Emergency,Skilled Nursing Home,2020,NVS019,NERVOUS SYSTEM PAIN AND PAIN SYNDROMES,,,861,"SIGNS, SYMPTOMS & OTHER FACTORS INFLUENCING HEALTH STATUS",23,FACTORS INFLUENCING HEALTH STATUS AND OTHER CONTACTS WITH HEALTH SERVICES,3,Major,Moderate,Medical,Medicare,Medicaid,,,,Y,59579.25,11394.75
New York City,Bronx,7000006,003058,Montefiore Med Center - Jack D Weiler Hosp of A Einstein College Div,70 or Older,104,F,Black/African American,Not Span/Hispanic,3,Emergency,Skilled Nursing Home,2020,SYM007,MALAISE AND FATIGUE,ADM017,ADMINISTRATION OF NUTRITIONAL AND ELECTROLYTIC SUBSTANCES,861,"SIGNS, SYMPTOMS & OTHER FACTORS INFLUENCING HEALTH STATUS",23,FACTORS INFLUENCING HEALTH STATUS AND OTHER CONTACTS WITH HEALTH SERVICES,1,Minor,Minor,Medical,Medicare,Medicaid,,,,Y,30695.88,5508.3
New York City,Bronx,7000006,001169,Montefiore Medical Center - Henry & Lucy Moses Div,50 to 69,115,F,Other Race,Unknown,5,Emergency,Home or Self Care,2020,SYM017,ABNORMAL FINDINGS WITHOUT DIAGNOSIS,HEP009,PANCREATIC AND PROXIMAL BILIARY DILATION AND STENTING,861,"SIGNS, SYMPTOMS & OTHER FACTORS INFLUENCING HEALTH STATUS",23,FACTORS INFLUENCING HEALTH STATUS AND OTHER CONTACTS WITH HEALTH SERVICES,2,Moderate,Moderate,Medical,Blue Cross/Blue Shield,,,,,N,134791.77,28288.19
New York City,Bronx,7000006,001169,Montefiore Medical Center - Henry & Lucy Moses Div,70 or Older,104,M,Other Race,Not Span/Hispanic,7,Emergency,Expired,2020,NEO074,CONDITIONS DUE TO NEOPLASM OR THE TREATMENT OF NEOPLASM,,,861,"SIGNS, SYMPTOMS & OTHER FACTORS INFLUENCING HEALTH STATUS",23,FACTORS INFLUENCING HEALTH STATUS AND OTHER CONTACTS WITH HEALTH SERVICES,3,Major,Major,Medical,Medicare,Medicaid,,,,Y,86600.54,15822.7
Long Island,Nassau,2908000,000511,NYU Langone Hospital-Long Island,50 to 69,115,F,White,Not Span/Hispanic,3,Emergency,Home or Self Care,2020,NEO074,CONDITIONS DUE TO NEOPLASM OR THE TREATMENT OF NEOPLASM,,,861,"SIGNS, SYMPTOMS & OTHER FACTORS INFLUENCING HEALTH STATUS",23,FACTORS INFLUENCING HEALTH STATUS AND OTHER CONTACTS WITH HEALTH SERVICES,2,Moderate,Major,Medical,Blue Cross/Blue Shield,,,,,Y,37110.43,11404.54
New York City,Manhattan,7002054,003975,New York Presbyterian Hospital - Allen Hospital,70 or Older,100,M,Other Race,Multi-ethnic,1,Emergency,Home or Self Care,2020,SYM015,GENERAL SENSATION/PERCEPTION SIGNS AND SYMPTOMS,,,861,"SIGNS, SYMPTOMS & OTHER FACTORS INFLUENCING HEALTH STATUS",23,FACTORS INFLUENCING HEALTH STATUS AND OTHER CONTACTS WITH HEALTH SERVICES,2,Moderate,Moderate,Medical,Medicare,Medicare,Medicaid,,,Y,18553.11,3973.14
New York City,Manhattan,7002054,003975,New York Presbyterian Hospital - Allen Hospital,70 or Older,104,F,Other Race,Not Span/Hispanic,2,Emergency,Home or Self Care,2020,SYM017,ABNORMAL FINDINGS WITHOUT DIAGNOSIS,,,861,"SIGNS, SYMPTOMS & OTHER FACTORS INFLUENCING HEALTH STATUS",23,FACTORS INFLUENCING HEALTH STATUS AND OTHER CONTACTS WITH HEALTH SERVICES,1,Minor,Minor,Medical,Medicare,Blue Cross/Blue Shield,Self-Pay,,,Y,27820.68,6000.69
Long Island,Nassau,2908000,000511,NYU Langone Hospital-Long Island,50 to 69,115,F,Black/African American,Not Span/Hispanic,1,Emergency,Left Against Medical Advice,2020,SYM010,NERVOUS SYSTEM SIGNS AND SYMPTOMS,,,861,"SIGNS, SYMPTOMS & OTHER FACTORS INFLUENCING HEALTH STATUS",23,FACTORS INFLUENCING HEALTH STATUS AND OTHER CONTACTS WITH HEALTH SERVICES,3,Major,Major,Medical,Medicare,Blue Cross/Blue Shield,,,,Y,14962.03,4233.72
New York City,Manhattan,7002012,001447,Hospital for Special Surgery,18 to 29,,F,White,Not Span/Hispanic,1,Urgent,Home or Self Care,2020,NVS019,NERVOUS SYSTEM PAIN AND PAIN SYNDROMES,,,861,"SIGNS, SYMPTOMS & OTHER FACTORS INFLUENCING HEALTH STATUS",23,FACTORS INFLUENCING HEALTH STATUS AND OTHER CONTACTS WITH HEALTH SERVICES,1,Minor,Minor,Medical,Blue Cross/Blue Shield,Private Health Insurance,,,,N,8216,4581.72
New York City,Bronx,7000006,001169,Montefiore Medical Center - Henry & Lucy Moses Div,70 or Older,104,M,Black/African American,Not Span/Hispanic,3,Emergency,Home or Self Care,2020,NVS019,NERVOUS SYSTEM PAIN AND PAIN SYNDROMES,,,861,"SIGNS, SYMPTOMS & OTHER FACTORS INFLUENCING HEALTH STATUS",23,FACTORS INFLUENCING HEALTH STATUS AND OTHER CONTACTS WITH HEALTH SERVICES,1,Minor,Moderate,Medical,Medicare,,,,,Y,50420.63,7902.15
New York City,Bronx,7000006,003058,Montefiore Med Center - Jack D Weiler Hosp of A Einstein College Div,70 or Older,104,M,Other Race,Unknown,1,Emergency,Home or Self Care,2020,SYM007,MALAISE AND FATIGUE,IMG008,ULTRASONOGRAPHY,861,"SIGNS, SYMPTOMS & OTHER FACTORS INFLUENCING HEALTH STATUS",23,FACTORS INFLUENCING HEALTH STATUS AND OTHER CONTACTS WITH HEALTH SERVICES,3,Major,Major,Medical,Medicare,,,,,Y,31194.53,4820.98
New York City,Manhattan,7002054,001464,New York-Presbyterian Hospital - Columbia Presbyterian Center,70 or Older,100,M,Other Race,Spanish/Hispanic,7,Emergency,Home w/ Home Health Services,2020,NEO074,CONDITIONS DUE TO NEOPLASM OR THE TREATMENT OF NEOPLASM,IMG004,FLUOROSCOPY OF NON-CIRCULATORY ORGANS,861,"SIGNS, SYMPTOMS & OTHER FACTORS INFLUENCING HEALTH STATUS",23,FACTORS INFLUENCING HEALTH STATUS AND OTHER CONTACTS WITH HEALTH SERVICES,2,Moderate,Moderate,Medical,Medicare,Medicare,Medicaid,,,Y,81554.07,17928.55
New York City,Manhattan,7002054,001464,New York-Presbyterian Hospital - Columbia Presbyterian Center,70 or Older,100,F,White,Not Span/Hispanic,1,Elective,Home or Self Care,2020,FAC014,MEDICAL EXAMINATION/EVALUATION,,,861,"SIGNS, SYMPTOMS & OTHER FACTORS INFLUENCING HEALTH STATUS",23,FACTORS INFLUENCING HEALTH STATUS AND OTHER CONTACTS WITH HEALTH SERVICES,1,Minor,Minor,Medical,Miscellaneous/Other,Self-Pay,,,,N,9845,2122.33
New York City,Manhattan,7002054,001464,New York-Presbyterian Hospital - Columbia Presbyterian Center,50 to 69,100,F,Black/African American,Not Span/Hispanic,21,Emergency,Skilled Nursing Home,2020,NEO074,CONDITIONS DUE TO NEOPLASM OR THE TREATMENT OF NEOPLASM,CAR024,VENOUS AND ARTERIAL CATHETER PLACEMENT,861,"SIGNS, SYMPTOMS & OTHER FACTORS INFLUENCING HEALTH STATUS",23,FACTORS INFLUENCING HEALTH STATUS AND OTHER CONTACTS WITH HEALTH SERVICES,4,Extreme,Extreme,Medical,Medicare,Blue Cross/Blue Shield,Self-Pay,,,Y,284393.01,79240.64