Hospital Service Area,Hospital County,Operating Certificate Number,Permanent Facility Id,Facility Name,Age Group,Zip Code - 3 digits,Gender,Race,Ethnicity,Length of Stay,Type of Admission,Patient Disposition,Discharge Year,CCS Diagnosis Code,CCS Diagnosis Description,CCS Procedure Code,CCS Procedure Description,APR DRG Code,APR DRG Description,APR MDC Code,APR MDC Description,APR Severity of Illness Code,APR Severity of Illness Description,APR Risk of Mortality,APR Medical Surgical Description,Payment Typology 1,Payment Typology 2,Payment Typology 3,Birth Weight,Abortion Edit Indicator,Emergency Department Indicator,Total Charges,Total Costs
New York City,Manhattan,7002001,001438,Bellevue Hospital Center,50 to 69,112,F,Black/African American,Not Span/Hispanic,14,Emergency,Home w/ Home Health Services,2017,257,Other aftercare,213,"PHYS THER EXER, MANIPUL",862,Other aftercare & convalescence,23,"Rehabilitation, Aftercare, Other Factors Influencing Health Status and Other Health Service Contacts",2,Moderate,Minor,Medical,Blue Cross/Blue Shield,,,,N,N,23585.58,15206.76
New York City,Manhattan,7002001,001438,Bellevue Hospital Center,30 to 49,104,M,Other Race,Not Span/Hispanic,2,Emergency,Short-term Hospital,2017,257,Other aftercare,215,OT PHYS THER/REHAB,862,Other aftercare & convalescence,23,"Rehabilitation, Aftercare, Other Factors Influencing Health Status and Other Health Service Contacts",1,Minor,Minor,Medical,Self-Pay,,,,N,N,3344.51,2156.37
New York City,Manhattan,7002001,001438,Bellevue Hospital Center,18 to 29,112,F,Black/African American,Not Span/Hispanic,9,Emergency,Home w/ Home Health Services,2017,257,Other aftercare,215,OT PHYS THER/REHAB,862,Other aftercare & convalescence,23,"Rehabilitation, Aftercare, Other Factors Influencing Health Status and Other Health Service Contacts",2,Moderate,Minor,Medical,Self-Pay,,,,N,N,43457.75,28019.30
New York City,Manhattan,7002001,001438,Bellevue Hospital Center,30 to 49,113,M,Black/African American,Not Span/Hispanic,1,Elective,Home or Self Care,2017,228,Skull and face fractures,214,"TRACTN, SPLNT, OT WOUND",862,Other aftercare & convalescence,23,"Rehabilitation, Aftercare, Other Factors Influencing Health Status and Other Health Service Contacts",1,Minor,Minor,Medical,Department of Corrections,,,,N,N,6110.00,3939.41
New York City,Manhattan,7002001,001438,Bellevue Hospital Center,30 to 49,100,M,Other Race,Spanish/Hispanic,25,Emergency,Skilled Nursing Home,2017,257,Other aftercare,213,"PHYS THER EXER, MANIPUL",862,Other aftercare & convalescence,23,"Rehabilitation, Aftercare, Other Factors Influencing Health Status and Other Health Service Contacts",2,Moderate,Minor,Medical,Medicaid,Medicaid,,,N,N,87762.59,56584.75
New York City,Manhattan,7002001,001438,Bellevue Hospital Center,50 to 69,100,M,Other Race,Not Span/Hispanic,8,Emergency,Home or Self Care,2017,233,Intracranial injury,000,NO PROC,862,Other aftercare & convalescence,23,"Rehabilitation, Aftercare, Other Factors Influencing Health Status and Other Health Service Contacts",1,Minor,Minor,Medical,Medicaid,Medicaid,,,N,N,9301.54,5997.15
New York City,Manhattan,7002001,001438,Bellevue Hospital Center,70 or Older,112,F,Black/African American,Not Span/Hispanic,15,Emergency,Home w/ Home Health Services,2017,257,Other aftercare,215,OT PHYS THER/REHAB,862,Other aftercare & convalescence,23,"Rehabilitation, Aftercare, Other Factors Influencing Health Status and Other Health Service Contacts",2,Moderate,Moderate,Medical,Medicare,,,,N,N,69915.68,45077.99
New York City,Manhattan,7002001,001438,Bellevue Hospital Center,50 to 69,104,F,Black/African American,Not Span/Hispanic,10,Emergency,Home or Self Care,2017,257,Other aftercare,213,"PHYS THER EXER, MANIPUL",862,Other aftercare & convalescence,23,"Rehabilitation, Aftercare, Other Factors Influencing Health Status and Other Health Service Contacts",2,Moderate,Major,Medical,Private Health Insurance,,,,N,N,24762.80,15965.77
New York City,Manhattan,7002001,001438,Bellevue Hospital Center,30 to 49,100,M,Other Race,Not Span/Hispanic,14,Emergency,Home or Self Care,2017,257,Other aftercare,213,"PHYS THER EXER, MANIPUL",862,Other aftercare & convalescence,23,"Rehabilitation, Aftercare, Other Factors Influencing Health Status and Other Health Service Contacts",3,Major,Minor,Medical,Medicaid,Medicaid,,,N,N,25512.87,16449.37
New York City,Manhattan,7002001,001438,Bellevue Hospital Center,30 to 49,100,M,Black/African American,Not Span/Hispanic,9,Emergency,Home or Self Care,2017,257,Other aftercare,215,OT PHYS THER/REHAB,862,Other aftercare & convalescence,23,"Rehabilitation, Aftercare, Other Factors Influencing Health Status and Other Health Service Contacts",2,Moderate,Moderate,Medical,Medicaid,,,,N,N,16506.19,10642.33
New York City,Manhattan,7002001,001438,Bellevue Hospital Center,30 to 49,112,F,Other Race,Not Span/Hispanic,14,Emergency,Home or Self Care,2017,257,Other aftercare,213,"PHYS THER EXER, MANIPUL",862,Other aftercare & convalescence,23,"Rehabilitation, Aftercare, Other Factors Influencing Health Status and Other Health Service Contacts",2,Moderate,Minor,Medical,Medicaid,Medicaid,,,N,N,24317.62,15678.74
New York City,Manhattan,7002001,001438,Bellevue Hospital Center,30 to 49,112,M,Other Race,Not Span/Hispanic,14,Elective,Skilled Nursing Home,2017,257,Other aftercare,215,OT PHYS THER/REHAB,862,Other aftercare & convalescence,23,"Rehabilitation, Aftercare, Other Factors Influencing Health Status and Other Health Service Contacts",2,Moderate,Minor,Medical,Medicaid,Medicaid,,,N,N,69128.53,44570.48
New York City,Manhattan,7002001,001438,Bellevue Hospital Center,18 to 29,104,M,Black/African American,Not Span/Hispanic,2,Elective,Home or Self Care,2017,237,Complication of device; implant or graft,041,OT NON-OR THER PRC RESP,862,Other aftercare & convalescence,23,"Rehabilitation, Aftercare, Other Factors Influencing Health Status and Other Health Service Contacts",1,Minor,Minor,Medical,Self-Pay,,,,N,N,9561.12,6164.51
New York City,Manhattan,7002001,001438,Bellevue Hospital Center,30 to 49,112,M,Black/African American,Not Span/Hispanic,83,Emergency,Skilled Nursing Home,2017,257,Other aftercare,213,"PHYS THER EXER, MANIPUL",862,Other aftercare & convalescence,23,"Rehabilitation, Aftercare, Other Factors Influencing Health Status and Other Health Service Contacts",1,Minor,Minor,Medical,Medicaid,Medicaid,,,N,N,400457.56,258194.21
New York City,Manhattan,7002001,001438,Bellevue Hospital Center,50 to 69,104,F,Black/African American,Not Span/Hispanic,68,Emergency,Home or Self Care,2017,257,Other aftercare,213,"PHYS THER EXER, MANIPUL",862,Other aftercare & convalescence,23,"Rehabilitation, Aftercare, Other Factors Influencing Health Status and Other Health Service Contacts",2,Moderate,Minor,Medical,Medicaid,Medicaid,,,N,N,87841.00,56635.31
New York City,Manhattan,7002001,001438,Bellevue Hospital Center,50 to 69,113,M,Other Race,Not Span/Hispanic,67,Emergency,Psychiatric Hospital or Unit of Hosp,2017,257,Other aftercare,215,OT PHYS THER/REHAB,862,Other aftercare & convalescence,23,"Rehabilitation, Aftercare, Other Factors Influencing Health Status and Other Health Service Contacts",3,Major,Moderate,Medical,Self-Pay,,,,N,N,126497.53,81559.03
New York City,Manhattan,7002001,001438,Bellevue Hospital Center,50 to 69,112,F,Other Race,Not Span/Hispanic,23,Emergency,Home w/ Home Health Services,2017,257,Other aftercare,213,"PHYS THER EXER, MANIPUL",862,Other aftercare & convalescence,23,"Rehabilitation, Aftercare, Other Factors Influencing Health Status and Other Health Service Contacts",3,Major,Moderate,Medical,Medicaid,Medicaid,,,N,N,117432.40,75714.31
New York City,Manhattan,7002001,001438,Bellevue Hospital Center,50 to 69,100,F,Black/African American,Not Span/Hispanic,10,Emergency,Skilled Nursing Home,2017,257,Other aftercare,215,OT PHYS THER/REHAB,862,Other aftercare & convalescence,23,"Rehabilitation, Aftercare, Other Factors Influencing Health Status and Other Health Service Contacts",1,Minor,Minor,Medical,Medicaid,Medicaid,,,N,N,18159.87,11708.54
New York City,Manhattan,7002001,001438,Bellevue Hospital Center,70 or Older,112,M,White,Not Span/Hispanic,14,Emergency,Skilled Nursing Home,2017,257,Other aftercare,213,"PHYS THER EXER, MANIPUL",862,Other aftercare & convalescence,23,"Rehabilitation, Aftercare, Other Factors Influencing Health Status and Other Health Service Contacts",3,Major,Major,Medical,Medicaid,Medicaid,,,N,N,27713.67,17868.33
New York City,Manhattan,7002001,001438,Bellevue Hospital Center,30 to 49,100,F,Other Race,Spanish/Hispanic,10,Emergency,Home w/ Home Health Services,2017,257,Other aftercare,215,OT PHYS THER/REHAB,862,Other aftercare & convalescence,23,"Rehabilitation, Aftercare, Other Factors Influencing Health Status and Other Health Service Contacts",3,Major,Moderate,Medical,Medicaid,,,,N,N,20139.98,12985.21
New York City,Manhattan,7002001,001438,Bellevue Hospital Center,50 to 69,112,F,Black/African American,Not Span/Hispanic,20,Emergency,Home or Self Care,2017,257,Other aftercare,215,OT PHYS THER/REHAB,862,Other aftercare & convalescence,23,"Rehabilitation, Aftercare, Other Factors Influencing Health Status and Other Health Service Contacts",2,Moderate,Minor,Medical,Self-Pay,,,,N,N,107734.84,69461.82
New York City,Manhattan,7002001,001438,Bellevue Hospital Center,50 to 69,113,M,Other Race,Not Span/Hispanic,12,Emergency,Home or Self Care,2017,257,Other aftercare,213,"PHYS THER EXER, MANIPUL",862,Other aftercare & convalescence,23,"Rehabilitation, Aftercare, Other Factors Influencing Health Status and Other Health Service Contacts",1,Minor,Minor,Medical,Medicaid,Medicaid,,,N,N,19121.11,12328.30
New York City,Manhattan,7002001,001438,Bellevue Hospital Center,30 to 49,114,M,Other Race,Not Span/Hispanic,21,Emergency,Home or Self Care,2017,257,Other aftercare,215,OT PHYS THER/REHAB,862,Other aftercare & convalescence,23,"Rehabilitation, Aftercare, Other Factors Influencing Health Status and Other Health Service Contacts",3,Major,Minor,Medical,Medicaid,Medicaid,,,N,N,104032.13,67074.51
New York City,Manhattan,7002001,001438,Bellevue Hospital Center,70 or Older,101,F,Other Race,Not Span/Hispanic,14,Emergency,Home or Self Care,2017,257,Other aftercare,215,OT PHYS THER/REHAB,862,Other aftercare & convalescence,23,"Rehabilitation, Aftercare, Other Factors Influencing Health Status and Other Health Service Contacts",2,Moderate,Moderate,Medical,Medicare,Private Health Insurance,,,N,N,75326.05,48566.32
New York City,Manhattan,7002001,001438,Bellevue Hospital Center,50 to 69,100,M,Black/African American,Not Span/Hispanic,1,Emergency,Home or Self Care,2017,254,Rehabilitation care; fitting of prostheses; and adjustment of devices,183,ROUTINE CHEST X-RAY,862,Other aftercare & convalescence,23,"Rehabilitation, Aftercare, Other Factors Influencing Health Status and Other Health Service Contacts",2,Moderate,Moderate,Medical,Medicaid,,,,N,Y,7209.53,4648.33
New York City,Manhattan,7002001,001438,Bellevue Hospital Center,30 to 49,112,F,Other Race,Not Span/Hispanic,2,Emergency,Home or Self Care,2017,237,Complication of device; implant or graft,179,CT SCAN ABDOMEN,862,Other aftercare & convalescence,23,"Rehabilitation, Aftercare, Other Factors Influencing Health Status and Other Health Service Contacts",2,Moderate,Major,Medical,Medicaid,,,,N,Y,15347.84,9895.49
New York City,Manhattan,7002001,001438,Bellevue Hospital Center,50 to 69,113,M,Black/African American,Not Span/Hispanic,11,Emergency,Skilled Nursing Home,2017,257,Other aftercare,213,"PHYS THER EXER, MANIPUL",862,Other aftercare & convalescence,23,"Rehabilitation, Aftercare, Other Factors Influencing Health Status and Other Health Service Contacts",1,Minor,Minor,Medical,Private Health Insurance,,,,N,N,24965.27,16096.31
New York City,Manhattan,7002001,001438,Bellevue Hospital Center,30 to 49,112,F,Other Race,Spanish/Hispanic,5,Emergency,Short-term Hospital,2017,257,Other aftercare,215,OT PHYS THER/REHAB,862,Other aftercare & convalescence,23,"Rehabilitation, Aftercare, Other Factors Influencing Health Status and Other Health Service Contacts",3,Major,Moderate,Medical,Self-Pay,,,,N,N,8791.90,5668.56
New York City,Manhattan,7002001,001438,Bellevue Hospital Center,50 to 69,100,M,Other Race,Spanish/Hispanic,34,Emergency,Skilled Nursing Home,2017,257,Other aftercare,215,OT PHYS THER/REHAB,862,Other aftercare & convalescence,23,"Rehabilitation, Aftercare, Other Factors Influencing Health Status and Other Health Service Contacts",2,Moderate,Minor,Medical,Medicare,Medicare,,,N,N,63341.89,40839.56
New York City,Manhattan,7002001,001438,Bellevue Hospital Center,50 to 69,112,F,Black/African American,Not Span/Hispanic,11,Elective,Home or Self Care,2017,257,Other aftercare,213,"PHYS THER EXER, MANIPUL",862,Other aftercare & convalescence,23,"Rehabilitation, Aftercare, Other Factors Influencing Health Status and Other Health Service Contacts",3,Major,Moderate,Medical,Medicaid,Medicaid,,,N,N,51816.48,33408.57
New York City,Manhattan,7002001,001438,Bellevue Hospital Center,50 to 69,113,F,Other Race,Not Span/Hispanic,10,Emergency,Home or Self Care,2017,257,Other aftercare,213,"PHYS THER EXER, MANIPUL",862,Other aftercare & convalescence,23,"Rehabilitation, Aftercare, Other Factors Influencing Health Status and Other Health Service Contacts",1,Minor,Minor,Medical,Self-Pay,,,,N,N,17306.53,11158.35
New York City,Manhattan,7002001,001438,Bellevue Hospital Center,50 to 69,114,F,Other Race,Not Span/Hispanic,18,Emergency,Home or Self Care,2017,257,Other aftercare,215,OT PHYS THER/REHAB,862,Other aftercare & convalescence,23,"Rehabilitation, Aftercare, Other Factors Influencing Health Status and Other Health Service Contacts",2,Moderate,Minor,Medical,Self-Pay,,,,N,N,31455.45,20280.84
New York City,Manhattan,7002001,001438,Bellevue Hospital Center,50 to 69,112,F,Black/African American,Not Span/Hispanic,16,Emergency,Skilled Nursing Home,2017,257,Other aftercare,213,"PHYS THER EXER, MANIPUL",862,Other aftercare & convalescence,23,"Rehabilitation, Aftercare, Other Factors Influencing Health Status and Other Health Service Contacts",2,Moderate,Minor,Medical,Medicaid,,,,N,N,63485.85,40932.37
New York City,Manhattan,7002001,001438,Bellevue Hospital Center,50 to 69,112,M,Other Race,Not Span/Hispanic,15,Emergency,Skilled Nursing Home,2017,257,Other aftercare,213,"PHYS THER EXER, MANIPUL",862,Other aftercare & convalescence,23,"Rehabilitation, Aftercare, Other Factors Influencing Health Status and Other Health Service Contacts",2,Moderate,Minor,Medical,Medicaid,Medicaid,,,N,N,27600.32,17795.25
New York City,Manhattan,7002001,001438,Bellevue Hospital Center,50 to 69,100,F,Other Race,Not Span/Hispanic,15,Emergency,Skilled Nursing Home,2017,257,Other aftercare,213,"PHYS THER EXER, MANIPUL",862,Other aftercare & convalescence,23,"Rehabilitation, Aftercare, Other Factors Influencing Health Status and Other Health Service Contacts",2,Moderate,Moderate,Medical,Medicare,Blue Cross/Blue Shield,,,N,N,28844.57,18597.48
New York City,Manhattan,7002001,001438,Bellevue Hospital Center,50 to 69,100,M,Other Race,Not Span/Hispanic,15,Emergency,Skilled Nursing Home,2017,257,Other aftercare,213,"PHYS THER EXER, MANIPUL",862,Other aftercare & convalescence,23,"Rehabilitation, Aftercare, Other Factors Influencing Health Status and Other Health Service Contacts",2,Moderate,Moderate,Medical,Medicaid,Medicaid,,,N,N,60503.81,39009.71
New York City,Manhattan,7002001,001438,Bellevue Hospital Center,50 to 69,112,F,Other Race,Not Span/Hispanic,11,Emergency,Short-term Hospital,2017,257,Other aftercare,215,OT PHYS THER/REHAB,862,Other aftercare & convalescence,23,"Rehabilitation, Aftercare, Other Factors Influencing Health Status and Other Health Service Contacts",3,Major,Major,Medical,Medicare,Medicare,Medicaid,,N,N,59730.98,38511.43
New York City,Manhattan,7002001,001438,Bellevue Hospital Center,50 to 69,113,M,Other Race,Not Span/Hispanic,9,Emergency,Home w/ Home Health Services,2017,257,Other aftercare,213,"PHYS THER EXER, MANIPUL",862,Other aftercare & convalescence,23,"Rehabilitation, Aftercare, Other Factors Influencing Health Status and Other Health Service Contacts",1,Minor,Minor,Medical,Private Health Insurance,,,,N,N,48926.54,31545.29
New York City,Manhattan,7002001,001438,Bellevue Hospital Center,50 to 69,111,M,Other Race,Not Span/Hispanic,32,Emergency,Short-term Hospital,2017,257,Other aftercare,213,"PHYS THER EXER, MANIPUL",862,Other aftercare & convalescence,23,"Rehabilitation, Aftercare, Other Factors Influencing Health Status and Other Health Service Contacts",2,Moderate,Minor,Medical,Medicare,Medicare,,,N,N,175972.96,113458.21
New York City,Manhattan,7002001,001438,Bellevue Hospital Center,70 or Older,100,F,Other Race,Not Span/Hispanic,12,Emergency,Home w/ Home Health Services,2017,257,Other aftercare,213,"PHYS THER EXER, MANIPUL",862,Other aftercare & convalescence,23,"Rehabilitation, Aftercare, Other Factors Influencing Health Status and Other Health Service Contacts",2,Moderate,Moderate,Medical,Private Health Insurance,,,,N,N,22040.33,14210.46
New York City,Manhattan,7002001,001438,Bellevue Hospital Center,50 to 69,112,F,Black/African American,Not Span/Hispanic,26,Emergency,Skilled Nursing Home,2017,257,Other aftercare,215,OT PHYS THER/REHAB,862,Other aftercare & convalescence,23,"Rehabilitation, Aftercare, Other Factors Influencing Health Status and Other Health Service Contacts",2,Moderate,Major,Medical,Medicaid,Medicaid,,,N,N,129759.63,83662.26
New York City,Manhattan,7002001,001438,Bellevue Hospital Center,50 to 69,114,M,Other Race,Not Span/Hispanic,17,Emergency,Short-term Hospital,2017,257,Other aftercare,215,OT PHYS THER/REHAB,862,Other aftercare & convalescence,23,"Rehabilitation, Aftercare, Other Factors Influencing Health Status and Other Health Service Contacts",3,Major,Minor,Medical,Private Health Insurance,,,,N,N,33281.16,21457.96
New York City,Manhattan,7002001,001438,Bellevue Hospital Center,30 to 49,100,M,Black/African American,Not Span/Hispanic,19,Emergency,Home or Self Care,2017,257,Other aftercare,213,"PHYS THER EXER, MANIPUL",862,Other aftercare & convalescence,23,"Rehabilitation, Aftercare, Other Factors Influencing Health Status and Other Health Service Contacts",3,Major,Major,Medical,Medicaid,Medicaid,,,N,N,51470.92,33185.77
New York City,Manhattan,7002001,001438,Bellevue Hospital Center,30 to 49,112,F,Other Race,Spanish/Hispanic,70,Emergency,Home or Self Care,2017,257,Other aftercare,213,"PHYS THER EXER, MANIPUL",862,Other aftercare & convalescence,23,"Rehabilitation, Aftercare, Other Factors Influencing Health Status and Other Health Service Contacts",3,Major,Moderate,Medical,Self-Pay,,,,N,N,125606.79,80984.73
New York City,Manhattan,7002001,001438,Bellevue Hospital Center,50 to 69,114,F,Other Race,Not Span/Hispanic,52,Emergency,Skilled Nursing Home,2017,257,Other aftercare,213,"PHYS THER EXER, MANIPUL",862,Other aftercare & convalescence,23,"Rehabilitation, Aftercare, Other Factors Influencing Health Status and Other Health Service Contacts",3,Major,Minor,Medical,Medicaid,Medicaid,,,N,N,73656.70,47490.01
New York City,Manhattan,7002001,001438,Bellevue Hospital Center,30 to 49,104,M,Other Race,Not Span/Hispanic,29,Emergency,Skilled Nursing Home,2017,257,Other aftercare,213,"PHYS THER EXER, MANIPUL",862,Other aftercare & convalescence,23,"Rehabilitation, Aftercare, Other Factors Influencing Health Status and Other Health Service Contacts",3,Major,Minor,Medical,Private Health Insurance,Medicaid,,,N,N,61373.02,39570.13
New York City,Manhattan,7002001,001438,Bellevue Hospital Center,70 or Older,100,M,Other Race,Spanish/Hispanic,28,Emergency,Skilled Nursing Home,2017,257,Other aftercare,213,"PHYS THER EXER, MANIPUL",862,Other aftercare & convalescence,23,"Rehabilitation, Aftercare, Other Factors Influencing Health Status and Other Health Service Contacts",2,Moderate,Moderate,Medical,Medicare,Medicare,Medicaid,,N,N,43564.32,28088.01
New York City,Manhattan,7002001,001438,Bellevue Hospital Center,30 to 49,100,M,Black/African American,Not Span/Hispanic,22,Emergency,Skilled Nursing Home,2017,257,Other aftercare,213,"PHYS THER EXER, MANIPUL",862,Other aftercare & convalescence,23,"Rehabilitation, Aftercare, Other Factors Influencing Health Status and Other Health Service Contacts",2,Moderate,Minor,Medical,Medicaid,,,,N,N,121390.50,78266.28
New York City,Manhattan,7002001,001438,Bellevue Hospital Center,50 to 69,113,M,Other Race,Spanish/Hispanic,15,Emergency,Home or Self Care,2017,257,Other aftercare,213,"PHYS THER EXER, MANIPUL",862,Other aftercare & convalescence,23,"Rehabilitation, Aftercare, Other Factors Influencing Health Status and Other Health Service Contacts",3,Major,Minor,Medical,Self-Pay,,,,N,N,29212.43,18834.66
New York City,Manhattan,7002001,001438,Bellevue Hospital Center,18 to 29,103,M,Other Race,Not Span/Hispanic,8,Emergency,Home or Self Care,2017,257,Other aftercare,213,"PHYS THER EXER, MANIPUL",862,Other aftercare & convalescence,23,"Rehabilitation, Aftercare, Other Factors Influencing Health Status and Other Health Service Contacts",2,Moderate,Minor,Medical,Medicaid,Medicaid,,,N,N,42232.09,27229.06
New York City,Manhattan,7002001,001438,Bellevue Hospital Center,50 to 69,112,M,Black/African American,Not Span/Hispanic,11,Emergency,Home w/ Home Health Services,2017,257,Other aftercare,213,"PHYS THER EXER, MANIPUL",862,Other aftercare & convalescence,23,"Rehabilitation, Aftercare, Other Factors Influencing Health Status and Other Health Service Contacts",1,Minor,Minor,Medical,Medicaid,Medicaid,,,N,N,48785.11,31454.10
New York City,Manhattan,7002001,001438,Bellevue Hospital Center,50 to 69,112,F,Other Race,Not Span/Hispanic,7,Emergency,Short-term Hospital,2017,257,Other aftercare,231,OTHER THERAPEUTIC PRCS,862,Other aftercare & convalescence,23,"Rehabilitation, Aftercare, Other Factors Influencing Health Status and Other Health Service Contacts",2,Moderate,Minor,Medical,Medicare,Medicaid,,,N,N,37288.26,24041.53
New York City,Manhattan,7002001,001438,Bellevue Hospital Center,30 to 49,104,M,Other Race,Spanish/Hispanic,3,Emergency,Psychiatric Hospital or Unit of Hosp,2017,231,Other fractures,000,NO PROC,862,Other aftercare & convalescence,23,"Rehabilitation, Aftercare, Other Factors Influencing Health Status and Other Health Service Contacts",2,Moderate,Minor,Medical,Medicaid,Medicaid,,,N,Y,19245.24,12408.33
New York City,Manhattan,7002001,001438,Bellevue Hospital Center,50 to 69,114,F,Other Race,Not Span/Hispanic,11,Emergency,Skilled Nursing Home,2017,257,Other aftercare,213,"PHYS THER EXER, MANIPUL",862,Other aftercare & convalescence,23,"Rehabilitation, Aftercare, Other Factors Influencing Health Status and Other Health Service Contacts",3,Major,Moderate,Medical,Medicare,Medicare,,,N,N,24258.01,15640.30
New York City,Manhattan,7002001,001438,Bellevue Hospital Center,50 to 69,100,M,Other Race,Not Span/Hispanic,11,Emergency,Home w/ Home Health Services,2017,257,Other aftercare,213,"PHYS THER EXER, MANIPUL",862,Other aftercare & convalescence,23,"Rehabilitation, Aftercare, Other Factors Influencing Health Status and Other Health Service Contacts",1,Minor,Minor,Medical,Medicaid,Medicaid,,,N,N,51769.89,33378.53
New York City,Manhattan,7002001,001438,Bellevue Hospital Center,50 to 69,112,M,Black/African American,Not Span/Hispanic,10,Emergency,Skilled Nursing Home,2017,257,Other aftercare,213,"PHYS THER EXER, MANIPUL",862,Other aftercare & convalescence,23,"Rehabilitation, Aftercare, Other Factors Influencing Health Status and Other Health Service Contacts",2,Moderate,Minor,Medical,Medicaid,Medicaid,,,N,N,18456.43,11899.75