Hospital Service Area,Hospital County,Operating Certificate Number,Permanent Facility Id,Facility Name,Age Group,Zip Code - 3 digits,Gender,Race,Ethnicity,Length of Stay,Type of Admission,Patient Disposition,Discharge Year,CCS Diagnosis Code,CCS Diagnosis Description,CCS Procedure Code,CCS Procedure Description,APR DRG Code,APR DRG Description,APR MDC Code,APR MDC Description,APR Severity of Illness Code,APR Severity of Illness Description,APR Risk of Mortality,APR Medical Surgical Description,Payment Typology 1,Payment Typology 2,Payment Typology 3,Birth Weight,Abortion Edit Indicator,Emergency Department Indicator,Total Charges,Total Costs
New York City,Manhattan,7002054,001464,New York-Presbyterian Hospital - Columbia Presbyterian Center,0 to 17,104,M,Black/African American,Spanish/Hispanic,2,Emergency,Home or Self Care,2019,INJ037,"COMPLICATION OF OTHER SURGICAL OR MEDICAL CARE, INJURY, INITIAL ENCOUNTER",,,863,NEONATAL AFTERCARE,23,FACTORS INFLUENCING HEALTH STATUS AND OTHER CONTACTS WITH HEALTH SERVICES,2,Moderate,Minor,Medical,Medicaid,Medicaid,Self-Pay,03100,,true,22463.22,5076.9
New York City,Kings,7001021,001306,New York - Presbyterian Brooklyn Methodist Hospital,0 to 17,112,M,Other Race,Not Span/Hispanic,83,Emergency,Home or Self Care,2019,PNL002,SHORT GESTATION; LOW BIRTH WEIGHT; AND FETAL GROWTH RETARDATION,ADM017,ADMINISTRATION OF NUTRITIONAL AND ELECTROLYTIC SUBSTANCES,863,NEONATAL AFTERCARE,23,FACTORS INFLUENCING HEALTH STATUS AND OTHER CONTACTS WITH HEALTH SERVICES,4,Extreme,Major,Medical,"Managed Care, Unspecified",Medicaid,Self-Pay,,,false,964714.27,233681.13
Central NY,Oneida,3202003,000599,Faxton-St Lukes Healthcare St Lukes Division,0 to 17,134,F,Other Race,Unknown,8,Elective,Home or Self Care,2019,PNL002,SHORT GESTATION; LOW BIRTH WEIGHT; AND FETAL GROWTH RETARDATION,ADM010,VACCINATIONS,863,NEONATAL AFTERCARE,23,FACTORS INFLUENCING HEALTH STATUS AND OTHER CONTACTS WITH HEALTH SERVICES,3,Major,Moderate,Medical,Blue Cross/Blue Shield,,,,,false,21932.86,10706.86
Southern Tier,Broome,0303001,000058,United Health Services Hospitals Inc. - Wilson Medical Center,0 to 17,137,M,Other Race,Not Span/Hispanic,15,Urgent,Home or Self Care,2019,PNL002,SHORT GESTATION; LOW BIRTH WEIGHT; AND FETAL GROWTH RETARDATION,MRS001,CIRCUMCISION,863,NEONATAL AFTERCARE,23,FACTORS INFLUENCING HEALTH STATUS AND OTHER CONTACTS WITH HEALTH SERVICES,2,Moderate,Minor,Medical,Blue Cross/Blue Shield,,,01600,,false,32953,12663.99
Long Island,Nassau,2908000,000511,NYU Langone Hospital-Long Island,0 to 17,115,F,White,Not Span/Hispanic,36,Urgent,Home or Self Care,2019,PNL002,SHORT GESTATION; LOW BIRTH WEIGHT; AND FETAL GROWTH RETARDATION,ADM017,ADMINISTRATION OF NUTRITIONAL AND ELECTROLYTIC SUBSTANCES,863,NEONATAL AFTERCARE,23,FACTORS INFLUENCING HEALTH STATUS AND OTHER CONTACTS WITH HEALTH SERVICES,4,Extreme,Moderate,Medical,Blue Cross/Blue Shield,Medicaid,,,,false,422760.43,59474.53
Long Island,Nassau,2908000,000511,NYU Langone Hospital-Long Island,0 to 17,112,F,Other Race,Unknown,1,Urgent,Home or Self Care,2019,PNL002,SHORT GESTATION; LOW BIRTH WEIGHT; AND FETAL GROWTH RETARDATION,,,863,NEONATAL AFTERCARE,23,FACTORS INFLUENCING HEALTH STATUS AND OTHER CONTACTS WITH HEALTH SERVICES,2,Moderate,Minor,Medical,Medicaid,Medicaid,,,,false,7317.45,1811.43
Southern Tier,Broome,0303001,000058,United Health Services Hospitals Inc. - Wilson Medical Center,0 to 17,137,M,White,Not Span/Hispanic,34,Urgent,Home or Self Care,2019,PNL002,SHORT GESTATION; LOW BIRTH WEIGHT; AND FETAL GROWTH RETARDATION,ADM017,ADMINISTRATION OF NUTRITIONAL AND ELECTROLYTIC SUBSTANCES,863,NEONATAL AFTERCARE,23,FACTORS INFLUENCING HEALTH STATUS AND OTHER CONTACTS WITH HEALTH SERVICES,2,Moderate,Moderate,Medical,Blue Cross/Blue Shield,,,01800,,false,79157.3,28273.72
Central NY,Tompkins,5401001,000977,Cayuga Medical Center at Ithaca,0 to 17,148,F,Black/African American,Unknown,26,Urgent,Home or Self Care,2019,PNL002,SHORT GESTATION; LOW BIRTH WEIGHT; AND FETAL GROWTH RETARDATION,,,863,NEONATAL AFTERCARE,23,FACTORS INFLUENCING HEALTH STATUS AND OTHER CONTACTS WITH HEALTH SERVICES,1,Minor,Minor,Medical,Medicaid,Self-Pay,Self-Pay,,,false,36983,18604.95
Capital/Adirond,Albany,0101000,000001,Albany Medical Center Hospital,0 to 17,123,F,White,Not Span/Hispanic,11,Urgent,Home or Self Care,2019,PNL002,SHORT GESTATION; LOW BIRTH WEIGHT; AND FETAL GROWTH RETARDATION,ADM010,VACCINATIONS,863,NEONATAL AFTERCARE,23,FACTORS INFLUENCING HEALTH STATUS AND OTHER CONTACTS WITH HEALTH SERVICES,1,Minor,Minor,Medical,Blue Cross/Blue Shield,,,01800,,false,87667.64,23894.71
Southern Tier,Broome,0303001,000058,United Health Services Hospitals Inc. - Wilson Medical Center,0 to 17,139,M,Other Race,Not Span/Hispanic,11,Urgent,Home or Self Care,2019,PNL002,SHORT GESTATION; LOW BIRTH WEIGHT; AND FETAL GROWTH RETARDATION,,,863,NEONATAL AFTERCARE,23,FACTORS INFLUENCING HEALTH STATUS AND OTHER CONTACTS WITH HEALTH SERVICES,3,Major,Minor,Medical,Medicaid,Medicaid,,,,false,29839.7,11026.92
Central NY,Jefferson,2201000,000367,Samaritan Medical Center,0 to 17,136,F,Black/African American,Not Span/Hispanic,15,Urgent,Home or Self Care,2019,PNL002,SHORT GESTATION; LOW BIRTH WEIGHT; AND FETAL GROWTH RETARDATION,ADM010,VACCINATIONS,863,NEONATAL AFTERCARE,23,FACTORS INFLUENCING HEALTH STATUS AND OTHER CONTACTS WITH HEALTH SERVICES,2,Moderate,Minor,Medical,Federal/State/Local/VA,,,,,false,47609.79,5649.98
New York City,Kings,7001003,001288,Brooklyn Hospital Center - Downtown Campus,0 to 17,112,M,Black/African American,Spanish/Hispanic,27,Elective,Federal Health Care Facility,2019,PNL002,SHORT GESTATION; LOW BIRTH WEIGHT; AND FETAL GROWTH RETARDATION,ESA004,NON-INVASIVE VENTILATION,863,NEONATAL AFTERCARE,23,FACTORS INFLUENCING HEALTH STATUS AND OTHER CONTACTS WITH HEALTH SERVICES,3,Major,Minor,Medical,Medicaid,Self-Pay,,01000,,false,306557.15,34420.52
New York City,Kings,7001003,001288,Brooklyn Hospital Center - Downtown Campus,0 to 17,112,M,Black/African American,Not Span/Hispanic,20,Urgent,Home or Self Care,2019,PNL002,SHORT GESTATION; LOW BIRTH WEIGHT; AND FETAL GROWTH RETARDATION,GIS017,GASTROSTOMY,863,NEONATAL AFTERCARE,23,FACTORS INFLUENCING HEALTH STATUS AND OTHER CONTACTS WITH HEALTH SERVICES,4,Extreme,Major,Medical,Medicaid,Medicaid,Self-Pay,,,false,227865.08,25963.77
New York City,Kings,7001021,001306,New York - Presbyterian Brooklyn Methodist Hospital,0 to 17,112,F,Black/African American,Not Span/Hispanic,3,Emergency,Expired,2019,PNL002,SHORT GESTATION; LOW BIRTH WEIGHT; AND FETAL GROWTH RETARDATION,ADM017,ADMINISTRATION OF NUTRITIONAL AND ELECTROLYTIC SUBSTANCES,863,NEONATAL AFTERCARE,23,FACTORS INFLUENCING HEALTH STATUS AND OTHER CONTACTS WITH HEALTH SERVICES,3,Major,Major,Medical,Medicaid,Self-Pay,,01200,,false,35157.7,8451.4
Central NY,Jefferson,2201000,000367,Samaritan Medical Center,0 to 17,136,F,White,Not Span/Hispanic,7,Urgent,Home or Self Care,2019,PNL002,SHORT GESTATION; LOW BIRTH WEIGHT; AND FETAL GROWTH RETARDATION,,,863,NEONATAL AFTERCARE,23,FACTORS INFLUENCING HEALTH STATUS AND OTHER CONTACTS WITH HEALTH SERVICES,1,Minor,Minor,Medical,Federal/State/Local/VA,,,01800,,false,19884.83,2251.92
Central NY,Oneida,3202003,000599,Faxton-St Lukes Healthcare St Lukes Division,0 to 17,135,F,Other Race,Unknown,8,Urgent,Home or Self Care,2019,PNL002,SHORT GESTATION; LOW BIRTH WEIGHT; AND FETAL GROWTH RETARDATION,,,863,NEONATAL AFTERCARE,23,FACTORS INFLUENCING HEALTH STATUS AND OTHER CONTACTS WITH HEALTH SERVICES,3,Major,Minor,Medical,Medicaid,,,,,false,23418.47,10848.28
Hudson Valley,Rockland,4329000,000779,Good Samaritan Hospital of Suffern,0 to 17,109,M,Other Race,Spanish/Hispanic,8,Elective,Home w/ Home Health Services,2019,PNL002,SHORT GESTATION; LOW BIRTH WEIGHT; AND FETAL GROWTH RETARDATION,,,863,NEONATAL AFTERCARE,23,FACTORS INFLUENCING HEALTH STATUS AND OTHER CONTACTS WITH HEALTH SERVICES,2,Moderate,Minor,Medical,Medicaid,,,,,false,96018.13,20012.88
Finger Lakes,Monroe,2701003,000411,Rochester General Hospital,0 to 17,145,M,White,Not Span/Hispanic,4,Urgent,Home or Self Care,2019,PNL002,SHORT GESTATION; LOW BIRTH WEIGHT; AND FETAL GROWTH RETARDATION,ADM017,ADMINISTRATION OF NUTRITIONAL AND ELECTROLYTIC SUBSTANCES,863,NEONATAL AFTERCARE,23,FACTORS INFLUENCING HEALTH STATUS AND OTHER CONTACTS WITH HEALTH SERVICES,1,Minor,Minor,Medical,Private Health Insurance,,,02100,,false,8277.44,6860.75
Western NY,Erie,1401013,000218,Sisters of Charity Hospital,0 to 17,142,M,White,Not Span/Hispanic,8,Urgent,Short-term Hospital,2019,PNL002,SHORT GESTATION; LOW BIRTH WEIGHT; AND FETAL GROWTH RETARDATION,ESA003,MECHANICAL VENTILATION,863,NEONATAL AFTERCARE,23,FACTORS INFLUENCING HEALTH STATUS AND OTHER CONTACTS WITH HEALTH SERVICES,4,Extreme,Minor,Medical,Private Health Insurance,,,,,false,77106.49,21528.82
Central NY,Onondaga,3301003,000630,St. Joseph's Hospital Health Center,0 to 17,132,F,White,Not Span/Hispanic,16,Urgent,Home or Self Care,2019,PNL002,SHORT GESTATION; LOW BIRTH WEIGHT; AND FETAL GROWTH RETARDATION,ADM010,VACCINATIONS,863,NEONATAL AFTERCARE,23,FACTORS INFLUENCING HEALTH STATUS AND OTHER CONTACTS WITH HEALTH SERVICES,2,Moderate,Moderate,Medical,Private Health Insurance,,,01900,,false,67472.1,27994.98
New York City,Richmond,7004010,001738,Richmond University Medical Center,0 to 17,103,M,White,Not Span/Hispanic,63,Urgent,Home or Self Care,2019,PNL002,SHORT GESTATION; LOW BIRTH WEIGHT; AND FETAL GROWTH RETARDATION,ADM001,TRANSFUSION OF BLOOD AND BLOOD PRODUCTS,863,NEONATAL AFTERCARE,23,FACTORS INFLUENCING HEALTH STATUS AND OTHER CONTACTS WITH HEALTH SERVICES,3,Major,Minor,Medical,Private Health Insurance,Self-Pay,Self-Pay,01100,,false,403676.26,101034.01
Long Island,Nassau,2951001,000541,North Shore University Hospital,0 to 17,117,F,Other Race,Not Span/Hispanic,9,Urgent,Home w/ Home Health Services,2019,PNL002,SHORT GESTATION; LOW BIRTH WEIGHT; AND FETAL GROWTH RETARDATION,,,863,NEONATAL AFTERCARE,23,FACTORS INFLUENCING HEALTH STATUS AND OTHER CONTACTS WITH HEALTH SERVICES,2,Moderate,Minor,Medical,Private Health Insurance,Self-Pay,,,,false,145315.5,23848.32
Finger Lakes,Monroe,2701001,000409,Highland Hospital,0 to 17,144,F,Other Race,Unknown,12,Urgent,Home or Self Care,2019,PNL002,SHORT GESTATION; LOW BIRTH WEIGHT; AND FETAL GROWTH RETARDATION,,,863,NEONATAL AFTERCARE,23,FACTORS INFLUENCING HEALTH STATUS AND OTHER CONTACTS WITH HEALTH SERVICES,1,Minor,Minor,Medical,Self-Pay,,,01800,,false,16979.48,6658.78
Finger Lakes,Monroe,2701001,000409,Highland Hospital,0 to 17,144,F,Other Race,Unknown,12,Urgent,Home or Self Care,2019,PNL002,SHORT GESTATION; LOW BIRTH WEIGHT; AND FETAL GROWTH RETARDATION,,,863,NEONATAL AFTERCARE,23,FACTORS INFLUENCING HEALTH STATUS AND OTHER CONTACTS WITH HEALTH SERVICES,1,Minor,Minor,Medical,Self-Pay,,,02000,,false,17165.48,6715.27
Hudson Valley,Westchester,5902001,001045,White Plains Hospital Center,0 to 17,106,M,Other Race,Not Span/Hispanic,7,Urgent,Home or Self Care,2019,PNL002,SHORT GESTATION; LOW BIRTH WEIGHT; AND FETAL GROWTH RETARDATION,,,863,NEONATAL AFTERCARE,23,FACTORS INFLUENCING HEALTH STATUS AND OTHER CONTACTS WITH HEALTH SERVICES,2,Moderate,Minor,Medical,Private Health Insurance,,,01400,,false,39243,10128.23
Hudson Valley,Orange,3522000,000694,St Luke's Cornwall Hospital/Newburgh,0 to 17,125,F,Other Race,Unknown,10,Urgent,Home or Self Care,2019,PNL002,SHORT GESTATION; LOW BIRTH WEIGHT; AND FETAL GROWTH RETARDATION,ADM017,ADMINISTRATION OF NUTRITIONAL AND ELECTROLYTIC SUBSTANCES,863,NEONATAL AFTERCARE,23,FACTORS INFLUENCING HEALTH STATUS AND OTHER CONTACTS WITH HEALTH SERVICES,2,Moderate,Minor,Medical,Blue Cross/Blue Shield,,,02300,,false,79685.79,24210.24
Capital/Adirond,Warren,5601000,001005,Glens Falls Hospital,0 to 17,128,F,Other Race,Unknown,16,Elective,Home w/ Home Health Services,2019,PNL002,SHORT GESTATION; LOW BIRTH WEIGHT; AND FETAL GROWTH RETARDATION,,,863,NEONATAL AFTERCARE,23,FACTORS INFLUENCING HEALTH STATUS AND OTHER CONTACTS WITH HEALTH SERVICES,2,Moderate,Minor,Medical,Medicaid,,,,,false,117892,37631.27
Capital/Adirond,Warren,5601000,001005,Glens Falls Hospital,0 to 17,128,M,Other Race,Unknown,18,Elective,Home or Self Care,2019,PNL002,SHORT GESTATION; LOW BIRTH WEIGHT; AND FETAL GROWTH RETARDATION,,,863,NEONATAL AFTERCARE,23,FACTORS INFLUENCING HEALTH STATUS AND OTHER CONTACTS WITH HEALTH SERVICES,3,Major,Minor,Medical,Medicaid,,,,,false,138011,44621.03
Central NY,Oneida,3202003,000599,Faxton-St Lukes Healthcare St Lukes Division,0 to 17,135,F,Other Race,Not Span/Hispanic,5,Urgent,Home or Self Care,2019,PNL002,SHORT GESTATION; LOW BIRTH WEIGHT; AND FETAL GROWTH RETARDATION,,,863,NEONATAL AFTERCARE,23,FACTORS INFLUENCING HEALTH STATUS AND OTHER CONTACTS WITH HEALTH SERVICES,2,Moderate,Minor,Medical,Medicaid,,,,,false,13456.9,6483.76
Finger Lakes,Monroe,2701003,000411,Rochester General Hospital,0 to 17,146,F,Black/African American,Not Span/Hispanic,7,Urgent,Home or Self Care,2019,PNL002,SHORT GESTATION; LOW BIRTH WEIGHT; AND FETAL GROWTH RETARDATION,ADM017,ADMINISTRATION OF NUTRITIONAL AND ELECTROLYTIC SUBSTANCES,863,NEONATAL AFTERCARE,23,FACTORS INFLUENCING HEALTH STATUS AND OTHER CONTACTS WITH HEALTH SERVICES,2,Moderate,Minor,Medical,Medicaid,,,01900,,false,16273.77,13652.51
New York City,Manhattan,7002024,001456,Mount Sinai Hospital,0 to 17,100,M,White,Unknown,19,Urgent,Home or Self Care,2019,PNL002,SHORT GESTATION; LOW BIRTH WEIGHT; AND FETAL GROWTH RETARDATION,MRS001,CIRCUMCISION,863,NEONATAL AFTERCARE,23,FACTORS INFLUENCING HEALTH STATUS AND OTHER CONTACTS WITH HEALTH SERVICES,2,Moderate,Minor,Medical,Blue Cross/Blue Shield,Self-Pay,,02200,,false,398901.08,70796.59
Southern Tier,Broome,0303001,000058,United Health Services Hospitals Inc. - Wilson Medical Center,0 to 17,138,F,Other Race,Not Span/Hispanic,27,Urgent,Home or Self Care,2019,PNL002,SHORT GESTATION; LOW BIRTH WEIGHT; AND FETAL GROWTH RETARDATION,ADM021,"ADMINISTRATION OF THERAPEUTIC SUBSTANCES, NEC",863,NEONATAL AFTERCARE,23,FACTORS INFLUENCING HEALTH STATUS AND OTHER CONTACTS WITH HEALTH SERVICES,4,Extreme,Moderate,Medical,Medicaid,Medicaid,,01500,,false,66972.5,26386.03
Long Island,Nassau,2909000,000513,Mercy Hospital,0 to 17,115,F,Other Race,Not Span/Hispanic,54,Urgent,Home or Self Care,2019,PNL002,SHORT GESTATION; LOW BIRTH WEIGHT; AND FETAL GROWTH RETARDATION,ADM010,VACCINATIONS,863,NEONATAL AFTERCARE,23,FACTORS INFLUENCING HEALTH STATUS AND OTHER CONTACTS WITH HEALTH SERVICES,3,Major,Moderate,Medical,Medicaid,Medicaid,Medicaid,01100,,false,383595,122400.17
Long Island,Nassau,2909000,000513,Mercy Hospital,0 to 17,115,F,Other Race,Not Span/Hispanic,23,Urgent,Home or Self Care,2019,PNL002,SHORT GESTATION; LOW BIRTH WEIGHT; AND FETAL GROWTH RETARDATION,ENT004,DIAGNOSTIC AUDIOLOGY,863,NEONATAL AFTERCARE,23,FACTORS INFLUENCING HEALTH STATUS AND OTHER CONTACTS WITH HEALTH SERVICES,2,Moderate,Minor,Medical,Medicaid,Medicaid,Medicaid,01600,,false,164217,52558.19
New York City,Kings,7001037,001320,University Hospital of Brooklyn,0 to 17,112,M,White,Not Span/Hispanic,23,Urgent,Home or Self Care,2019,PNL002,SHORT GESTATION; LOW BIRTH WEIGHT; AND FETAL GROWTH RETARDATION,ENT004,DIAGNOSTIC AUDIOLOGY,863,NEONATAL AFTERCARE,23,FACTORS INFLUENCING HEALTH STATUS AND OTHER CONTACTS WITH HEALTH SERVICES,3,Major,Minor,Medical,Private Health Insurance,Self-Pay,,,,false,143413,101180.4
New York City,Queens,7003000,001626,Elmhurst Hospital Center,0 to 17,113,F,Other Race,Not Span/Hispanic,13,Urgent,Home w/ Home Health Services,2019,PNL002,SHORT GESTATION; LOW BIRTH WEIGHT; AND FETAL GROWTH RETARDATION,ADM010,VACCINATIONS,863,NEONATAL AFTERCARE,23,FACTORS INFLUENCING HEALTH STATUS AND OTHER CONTACTS WITH HEALTH SERVICES,3,Major,Minor,Medical,Medicaid,,,01200,,false,67784.71,40329.6
Finger Lakes,Monroe,2701001,000409,Highland Hospital,0 to 17,146,F,Black/African American,Not Span/Hispanic,4,Elective,Home w/ Home Health Services,2019,FAC010,OTHER AFTERCARE ENCOUNTER,,,863,NEONATAL AFTERCARE,23,FACTORS INFLUENCING HEALTH STATUS AND OTHER CONTACTS WITH HEALTH SERVICES,1,Minor,Minor,Medical,Self-Pay,,,01200,,false,8668.28,3562.15
New York City,Kings,7001016,001301,Kings County Hospital Center,0 to 17,112,F,Black/African American,Not Span/Hispanic,70,Newborn,Home or Self Care,2019,PNL002,SHORT GESTATION; LOW BIRTH WEIGHT; AND FETAL GROWTH RETARDATION,ADM010,VACCINATIONS,863,NEONATAL AFTERCARE,23,FACTORS INFLUENCING HEALTH STATUS AND OTHER CONTACTS WITH HEALTH SERVICES,3,Major,Moderate,Medical,Medicaid,,,,,false,448757.96,318780.15
Hudson Valley,Westchester,7002054,001122,New York - Presbyterian Hospital,0 to 17,104,F,Black/African American,Not Span/Hispanic,18,Elective,Home or Self Care,2019,PNL002,SHORT GESTATION; LOW BIRTH WEIGHT; AND FETAL GROWTH RETARDATION,ADM017,ADMINISTRATION OF NUTRITIONAL AND ELECTROLYTIC SUBSTANCES,863,NEONATAL AFTERCARE,23,FACTORS INFLUENCING HEALTH STATUS AND OTHER CONTACTS WITH HEALTH SERVICES,2,Moderate,Minor,Medical,Medicaid,Medicaid,,UNKN,,false,218970.14,296051.24
New York City,Manhattan,7002024,001456,Mount Sinai Hospital,0 to 17,100,M,Other Race,Unknown,18,Urgent,Home or Self Care,2019,PNL002,SHORT GESTATION; LOW BIRTH WEIGHT; AND FETAL GROWTH RETARDATION,ENT004,DIAGNOSTIC AUDIOLOGY,863,NEONATAL AFTERCARE,23,FACTORS INFLUENCING HEALTH STATUS AND OTHER CONTACTS WITH HEALTH SERVICES,3,Major,Minor,Medical,Private Health Insurance,Blue Cross/Blue Shield,Self-Pay,,,false,378034,68679.44
Central NY,Jefferson,2201000,000367,Samaritan Medical Center,0 to 17,136,M,Black/African American,Not Span/Hispanic,23,Urgent,Home or Self Care,2019,PNL002,SHORT GESTATION; LOW BIRTH WEIGHT; AND FETAL GROWTH RETARDATION,MRS001,CIRCUMCISION,863,NEONATAL AFTERCARE,23,FACTORS INFLUENCING HEALTH STATUS AND OTHER CONTACTS WITH HEALTH SERVICES,3,Major,Minor,Medical,Federal/State/Local/VA,,,01200,,false,74835.76,10067.86
Central NY,Oneida,3202003,000599,Faxton-St Lukes Healthcare St Lukes Division,0 to 17,135,M,Black/African American,Not Span/Hispanic,11,Urgent,Home or Self Care,2019,PNL002,SHORT GESTATION; LOW BIRTH WEIGHT; AND FETAL GROWTH RETARDATION,MRS001,CIRCUMCISION,863,NEONATAL AFTERCARE,23,FACTORS INFLUENCING HEALTH STATUS AND OTHER CONTACTS WITH HEALTH SERVICES,3,Major,Minor,Medical,Medicaid,,,,,false,33912.19,15768.49
Southern Tier,Broome,0303001,000058,United Health Services Hospitals Inc. - Wilson Medical Center,0 to 17,139,F,White,Not Span/Hispanic,58,Urgent,Home or Self Care,2019,PNL002,SHORT GESTATION; LOW BIRTH WEIGHT; AND FETAL GROWTH RETARDATION,ESA004,NON-INVASIVE VENTILATION,863,NEONATAL AFTERCARE,23,FACTORS INFLUENCING HEALTH STATUS AND OTHER CONTACTS WITH HEALTH SERVICES,3,Major,Moderate,Medical,Medicaid,,,00900,,false,233547.9,90927.13
Finger Lakes,Monroe,2701001,000409,Highland Hospital,0 to 17,146,M,Other Race,Not Span/Hispanic,7,Urgent,Home w/ Home Health Services,2019,FAC010,OTHER AFTERCARE ENCOUNTER,ADM017,ADMINISTRATION OF NUTRITIONAL AND ELECTROLYTIC SUBSTANCES,863,NEONATAL AFTERCARE,23,FACTORS INFLUENCING HEALTH STATUS AND OTHER CONTACTS WITH HEALTH SERVICES,2,Moderate,Minor,Medical,Medicaid,,,01400,,false,13359.54,5337.67
Finger Lakes,Monroe,2701001,000409,Highland Hospital,0 to 17,146,M,Other Race,Not Span/Hispanic,7,Urgent,Home w/ Home Health Services,2019,PNL002,SHORT GESTATION; LOW BIRTH WEIGHT; AND FETAL GROWTH RETARDATION,ADM017,ADMINISTRATION OF NUTRITIONAL AND ELECTROLYTIC SUBSTANCES,863,NEONATAL AFTERCARE,23,FACTORS INFLUENCING HEALTH STATUS AND OTHER CONTACTS WITH HEALTH SERVICES,2,Moderate,Minor,Medical,Medicaid,,,01700,,false,12902.3,5224.68
Finger Lakes,Monroe,2701003,000411,Rochester General Hospital,0 to 17,146,F,Other Race,Unknown,17,Urgent,Home or Self Care,2019,PNL002,SHORT GESTATION; LOW BIRTH WEIGHT; AND FETAL GROWTH RETARDATION,,,863,NEONATAL AFTERCARE,23,FACTORS INFLUENCING HEALTH STATUS AND OTHER CONTACTS WITH HEALTH SERVICES,2,Moderate,Minor,Medical,Medicaid,,,01600,,false,33449.21,28556.73
Finger Lakes,Monroe,2701003,000411,Rochester General Hospital,0 to 17,146,M,Other Race,Unknown,12,Urgent,Home w/ Home Health Services,2019,PNL002,SHORT GESTATION; LOW BIRTH WEIGHT; AND FETAL GROWTH RETARDATION,MRS001,CIRCUMCISION,863,NEONATAL AFTERCARE,23,FACTORS INFLUENCING HEALTH STATUS AND OTHER CONTACTS WITH HEALTH SERVICES,2,Moderate,Minor,Medical,Medicaid,,,02200,,false,23478.82,20174.73
Southern Tier,Broome,0303001,000058,United Health Services Hospitals Inc. - Wilson Medical Center,0 to 17,137,F,Other Race,Not Span/Hispanic,28,Urgent,Home or Self Care,2019,PNL002,SHORT GESTATION; LOW BIRTH WEIGHT; AND FETAL GROWTH RETARDATION,ESA004,NON-INVASIVE VENTILATION,863,NEONATAL AFTERCARE,23,FACTORS INFLUENCING HEALTH STATUS AND OTHER CONTACTS WITH HEALTH SERVICES,2,Moderate,Minor,Medical,Medicaid,,,01500,,false,79205,30507.77
Central NY,Tompkins,5401001,000977,Cayuga Medical Center at Ithaca,0 to 17,130,M,White,Unknown,7,Urgent,Home or Self Care,2019,PNL002,SHORT GESTATION; LOW BIRTH WEIGHT; AND FETAL GROWTH RETARDATION,,,863,NEONATAL AFTERCARE,23,FACTORS INFLUENCING HEALTH STATUS AND OTHER CONTACTS WITH HEALTH SERVICES,2,Moderate,Minor,Medical,Medicaid,Self-Pay,Self-Pay,01800,,false,12143.5,5863.55
Hudson Valley,Westchester,5902001,001045,White Plains Hospital Center,0 to 17,106,F,Other Race,Not Span/Hispanic,73,Elective,Home w/ Home Health Services,2019,PNL002,SHORT GESTATION; LOW BIRTH WEIGHT; AND FETAL GROWTH RETARDATION,ESA004,NON-INVASIVE VENTILATION,863,NEONATAL AFTERCARE,23,FACTORS INFLUENCING HEALTH STATUS AND OTHER CONTACTS WITH HEALTH SERVICES,3,Major,Moderate,Medical,Medicaid,,,,,false,370769,97128.1
Hudson Valley,Westchester,5957001,001139,Westchester Medical Center,0 to 17,125,M,Other Race,Spanish/Hispanic,21,Urgent,Home or Self Care,2019,PNL002,SHORT GESTATION; LOW BIRTH WEIGHT; AND FETAL GROWTH RETARDATION,,,863,NEONATAL AFTERCARE,23,FACTORS INFLUENCING HEALTH STATUS AND OTHER CONTACTS WITH HEALTH SERVICES,3,Major,Moderate,Medical,Blue Cross/Blue Shield,,,01700,,false,469345.1,54850.44
New York City,Queens,7003007,001633,Queens Hospital Center,0 to 17,114,M,Other Race,Unknown,63,Emergency,Home w/ Home Health Services,2019,PNL002,SHORT GESTATION; LOW BIRTH WEIGHT; AND FETAL GROWTH RETARDATION,ESA003,MECHANICAL VENTILATION,863,NEONATAL AFTERCARE,23,FACTORS INFLUENCING HEALTH STATUS AND OTHER CONTACTS WITH HEALTH SERVICES,4,Extreme,Moderate,Medical,Medicaid,,,00800,,false,288405.51,153999.6
Finger Lakes,Chemung,0701000,000116,Arnot Ogden Medical Center,0 to 17,149,M,Other Race,Not Span/Hispanic,28,Urgent,Home or Self Care,2019,PNL002,SHORT GESTATION; LOW BIRTH WEIGHT; AND FETAL GROWTH RETARDATION,ESA004,NON-INVASIVE VENTILATION,863,NEONATAL AFTERCARE,23,FACTORS INFLUENCING HEALTH STATUS AND OTHER CONTACTS WITH HEALTH SERVICES,3,Major,Moderate,Medical,Medicaid,,,,,false,44855.39,17126.34
Finger Lakes,Chemung,0701000,000116,Arnot Ogden Medical Center,0 to 17,148,M,White,Not Span/Hispanic,81,Urgent,Home w/ Home Health Services,2019,PNL002,SHORT GESTATION; LOW BIRTH WEIGHT; AND FETAL GROWTH RETARDATION,ESA003,MECHANICAL VENTILATION,863,NEONATAL AFTERCARE,23,FACTORS INFLUENCING HEALTH STATUS AND OTHER CONTACTS WITH HEALTH SERVICES,3,Major,Moderate,Medical,Medicaid,Medicaid,,,,false,343526.45,97076.64
Central NY,Oneida,3202003,000599,Faxton-St Lukes Healthcare St Lukes Division,0 to 17,134,M,Other Race,Unknown,16,Elective,Home or Self Care,2019,PNL002,SHORT GESTATION; LOW BIRTH WEIGHT; AND FETAL GROWTH RETARDATION,MRS001,CIRCUMCISION,863,NEONATAL AFTERCARE,23,FACTORS INFLUENCING HEALTH STATUS AND OTHER CONTACTS WITH HEALTH SERVICES,3,Major,Minor,Medical,Medicaid,,,,,false,48854.83,22439.25
Central NY,Oneida,3202003,000599,Faxton-St Lukes Healthcare St Lukes Division,0 to 17,134,M,Other Race,Unknown,12,Urgent,Home or Self Care,2019,PNL002,SHORT GESTATION; LOW BIRTH WEIGHT; AND FETAL GROWTH RETARDATION,MRS001,CIRCUMCISION,863,NEONATAL AFTERCARE,23,FACTORS INFLUENCING HEALTH STATUS AND OTHER CONTACTS WITH HEALTH SERVICES,2,Moderate,Minor,Medical,Medicaid,,,01900,,false,31325,15467.98