Hospital Service Area,Hospital County,Operating Certificate Number,Permanent Facility Id,Facility Name,Age Group,Zip Code - 3 digits,Gender,Race,Ethnicity,Length of Stay,Type of Admission,Patient Disposition,Discharge Year,CCS Diagnosis Code,CCS Diagnosis Description,CCS Procedure Code,CCS Procedure Description,APR DRG Code,APR DRG Description,APR MDC Code,APR MDC Description,APR Severity of Illness Code,APR Severity of Illness Description,APR Risk of Mortality,APR Medical Surgical Description,Payment Typology 1,Payment Typology 2,Payment Typology 3,Birth Weight,Abortion Edit Indicator,Emergency Department Indicator,Total Charges,Total Costs
New York City,Manhattan,7002001,001438,Bellevue Hospital Center,18 to 29,104,M,Black/African American,Not Span/Hispanic,41,Elective,Home or Self Care,2017,047,Other and unspecified benign neoplasm,142,PARTIAL EXCISION BONE,089,Major cranial/facial bone procedures,03,"Ear, Nose, Mouth, Throat and Craniofacial Diseases and Disorders",2,Moderate,Minor,Surgical,Medicaid,,,,N,N,199764.27,128797.61
New York City,Manhattan,7002001,001438,Bellevue Hospital Center,18 to 29,100,M,Other Race,Not Span/Hispanic,18,Emergency,Skilled Nursing Home,2017,209,Other acquired deformities,161,OT OR THER PRCS ON BONE,089,Major cranial/facial bone procedures,03,"Ear, Nose, Mouth, Throat and Craniofacial Diseases and Disorders",3,Major,Minor,Surgical,Miscellaneous/Other,Medicaid,,,N,Y,99111.75,63902.10
New York City,Manhattan,7002001,001438,Bellevue Hospital Center,70 or Older,112,M,Other Race,Spanish/Hispanic,6,Elective,Home or Self Care,2017,011,Cancer of head and neck,161,OT OR THER PRCS ON BONE,089,Major cranial/facial bone procedures,03,"Ear, Nose, Mouth, Throat and Craniofacial Diseases and Disorders",3,Major,Major,Surgical,Medicare,Medicare,,,N,N,36282.07,23392.79
New York City,Manhattan,7002001,001438,Bellevue Hospital Center,18 to 29,100,M,Other Race,Not Span/Hispanic,2,Elective,Home or Self Care,2017,209,Other acquired deformities,161,OT OR THER PRCS ON BONE,089,Major cranial/facial bone procedures,03,"Ear, Nose, Mouth, Throat and Craniofacial Diseases and Disorders",1,Minor,Minor,Surgical,Self-Pay,,,,N,N,6519.87,4203.67
New York City,Manhattan,7002001,001438,Bellevue Hospital Center,30 to 49,104,M,Other Race,Not Span/Hispanic,2,Elective,Home or Self Care,2017,209,Other acquired deformities,161,OT OR THER PRCS ON BONE,089,Major cranial/facial bone procedures,03,"Ear, Nose, Mouth, Throat and Craniofacial Diseases and Disorders",1,Minor,Minor,Surgical,Self-Pay,,,,N,N,14489.87,9342.31
New York City,Manhattan,7002001,001438,Bellevue Hospital Center,50 to 69,,F,Other Race,Not Span/Hispanic,10,Elective,Home or Self Care,2017,136,Disorders of teeth and jaw,034,TRACHEOSTOMY; TEMP/PERM,089,Major cranial/facial bone procedures,03,"Ear, Nose, Mouth, Throat and Craniofacial Diseases and Disorders",1,Minor,Minor,Surgical,Medicaid,Medicaid,,,N,N,47803.95,30821.50
New York City,Manhattan,7002001,001438,Bellevue Hospital Center,30 to 49,112,M,White,Not Span/Hispanic,9,Elective,Home or Self Care,2017,011,Cancer of head and neck,034,TRACHEOSTOMY; TEMP/PERM,089,Major cranial/facial bone procedures,03,"Ear, Nose, Mouth, Throat and Craniofacial Diseases and Disorders",3,Major,Minor,Surgical,Medicaid,Medicaid,,,N,N,43295.23,27914.51
New York City,Manhattan,7002001,001438,Bellevue Hospital Center,50 to 69,104,M,Other Race,Not Span/Hispanic,24,Emergency,Home w/ Home Health Services,2017,011,Cancer of head and neck,161,OT OR THER PRCS ON BONE,089,Major cranial/facial bone procedures,03,"Ear, Nose, Mouth, Throat and Craniofacial Diseases and Disorders",3,Major,Moderate,Surgical,Medicaid,Medicaid,,,N,Y,133528.22,86092.05
New York City,Manhattan,7002001,001438,Bellevue Hospital Center,70 or Older,104,F,Other Race,Spanish/Hispanic,18,Emergency,Home w/ Home Health Services,2017,021,Cancer of bone and connective tissue,142,PARTIAL EXCISION BONE,089,Major cranial/facial bone procedures,03,"Ear, Nose, Mouth, Throat and Craniofacial Diseases and Disorders",3,Major,Minor,Surgical,Medicare,Medicare,,,N,N,99652.27,64250.60
New York City,Manhattan,7002001,001438,Bellevue Hospital Center,0 to 17,112,M,Other Race,Not Span/Hispanic,2,Emergency,Home or Self Care,2017,136,Disorders of teeth and jaw,144,"TRTMNT,FACE FRACT/DISLC",089,Major cranial/facial bone procedures,03,"Ear, Nose, Mouth, Throat and Craniofacial Diseases and Disorders",1,Minor,Minor,Surgical,Medicaid,Medicaid,,,N,N,12430.88,8014.79
New York City,Manhattan,7002001,001438,Bellevue Hospital Center,30 to 49,112,M,Other Race,Not Span/Hispanic,9,Elective,Home w/ Home Health Services,2017,011,Cancer of head and neck,161,OT OR THER PRCS ON BONE,089,Major cranial/facial bone procedures,03,"Ear, Nose, Mouth, Throat and Craniofacial Diseases and Disorders",2,Moderate,Minor,Surgical,Self-Pay,,,,N,N,42074.22,27127.27
New York City,Manhattan,7002001,001438,Bellevue Hospital Center,30 to 49,100,M,Other Race,Not Span/Hispanic,1,Emergency,Home or Self Care,2017,136,Disorders of teeth and jaw,142,PARTIAL EXCISION BONE,089,Major cranial/facial bone procedures,03,"Ear, Nose, Mouth, Throat and Craniofacial Diseases and Disorders",2,Moderate,Minor,Surgical,Department of Corrections,,,,N,Y,8076.00,5206.98
New York City,Manhattan,7002001,001438,Bellevue Hospital Center,50 to 69,112,F,Other Race,Spanish/Hispanic,44,Elective,Home w/ Home Health Services,2017,011,Cancer of head and neck,161,OT OR THER PRCS ON BONE,089,Major cranial/facial bone procedures,03,"Ear, Nose, Mouth, Throat and Craniofacial Diseases and Disorders",3,Major,Moderate,Surgical,Self-Pay,,,,N,N,217104.52,139977.71
New York City,Manhattan,7002001,001438,Bellevue Hospital Center,50 to 69,114,F,Other Race,Not Span/Hispanic,16,Elective,Home or Self Care,2017,021,Cancer of bone and connective tissue,142,PARTIAL EXCISION BONE,089,Major cranial/facial bone procedures,03,"Ear, Nose, Mouth, Throat and Craniofacial Diseases and Disorders",3,Major,Major,Surgical,Medicaid,Medicaid,,,N,N,93368.06,60198.87
New York City,Manhattan,7002001,001438,Bellevue Hospital Center,0 to 17,104,F,Other Race,Not Span/Hispanic,1,Emergency,Home or Self Care,2017,092,Otitis media and related conditions,161,OT OR THER PRCS ON BONE,089,Major cranial/facial bone procedures,03,"Ear, Nose, Mouth, Throat and Craniofacial Diseases and Disorders",3,Major,Moderate,Surgical,Medicaid,,,,N,N,6200.00,3997.44
New York City,Manhattan,7002001,001438,Bellevue Hospital Center,70 or Older,113,F,Other Race,Not Span/Hispanic,12,Emergency,Home or Self Care,2017,021,Cancer of bone and connective tissue,161,OT OR THER PRCS ON BONE,089,Major cranial/facial bone procedures,03,"Ear, Nose, Mouth, Throat and Craniofacial Diseases and Disorders",2,Moderate,Minor,Surgical,Medicaid,Medicaid,,,N,Y,65923.40,42503.98
New York City,Manhattan,7002001,001438,Bellevue Hospital Center,18 to 29,112,M,Black/African American,Not Span/Hispanic,12,Emergency,Home or Self Care,2017,092,Otitis media and related conditions,142,PARTIAL EXCISION BONE,089,Major cranial/facial bone procedures,03,"Ear, Nose, Mouth, Throat and Craniofacial Diseases and Disorders",3,Major,Moderate,Surgical,Department of Corrections,,,,N,Y,71968.52,46401.56
New York City,Manhattan,7002001,001438,Bellevue Hospital Center,18 to 29,114,F,Other Race,Not Span/Hispanic,2,Elective,Home or Self Care,2017,209,Other acquired deformities,161,OT OR THER PRCS ON BONE,089,Major cranial/facial bone procedures,03,"Ear, Nose, Mouth, Throat and Craniofacial Diseases and Disorders",2,Moderate,Minor,Surgical,Medicaid,,,,N,N,15431.75,9949.59
New York City,Manhattan,7002001,001438,Bellevue Hospital Center,30 to 49,104,M,Black/African American,Not Span/Hispanic,23,Emergency,Home or Self Care,2017,021,Cancer of bone and connective tissue,033,OTHER OR THER PRCS NOSE,089,Major cranial/facial bone procedures,03,"Ear, Nose, Mouth, Throat and Craniofacial Diseases and Disorders",2,Moderate,Minor,Surgical,Medicaid,Medicaid,,,N,N,117826.26,75968.25
