Hospital Service Area,Hospital County,Operating Certificate Number,Permanent Facility Id,Facility Name,Age Group,Zip Code - 3 digits,Gender,Race,Ethnicity,Length of Stay,Type of Admission,Patient Disposition,Discharge Year,CCS Diagnosis Code,CCS Diagnosis Description,CCS Procedure Code,CCS Procedure Description,APR DRG Code,APR DRG Description,APR MDC Code,APR MDC Description,APR Severity of Illness Code,APR Severity of Illness Description,APR Risk of Mortality,APR Medical Surgical Description,Payment Typology 1,Payment Typology 2,Payment Typology 3,Birth Weight,Abortion Edit Indicator,Emergency Department Indicator,Total Charges,Total Costs
New York City,Queens,7003004,001630,Long Island Jewish Medical Center,50 to 69,117,F,White,Not Span/Hispanic,3,Elective,Home or Self Care,2018,MUS023,ACQUIRED DEFORMITIES (EXCLUDING FOOT),MST029,"MUSCULOSKELETAL DEVICE PROCEDURES, NEC",089,MAJOR CRANIAL/FACIAL BONE PROCEDURES,03,"DISEASES AND DISORDERS OF THE EAR, NOSE, MOUTH AND THROAT",2,Moderate,Minor,Surgical,Blue Cross/Blue Shield,Self-Pay,,,,false,125693.96,34121.87
New York City,Manhattan,7002024,001456,Mount Sinai Hospital,50 to 69,OOS,F,White,Not Span/Hispanic,1,Elective,Home or Self Care,2018,NEO073,BENIGN NEOPLASMS,MST018,BONE EXCISION,089,MAJOR CRANIAL/FACIAL BONE PROCEDURES,03,"DISEASES AND DISORDERS OF THE EAR, NOSE, MOUTH AND THROAT",1,Minor,Minor,Surgical,Private Health Insurance,Self-Pay,,,,false,28951.02,10270.03
Central NY,Onondaga,3301007,000635,University Hospital SUNY Health Science Center,50 to 69,132,F,White,Not Span/Hispanic,3,Elective,Skilled Nursing Home,2018,MUS023,ACQUIRED DEFORMITIES (EXCLUDING FOOT),MST029,"MUSCULOSKELETAL DEVICE PROCEDURES, NEC",089,MAJOR CRANIAL/FACIAL BONE PROCEDURES,03,"DISEASES AND DISORDERS OF THE EAR, NOSE, MOUTH AND THROAT",2,Moderate,Moderate,Surgical,Medicaid,,,,,false,88087.26,26158.26
Finger Lakes,Monroe,2701005,000413,Strong Memorial Hospital,50 to 69,146,M,White,Not Span/Hispanic,6,Emergency,Home or Self Care,2018,DIG002,DISORDERS OF TEETH AND GINGIVA,MST018,BONE EXCISION,089,MAJOR CRANIAL/FACIAL BONE PROCEDURES,03,"DISEASES AND DISORDERS OF THE EAR, NOSE, MOUTH AND THROAT",2,Moderate,Moderate,Surgical,Medicaid,,,,,true,23292.04,12097.21
Central NY,Onondaga,3301007,000635,University Hospital SUNY Health Science Center,50 to 69,132,M,White,Not Span/Hispanic,16,Elective,Skilled Nursing Home,2018,NEO002,HEAD AND NECK CANCERS - LIP AND ORAL CAVITY,RES010,TRACHEOSTOMY,089,MAJOR CRANIAL/FACIAL BONE PROCEDURES,03,"DISEASES AND DISORDERS OF THE EAR, NOSE, MOUTH AND THROAT",4,Extreme,Major,Surgical,Medicare,Private Health Insurance,,,,false,368557.48,100126.26
New York City,Manhattan,7002021,001454,Metropolitan Hospital Center,50 to 69,104,F,Other Race,Spanish/Hispanic,3,Elective,Home or Self Care,2018,NEO023,BONE CANCER,MST018,BONE EXCISION,089,MAJOR CRANIAL/FACIAL BONE PROCEDURES,03,"DISEASES AND DISORDERS OF THE EAR, NOSE, MOUTH AND THROAT",2,Moderate,Moderate,Surgical,Private Health Insurance,,,,,false,33568.86,27121.96
New York City,Kings,7001003,001288,Brooklyn Hospital Center - Downtown Campus,30 to 49,112,M,White,Unknown,6,Emergency,Home or Self Care,2018,INJ001,"FRACTURE OF HEAD AND NECK, INITIAL ENCOUNTER",MST018,BONE EXCISION,089,MAJOR CRANIAL/FACIAL BONE PROCEDURES,03,"DISEASES AND DISORDERS OF THE EAR, NOSE, MOUTH AND THROAT",2,Moderate,Minor,Surgical,Medicaid,Medicaid,Self-Pay,,,true,49666.04,9530.53
New York City,Manhattan,7002054,001464,New York-Presbyterian Hospital - Columbia Presbyterian Center,70 or Older,100,M,White,Not Span/Hispanic,2,Elective,Home w/ Home Health Services,2018,MUS029,DISORDERS OF JAW,MST018,BONE EXCISION,089,MAJOR CRANIAL/FACIAL BONE PROCEDURES,03,"DISEASES AND DISORDERS OF THE EAR, NOSE, MOUTH AND THROAT",2,Moderate,Minor,Surgical,Medicare,Private Health Insurance,Self-Pay,,,false,28640.02,5804.1
New York City,Manhattan,7002053,001463,NYU Langone Hospitals,50 to 69,105,F,White,Not Span/Hispanic,11,Elective,Inpatient Rehabilitation Facility,2018,NEO010,HEAD AND NECK CANCERS - ALL OTHER TYPES,ENT008,NASAL AND SINUS EXCISION,089,MAJOR CRANIAL/FACIAL BONE PROCEDURES,03,"DISEASES AND DISORDERS OF THE EAR, NOSE, MOUTH AND THROAT",4,Extreme,Extreme,Surgical,Blue Cross/Blue Shield,,,,,false,602126.49,112591.4
New York City,Manhattan,7002032,001466,Mount Sinai West,30 to 49,100,M,Black/African American,Unknown,2,Elective,Home or Self Care,2018,MUS023,ACQUIRED DEFORMITIES (EXCLUDING FOOT),MST029,"MUSCULOSKELETAL DEVICE PROCEDURES, NEC",089,MAJOR CRANIAL/FACIAL BONE PROCEDURES,03,"DISEASES AND DISORDERS OF THE EAR, NOSE, MOUTH AND THROAT",1,Minor,Minor,Surgical,Medicaid,Medicaid,Self-Pay,,,false,54644.65,16817.53
New York City,Queens,7003004,001630,Long Island Jewish Medical Center,70 or Older,110,M,Other Race,Not Span/Hispanic,1,Elective,Home or Self Care,2018,NEO073,BENIGN NEOPLASMS,MST018,BONE EXCISION,089,MAJOR CRANIAL/FACIAL BONE PROCEDURES,03,"DISEASES AND DISORDERS OF THE EAR, NOSE, MOUTH AND THROAT",2,Moderate,Minor,Surgical,Medicare,Medicare,Self-Pay,,,false,26852.78,6212.59
Finger Lakes,Monroe,2701005,000413,Strong Memorial Hospital,50 to 69,131,M,White,Not Span/Hispanic,29,Elective,Home w/ Home Health Services,2018,NEO002,HEAD AND NECK CANCERS - LIP AND ORAL CAVITY,ENT012,"ENT EXCISION (EXCLUDING NASAL PASSAGE, SINUSES, TONGUE, SALIVARY GLANDS, LARYNX)",089,MAJOR CRANIAL/FACIAL BONE PROCEDURES,03,"DISEASES AND DISORDERS OF THE EAR, NOSE, MOUTH AND THROAT",3,Major,Moderate,Surgical,Medicaid,Medicaid,Self-Pay,,,false,123020.8,66796.8
Central NY,Onondaga,3301007,000635,University Hospital SUNY Health Science Center,0 to 17,130,M,White,Not Span/Hispanic,4,Elective,Home or Self Care,2018,MAL008,MUSCULOSKELETAL CONGENITAL CONDITIONS,MST012,BONE FIXATION (EXCLUDING EXTREMITIES),089,MAJOR CRANIAL/FACIAL BONE PROCEDURES,03,"DISEASES AND DISORDERS OF THE EAR, NOSE, MOUTH AND THROAT",2,Moderate,Minor,Surgical,Medicaid,,,,,false,112813.5,33622.29
New York City,Manhattan,7002054,001458,New York-Presbyterian Hospital - New York Weill Cornell Center,0 to 17,112,M,White,Not Span/Hispanic,1,Elective,Home or Self Care,2018,MAL008,MUSCULOSKELETAL CONGENITAL CONDITIONS,MST012,BONE FIXATION (EXCLUDING EXTREMITIES),089,MAJOR CRANIAL/FACIAL BONE PROCEDURES,03,"DISEASES AND DISORDERS OF THE EAR, NOSE, MOUTH AND THROAT",1,Minor,Minor,Surgical,Private Health Insurance,Self-Pay,,,,false,25991.99,13199.57
Hudson Valley,Westchester,5957001,001139,Westchester Medical Center,18 to 29,125,F,White,Not Span/Hispanic,4,Elective,Home or Self Care,2018,MUS023,ACQUIRED DEFORMITIES (EXCLUDING FOOT),MST012,BONE FIXATION (EXCLUDING EXTREMITIES),089,MAJOR CRANIAL/FACIAL BONE PROCEDURES,03,"DISEASES AND DISORDERS OF THE EAR, NOSE, MOUTH AND THROAT",2,Moderate,Minor,Surgical,Private Health Insurance,,,,,false,190571.05,34376.87
New York City,Manhattan,7002017,001450,Lenox Hill Hospital,30 to 49,113,M,White,Spanish/Hispanic,1,Urgent,Home or Self Care,2018,NEO073,BENIGN NEOPLASMS,MST029,"MUSCULOSKELETAL DEVICE PROCEDURES, NEC",089,MAJOR CRANIAL/FACIAL BONE PROCEDURES,03,"DISEASES AND DISORDERS OF THE EAR, NOSE, MOUTH AND THROAT",1,Minor,Minor,Surgical,Blue Cross/Blue Shield,,,,,false,45194.5,13840.27
New York City,Manhattan,7002017,001450,Lenox Hill Hospital,70 or Older,112,M,White,Not Span/Hispanic,17,Elective,Skilled Nursing Home,2018,NEO002,HEAD AND NECK CANCERS - LIP AND ORAL CAVITY,RES010,TRACHEOSTOMY,089,MAJOR CRANIAL/FACIAL BONE PROCEDURES,03,"DISEASES AND DISORDERS OF THE EAR, NOSE, MOUTH AND THROAT",3,Major,Moderate,Surgical,Medicare,Medicare,,,,false,385625.32,100497.17
New York City,Richmond,7004003,001740,Staten Island University Hosp-North,50 to 69,103,M,White,Not Span/Hispanic,2,Emergency,Home or Self Care,2018,INJ001,"FRACTURE OF HEAD AND NECK, INITIAL ENCOUNTER",MST012,BONE FIXATION (EXCLUDING EXTREMITIES),089,MAJOR CRANIAL/FACIAL BONE PROCEDURES,03,"DISEASES AND DISORDERS OF THE EAR, NOSE, MOUTH AND THROAT",1,Minor,Minor,Surgical,Medicare,Medicaid,,,,true,50473.66,14347.8
Long Island,Suffolk,5151001,000245,Stony Brook University Hospital,70 or Older,119,F,Black/African American,Not Span/Hispanic,14,Urgent,Home w/ Home Health Services,2018,NEO002,HEAD AND NECK CANCERS - LIP AND ORAL CAVITY,RES010,TRACHEOSTOMY,089,MAJOR CRANIAL/FACIAL BONE PROCEDURES,03,"DISEASES AND DISORDERS OF THE EAR, NOSE, MOUTH AND THROAT",3,Major,Moderate,Surgical,Medicare,Medicaid,,,,false,206815.24,81656.95
Long Island,Nassau,2951001,000541,North Shore University Hospital,50 to 69,115,F,White,Spanish/Hispanic,1,Elective,Home or Self Care,2018,NEO073,BENIGN NEOPLASMS,MST018,BONE EXCISION,089,MAJOR CRANIAL/FACIAL BONE PROCEDURES,03,"DISEASES AND DISORDERS OF THE EAR, NOSE, MOUTH AND THROAT",1,Minor,Minor,Surgical,Medicaid,Medicaid,,,,false,26142.76,6804.6
Long Island,Suffolk,5151001,000245,Stony Brook University Hospital,50 to 69,119,M,White,Not Span/Hispanic,21,Elective,Skilled Nursing Home,2018,NEO002,HEAD AND NECK CANCERS - LIP AND ORAL CAVITY,RES010,TRACHEOSTOMY,089,MAJOR CRANIAL/FACIAL BONE PROCEDURES,03,"DISEASES AND DISORDERS OF THE EAR, NOSE, MOUTH AND THROAT",3,Major,Major,Surgical,Medicare,Medicaid,,,,false,408579.06,158522.55
New York City,Queens,7003004,001630,Long Island Jewish Medical Center,18 to 29,113,M,White,Not Span/Hispanic,1,Urgent,Home or Self Care,2018,MUS029,DISORDERS OF JAW,MST018,BONE EXCISION,089,MAJOR CRANIAL/FACIAL BONE PROCEDURES,03,"DISEASES AND DISORDERS OF THE EAR, NOSE, MOUTH AND THROAT",1,Minor,Minor,Surgical,Medicaid,Self-Pay,,,,false,41747.45,10994.78
New York City,Manhattan,7002032,001466,Mount Sinai West,50 to 69,100,F,Black/African American,Not Span/Hispanic,14,Elective,Home or Self Care,2018,NEO003,HEAD AND NECK CANCERS - THROAT,RES010,TRACHEOSTOMY,089,MAJOR CRANIAL/FACIAL BONE PROCEDURES,03,"DISEASES AND DISORDERS OF THE EAR, NOSE, MOUTH AND THROAT",3,Major,Moderate,Surgical,Medicaid,Medicaid,Self-Pay,,,false,314669.91,101280.41
Finger Lakes,Monroe,2701005,000413,Strong Memorial Hospital,30 to 49,139,M,White,Not Span/Hispanic,7,Elective,Expired,2018,NEO002,HEAD AND NECK CANCERS - LIP AND ORAL CAVITY,MST018,BONE EXCISION,089,MAJOR CRANIAL/FACIAL BONE PROCEDURES,03,"DISEASES AND DISORDERS OF THE EAR, NOSE, MOUTH AND THROAT",4,Extreme,Major,Surgical,Blue Cross/Blue Shield,,,,,false,57776.98,25362.24
New York City,Manhattan,7002017,001450,Lenox Hill Hospital,0 to 17,OOS,F,White,Not Span/Hispanic,2,Elective,Home or Self Care,2018,MAL010,OTHER SPECIFIED AND UNSPECIFIED CONGENITAL ANOMALIES,MST029,"MUSCULOSKELETAL DEVICE PROCEDURES, NEC",089,MAJOR CRANIAL/FACIAL BONE PROCEDURES,03,"DISEASES AND DISORDERS OF THE EAR, NOSE, MOUTH AND THROAT",3,Major,Minor,Surgical,Blue Cross/Blue Shield,,,,,false,178010.55,67144.9
New York City,Manhattan,7002032,001466,Mount Sinai West,50 to 69,OOS,M,White,Not Span/Hispanic,21,Urgent,Home w/ Home Health Services,2018,MUS029,DISORDERS OF JAW,MST018,BONE EXCISION,089,MAJOR CRANIAL/FACIAL BONE PROCEDURES,03,"DISEASES AND DISORDERS OF THE EAR, NOSE, MOUTH AND THROAT",3,Major,Moderate,Surgical,Medicare,Private Health Insurance,Self-Pay,,,false,330514.98,111065.06
Finger Lakes,Monroe,2701005,000413,Strong Memorial Hospital,50 to 69,145,F,White,Not Span/Hispanic,5,Elective,Home w/ Home Health Services,2018,MUS029,DISORDERS OF JAW,MST018,BONE EXCISION,089,MAJOR CRANIAL/FACIAL BONE PROCEDURES,03,"DISEASES AND DISORDERS OF THE EAR, NOSE, MOUTH AND THROAT",3,Major,Minor,Surgical,Medicare,,,,,false,33279.53,16670.62
New York City,Manhattan,7002053,001463,NYU Langone Hospitals,18 to 29,114,M,Other Race,Not Span/Hispanic,1,Elective,Home or Self Care,2018,MUS029,DISORDERS OF JAW,MST012,BONE FIXATION (EXCLUDING EXTREMITIES),089,MAJOR CRANIAL/FACIAL BONE PROCEDURES,03,"DISEASES AND DISORDERS OF THE EAR, NOSE, MOUTH AND THROAT",1,Minor,Minor,Surgical,Blue Cross/Blue Shield,,,,,false,144325.22,25502.85
Long Island,Nassau,2953000,000563,St. Francis Hospital & Heart Center,70 or Older,113,M,White,Not Span/Hispanic,3,Elective,Home or Self Care,2018,MUS029,DISORDERS OF JAW,MST018,BONE EXCISION,089,MAJOR CRANIAL/FACIAL BONE PROCEDURES,03,"DISEASES AND DISORDERS OF THE EAR, NOSE, MOUTH AND THROAT",1,Minor,Minor,Surgical,Medicare,Blue Cross/Blue Shield,,,,false,43142.83,7646.48
New York City,Manhattan,7002017,001450,Lenox Hill Hospital,30 to 49,OOS,F,White,Not Span/Hispanic,11,Elective,Home or Self Care,2018,DIG002,DISORDERS OF TEETH AND GINGIVA,RES010,TRACHEOSTOMY,089,MAJOR CRANIAL/FACIAL BONE PROCEDURES,03,"DISEASES AND DISORDERS OF THE EAR, NOSE, MOUTH AND THROAT",3,Major,Moderate,Surgical,Medicare,Private Health Insurance,,,,false,373337.77,105369.67
Capital/Adirond,Albany,0101004,000005,St. Peter's Hospital,18 to 29,121,M,White,Not Span/Hispanic,6,Elective,Home or Self Care,2018,MUS029,DISORDERS OF JAW,MST012,BONE FIXATION (EXCLUDING EXTREMITIES),089,MAJOR CRANIAL/FACIAL BONE PROCEDURES,03,"DISEASES AND DISORDERS OF THE EAR, NOSE, MOUTH AND THROAT",2,Moderate,Minor,Surgical,Private Health Insurance,,,,,false,62551.1,27496.64
New York City,Manhattan,7002017,001450,Lenox Hill Hospital,70 or Older,112,F,White,Not Span/Hispanic,7,Elective,Home or Self Care,2018,NEO002,HEAD AND NECK CANCERS - LIP AND ORAL CAVITY,MST018,BONE EXCISION,089,MAJOR CRANIAL/FACIAL BONE PROCEDURES,03,"DISEASES AND DISORDERS OF THE EAR, NOSE, MOUTH AND THROAT",1,Minor,Moderate,Surgical,Medicare,Private Health Insurance,,,,false,147940.83,30137.32
New York City,Manhattan,7002032,001466,Mount Sinai West,50 to 69,104,M,Other Race,Spanish/Hispanic,6,Elective,Home w/ Home Health Services,2018,NEO002,HEAD AND NECK CANCERS - LIP AND ORAL CAVITY,RES010,TRACHEOSTOMY,089,MAJOR CRANIAL/FACIAL BONE PROCEDURES,03,"DISEASES AND DISORDERS OF THE EAR, NOSE, MOUTH AND THROAT",3,Major,Moderate,Surgical,Private Health Insurance,Self-Pay,,,,false,122651.22,36483.55
New York City,Queens,7003004,003376,Cohen Children's Medical Center,0 to 17,113,M,White,Not Span/Hispanic,1,Elective,Home or Self Care,2018,MAL008,MUSCULOSKELETAL CONGENITAL CONDITIONS,MST012,BONE FIXATION (EXCLUDING EXTREMITIES),089,MAJOR CRANIAL/FACIAL BONE PROCEDURES,03,"DISEASES AND DISORDERS OF THE EAR, NOSE, MOUTH AND THROAT",2,Moderate,Minor,Surgical,Medicaid,Medicaid,Self-Pay,,,false,25351.9,6454.46
New York City,Queens,7003004,001630,Long Island Jewish Medical Center,18 to 29,113,M,White,Not Span/Hispanic,1,Elective,Home or Self Care,2018,MUS029,DISORDERS OF JAW,MST012,BONE FIXATION (EXCLUDING EXTREMITIES),089,MAJOR CRANIAL/FACIAL BONE PROCEDURES,03,"DISEASES AND DISORDERS OF THE EAR, NOSE, MOUTH AND THROAT",1,Minor,Minor,Surgical,Private Health Insurance,Self-Pay,,,,false,60777.21,16664.81
Western NY,Erie,1401005,000210,Erie County Medical Center,18 to 29,141,F,White,Not Span/Hispanic,7,Elective,Home or Self Care,2018,NEO005,HEAD AND NECK CANCERS - NASOPHARYNGEAL,ENT008,NASAL AND SINUS EXCISION,089,MAJOR CRANIAL/FACIAL BONE PROCEDURES,03,"DISEASES AND DISORDERS OF THE EAR, NOSE, MOUTH AND THROAT",2,Moderate,Minor,Surgical,Medicaid,Medicaid,,,,false,37725.02,24117.59
New York City,Manhattan,7002020,001453,Memorial Hospital for Cancer and Allied Diseases,50 to 69,OOS,M,White,Not Span/Hispanic,23,Emergency,Home or Self Care,2018,NEO002,HEAD AND NECK CANCERS - LIP AND ORAL CAVITY,MST029,"MUSCULOSKELETAL DEVICE PROCEDURES, NEC",089,MAJOR CRANIAL/FACIAL BONE PROCEDURES,03,"DISEASES AND DISORDERS OF THE EAR, NOSE, MOUTH AND THROAT",3,Major,Moderate,Surgical,Private Health Insurance,,,,,false,293197.77,117659.97
New York City,Kings,7001033,001315,Kingsbrook Jewish Medical Center,18 to 29,103,M,Black/African American,Not Span/Hispanic,10,Urgent,Skilled Nursing Home,2018,MUS023,ACQUIRED DEFORMITIES (EXCLUDING FOOT),MST029,"MUSCULOSKELETAL DEVICE PROCEDURES, NEC",089,MAJOR CRANIAL/FACIAL BONE PROCEDURES,03,"DISEASES AND DISORDERS OF THE EAR, NOSE, MOUTH AND THROAT",2,Moderate,Moderate,Surgical,Medicaid,Medicaid,Self-Pay,,,false,128313,39537.77
New York City,Manhattan,7002054,001464,New York-Presbyterian Hospital - Columbia Presbyterian Center,70 or Older,104,F,Other Race,Spanish/Hispanic,7,Elective,Skilled Nursing Home,2018,MUS023,ACQUIRED DEFORMITIES (EXCLUDING FOOT),MST029,"MUSCULOSKELETAL DEVICE PROCEDURES, NEC",089,MAJOR CRANIAL/FACIAL BONE PROCEDURES,03,"DISEASES AND DISORDERS OF THE EAR, NOSE, MOUTH AND THROAT",4,Extreme,Major,Surgical,Medicare,Medicaid,Self-Pay,,,false,230471.38,100252.26
New York City,Manhattan,7002053,001463,NYU Langone Hospitals,30 to 49,117,F,White,Unknown,13,Elective,Skilled Nursing Home,2018,MUS023,ACQUIRED DEFORMITIES (EXCLUDING FOOT),MST012,BONE FIXATION (EXCLUDING EXTREMITIES),089,MAJOR CRANIAL/FACIAL BONE PROCEDURES,03,"DISEASES AND DISORDERS OF THE EAR, NOSE, MOUTH AND THROAT",3,Major,Moderate,Surgical,Blue Cross/Blue Shield,,,,,false,211881.57,63841.29
Finger Lakes,Monroe,2701005,000413,Strong Memorial Hospital,50 to 69,144,M,White,Not Span/Hispanic,3,Elective,Home or Self Care,2018,MUS023,ACQUIRED DEFORMITIES (EXCLUDING FOOT),MST029,"MUSCULOSKELETAL DEVICE PROCEDURES, NEC",089,MAJOR CRANIAL/FACIAL BONE PROCEDURES,03,"DISEASES AND DISORDERS OF THE EAR, NOSE, MOUTH AND THROAT",1,Minor,Minor,Surgical,Self-Pay,Self-Pay,,,,false,46611.79,24229.99
New York City,Manhattan,7002024,001456,Mount Sinai Hospital,50 to 69,112,F,Black/African American,Not Span/Hispanic,5,Elective,Home or Self Care,2018,NEO002,HEAD AND NECK CANCERS - LIP AND ORAL CAVITY,MST018,BONE EXCISION,089,MAJOR CRANIAL/FACIAL BONE PROCEDURES,03,"DISEASES AND DISORDERS OF THE EAR, NOSE, MOUTH AND THROAT",2,Moderate,Minor,Surgical,Blue Cross/Blue Shield,Self-Pay,,,,false,77176.1,25206.4
Hudson Valley,Westchester,5957001,001139,Westchester Medical Center,50 to 69,105,M,Black/African American,Not Span/Hispanic,14,Elective,Home w/ Home Health Services,2018,NEO002,HEAD AND NECK CANCERS - LIP AND ORAL CAVITY,RES010,TRACHEOSTOMY,089,MAJOR CRANIAL/FACIAL BONE PROCEDURES,03,"DISEASES AND DISORDERS OF THE EAR, NOSE, MOUTH AND THROAT",3,Major,Moderate,Surgical,Medicaid,Medicaid,,,,false,636250.35,128302.72
New York City,Manhattan,7002017,001450,Lenox Hill Hospital,50 to 69,100,M,White,Not Span/Hispanic,1,Elective,Left Against Medical Advice,2018,MUS029,DISORDERS OF JAW,MST018,BONE EXCISION,089,MAJOR CRANIAL/FACIAL BONE PROCEDURES,03,"DISEASES AND DISORDERS OF THE EAR, NOSE, MOUTH AND THROAT",3,Major,Major,Surgical,Private Health Insurance,,,,,false,111060.25,37617.86
New York City,Bronx,7000006,001169,Montefiore Medical Center - Henry & Lucy Moses Div,0 to 17,104,M,Other Race,Unknown,1,Elective,Home or Self Care,2018,NEO073,BENIGN NEOPLASMS,MST018,BONE EXCISION,089,MAJOR CRANIAL/FACIAL BONE PROCEDURES,03,"DISEASES AND DISORDERS OF THE EAR, NOSE, MOUTH AND THROAT",1,Minor,Minor,Surgical,Private Health Insurance,,,,,false,29186.25,6378.53
New York City,Manhattan,7002054,001458,New York-Presbyterian Hospital - New York Weill Cornell Center,30 to 49,100,M,Multi-racial,Not Span/Hispanic,6,Elective,Inpatient Rehabilitation Facility,2018,MUS023,ACQUIRED DEFORMITIES (EXCLUDING FOOT),MST029,"MUSCULOSKELETAL DEVICE PROCEDURES, NEC",089,MAJOR CRANIAL/FACIAL BONE PROCEDURES,03,"DISEASES AND DISORDERS OF THE EAR, NOSE, MOUTH AND THROAT",2,Moderate,Minor,Surgical,Medicaid,Self-Pay,,,,false,155023.39,70274.51
New York City,Manhattan,7002054,001458,New York-Presbyterian Hospital - New York Weill Cornell Center,30 to 49,100,F,Other Race,Not Span/Hispanic,1,Elective,Home or Self Care,2018,MUS029,DISORDERS OF JAW,MST012,BONE FIXATION (EXCLUDING EXTREMITIES),089,MAJOR CRANIAL/FACIAL BONE PROCEDURES,03,"DISEASES AND DISORDERS OF THE EAR, NOSE, MOUTH AND THROAT",1,Minor,Minor,Surgical,Private Health Insurance,,,,,false,53993.75,17213.02
Western NY,Erie,1401005,000210,Erie County Medical Center,50 to 69,140,F,White,Not Span/Hispanic,2,Elective,Home w/ Home Health Services,2018,MUS029,DISORDERS OF JAW,MST014,JOINT FUSION (EXCLUDING SPINE),089,MAJOR CRANIAL/FACIAL BONE PROCEDURES,03,"DISEASES AND DISORDERS OF THE EAR, NOSE, MOUTH AND THROAT",3,Major,Minor,Surgical,Medicare,Medicare,,,,false,24713.95,14579.69
New York City,Manhattan,7002032,001466,Mount Sinai West,70 or Older,,M,Other Race,Unknown,33,Urgent,Skilled Nursing Home,2018,NEO010,HEAD AND NECK CANCERS - ALL OTHER TYPES,RES010,TRACHEOSTOMY,089,MAJOR CRANIAL/FACIAL BONE PROCEDURES,03,"DISEASES AND DISORDERS OF THE EAR, NOSE, MOUTH AND THROAT",3,Major,Moderate,Surgical,Medicare,Self-Pay,,,,false,384388.64,100609.48
New York City,Manhattan,7002032,001466,Mount Sinai West,70 or Older,OOS,F,White,Not Span/Hispanic,16,Elective,Inpatient Rehabilitation Facility,2018,NEO002,HEAD AND NECK CANCERS - LIP AND ORAL CAVITY,RES010,TRACHEOSTOMY,089,MAJOR CRANIAL/FACIAL BONE PROCEDURES,03,"DISEASES AND DISORDERS OF THE EAR, NOSE, MOUTH AND THROAT",3,Major,Moderate,Surgical,Medicare,Medicaid,Self-Pay,,,false,246390.49,73360.01
New York City,Manhattan,7002020,001453,Memorial Hospital for Cancer and Allied Diseases,18 to 29,OOS,M,White,Not Span/Hispanic,5,Elective,Home w/ Home Health Services,2018,MUS023,ACQUIRED DEFORMITIES (EXCLUDING FOOT),MST029,"MUSCULOSKELETAL DEVICE PROCEDURES, NEC",089,MAJOR CRANIAL/FACIAL BONE PROCEDURES,03,"DISEASES AND DISORDERS OF THE EAR, NOSE, MOUTH AND THROAT",2,Moderate,Moderate,Surgical,Blue Cross/Blue Shield,Medicaid,,,,false,69556.14,29695.98
New York City,Bronx,7000006,001169,Montefiore Medical Center - Henry & Lucy Moses Div,50 to 69,105,F,Other Race,Spanish/Hispanic,7,Elective,Inpatient Rehabilitation Facility,2018,MUS023,ACQUIRED DEFORMITIES (EXCLUDING FOOT),MST029,"MUSCULOSKELETAL DEVICE PROCEDURES, NEC",089,MAJOR CRANIAL/FACIAL BONE PROCEDURES,03,"DISEASES AND DISORDERS OF THE EAR, NOSE, MOUTH AND THROAT",2,Moderate,Minor,Surgical,Blue Cross/Blue Shield,,,,,false,145689.99,41919.29
New York City,Manhattan,7002020,001453,Memorial Hospital for Cancer and Allied Diseases,70 or Older,110,M,Other Race,Not Span/Hispanic,19,Elective,Home w/ Home Health Services,2018,NEO002,HEAD AND NECK CANCERS - LIP AND ORAL CAVITY,MST029,"MUSCULOSKELETAL DEVICE PROCEDURES, NEC",089,MAJOR CRANIAL/FACIAL BONE PROCEDURES,03,"DISEASES AND DISORDERS OF THE EAR, NOSE, MOUTH AND THROAT",3,Major,Moderate,Surgical,Private Health Insurance,Medicare,,,,false,231652.59,93852.63
Finger Lakes,Monroe,2701003,000411,Rochester General Hospital,70 or Older,146,F,White,Not Span/Hispanic,11,Elective,Home w/ Home Health Services,2018,NEO002,HEAD AND NECK CANCERS - LIP AND ORAL CAVITY,ENT012,"ENT EXCISION (EXCLUDING NASAL PASSAGE, SINUSES, TONGUE, SALIVARY GLANDS, LARYNX)",089,MAJOR CRANIAL/FACIAL BONE PROCEDURES,03,"DISEASES AND DISORDERS OF THE EAR, NOSE, MOUTH AND THROAT",3,Major,Extreme,Surgical,Medicare,Medicare,,,,false,51844.52,24273.61
Western NY,Erie,1401010,000216,Roswell Park Cancer Institute,50 to 69,141,M,White,Not Span/Hispanic,6,Elective,Home or Self Care,2018,NEO002,HEAD AND NECK CANCERS - LIP AND ORAL CAVITY,MST018,BONE EXCISION,089,MAJOR CRANIAL/FACIAL BONE PROCEDURES,03,"DISEASES AND DISORDERS OF THE EAR, NOSE, MOUTH AND THROAT",2,Moderate,Minor,Surgical,"Managed Care, Unspecified",,,,,false,51740.1,19110.44
Hudson Valley,Westchester,5957001,001139,Westchester Medical Center,18 to 29,105,M,White,Not Span/Hispanic,1,Elective,Home or Self Care,2018,MUS023,ACQUIRED DEFORMITIES (EXCLUDING FOOT),MST029,"MUSCULOSKELETAL DEVICE PROCEDURES, NEC",089,MAJOR CRANIAL/FACIAL BONE PROCEDURES,03,"DISEASES AND DISORDERS OF THE EAR, NOSE, MOUTH AND THROAT",3,Major,Minor,Surgical,Blue Cross/Blue Shield,,,,,false,153606.2,29772.89
Hudson Valley,Westchester,5957001,001139,Westchester Medical Center,0 to 17,125,M,White,Not Span/Hispanic,3,Elective,Home w/ Home Health Services,2018,MAL010,OTHER SPECIFIED AND UNSPECIFIED CONGENITAL ANOMALIES,MST012,BONE FIXATION (EXCLUDING EXTREMITIES),089,MAJOR CRANIAL/FACIAL BONE PROCEDURES,03,"DISEASES AND DISORDERS OF THE EAR, NOSE, MOUTH AND THROAT",3,Major,Minor,Surgical,Blue Cross/Blue Shield,Medicaid,,,,false,147729.73,28468.63