Hospital Service Area,Hospital County,Operating Certificate Number,Permanent Facility Id,Facility Name,Age Group,Zip Code - 3 digits,Gender,Race,Ethnicity,Length of Stay,Type of Admission,Patient Disposition,Discharge Year,CCS Diagnosis Code,CCS Diagnosis Description,CCS Procedure Code,CCS Procedure Description,APR DRG Code,APR DRG Description,APR MDC Code,APR MDC Description,APR Severity of Illness Code,APR Severity of Illness Description,APR Risk of Mortality,APR Medical Surgical Description,Payment Typology 1,Payment Typology 2,Payment Typology 3,Birth Weight,Abortion Edit Indicator,Emergency Department Indicator,Total Charges,Total Costs
New York City,Manhattan,7002024,001456,Mount Sinai Hospital,30 to 49,117,M,White,Not Span/Hispanic,10,Emergency,Home w/ Home Health Services,2020,MUS023,ACQUIRED DEFORMITIES (EXCLUDING FOOT),MST029,"MUSCULOSKELETAL DEVICE PROCEDURES, NEC",089,MAJOR CRANIAL/FACIAL BONE PROCEDURES,03,"DISEASES AND DISORDERS OF THE EAR, NOSE, MOUTH AND THROAT",2,Moderate,Minor,Surgical,Blue Cross/Blue Shield,Self-Pay,,,,Y,197909.82,55212.2
New York City,Manhattan,7002024,001456,Mount Sinai Hospital,30 to 49,112,M,White,Not Span/Hispanic,5,Elective,Home or Self Care,2020,NEO002,HEAD AND NECK CANCERS - LIP AND ORAL CAVITY,MST018,BONE EXCISION,089,MAJOR CRANIAL/FACIAL BONE PROCEDURES,03,"DISEASES AND DISORDERS OF THE EAR, NOSE, MOUTH AND THROAT",2,Moderate,Minor,Surgical,Private Health Insurance,Self-Pay,,,,N,114057.62,30460.32
New York City,Bronx,7000006,001169,Montefiore Medical Center - Henry & Lucy Moses Div,0 to 17,104,F,Other Race,Unknown,5,Elective,Home or Self Care,2020,MAL008,MUSCULOSKELETAL CONGENITAL CONDITIONS,MST012,BONE FIXATION (EXCLUDING EXTREMITIES),089,MAJOR CRANIAL/FACIAL BONE PROCEDURES,03,"DISEASES AND DISORDERS OF THE EAR, NOSE, MOUTH AND THROAT",2,Moderate,Minor,Surgical,Medicaid,,,,,N,139923.86,31436.06
New York City,Manhattan,7002024,001456,Mount Sinai Hospital,70 or Older,OOS,M,White,Not Span/Hispanic,5,Elective,Home w/ Home Health Services,2020,NEO004,HEAD AND NECK CANCERS - SALIVARY GLAND,ENT012,"ENT EXCISION (EXCLUDING NASAL PASSAGE, SINUSES, TONGUE, SALIVARY GLANDS, LARYNX)",089,MAJOR CRANIAL/FACIAL BONE PROCEDURES,03,"DISEASES AND DISORDERS OF THE EAR, NOSE, MOUTH AND THROAT",3,Major,Moderate,Surgical,Medicare,Federal/State/Local/VA,Self-Pay,,,N,133085.57,36188.43
New York City,Manhattan,7002024,001456,Mount Sinai Hospital,0 to 17,112,M,Other Race,Spanish/Hispanic,3,Emergency,Home or Self Care,2020,EAR002,DISEASES OF MIDDLE EAR AND MASTOID (EXCEPT OTITIS MEDIA),ENT005,MYRINGOTOMY,089,MAJOR CRANIAL/FACIAL BONE PROCEDURES,03,"DISEASES AND DISORDERS OF THE EAR, NOSE, MOUTH AND THROAT",2,Moderate,Minor,Surgical,Medicaid,Medicaid,Self-Pay,,,Y,57225.01,26672.78
New York City,Manhattan,7002054,001464,New York-Presbyterian Hospital - Columbia Presbyterian Center,0 to 17,112,M,White,Not Span/Hispanic,1,Urgent,Home or Self Care,2020,EAR001,OTITIS MEDIA,MST029,"MUSCULOSKELETAL DEVICE PROCEDURES, NEC",089,MAJOR CRANIAL/FACIAL BONE PROCEDURES,03,"DISEASES AND DISORDERS OF THE EAR, NOSE, MOUTH AND THROAT",1,Minor,Minor,Surgical,Medicaid,Medicaid,Self-Pay,,,N,41440.08,13329.9
New York City,Manhattan,7002054,001464,New York-Presbyterian Hospital - Columbia Presbyterian Center,0 to 17,104,F,White,Spanish/Hispanic,5,Elective,Home or Self Care,2020,MAL008,MUSCULOSKELETAL CONGENITAL CONDITIONS,MST012,BONE FIXATION (EXCLUDING EXTREMITIES),089,MAJOR CRANIAL/FACIAL BONE PROCEDURES,03,"DISEASES AND DISORDERS OF THE EAR, NOSE, MOUTH AND THROAT",1,Minor,Minor,Surgical,Medicaid,Medicaid,Self-Pay,,,N,146375.49,53118.3
New York City,Manhattan,7002054,001464,New York-Presbyterian Hospital - Columbia Presbyterian Center,50 to 69,OOS,F,Black/African American,Not Span/Hispanic,2,Urgent,Home w/ Home Health Services,2020,NEO073,BENIGN NEOPLASMS,MST018,BONE EXCISION,089,MAJOR CRANIAL/FACIAL BONE PROCEDURES,03,"DISEASES AND DISORDERS OF THE EAR, NOSE, MOUTH AND THROAT",1,Minor,Minor,Surgical,Private Health Insurance,Self-Pay,,,,N,24773.98,6043.13
New York City,Manhattan,7002024,001456,Mount Sinai Hospital,50 to 69,105,F,White,Not Span/Hispanic,7,Elective,Home or Self Care,2020,NEO009,HEAD AND NECK CANCERS - TONSILS,RES010,TRACHEOSTOMY,089,MAJOR CRANIAL/FACIAL BONE PROCEDURES,03,"DISEASES AND DISORDERS OF THE EAR, NOSE, MOUTH AND THROAT",3,Major,Moderate,Surgical,Blue Cross/Blue Shield,Self-Pay,,,,N,170042.73,47182.02
New York City,Queens,7003010,001637,New York - Presbyterian/Queens,18 to 29,104,F,Other Race,Spanish/Hispanic,3,Elective,Home w/ Home Health Services,2020,MUS023,ACQUIRED DEFORMITIES (EXCLUDING FOOT),MST030,"MUSCULOSKELETAL PROCEDURES, NEC",089,MAJOR CRANIAL/FACIAL BONE PROCEDURES,03,"DISEASES AND DISORDERS OF THE EAR, NOSE, MOUTH AND THROAT",2,Moderate,Minor,Surgical,Miscellaneous/Other,Self-Pay,,,,N,44666.3,15371.07
New York City,Queens,7003010,001637,New York - Presbyterian/Queens,70 or Older,114,F,Black/African American,Not Span/Hispanic,6,Emergency,Home w/ Home Health Services,2020,DIG003,DISEASES OF MOUTH; EXCLUDING DENTAL,MST018,BONE EXCISION,089,MAJOR CRANIAL/FACIAL BONE PROCEDURES,03,"DISEASES AND DISORDERS OF THE EAR, NOSE, MOUTH AND THROAT",2,Moderate,Moderate,Surgical,Medicare,Medicare,Self-Pay,,,Y,61061.48,16495.64
New York City,Manhattan,7002054,001458,New York-Presbyterian Hospital - New York Weill Cornell Center,70 or Older,114,F,White,Not Span/Hispanic,2,Elective,Home or Self Care,2020,NEO023,BONE CANCER,MST018,BONE EXCISION,089,MAJOR CRANIAL/FACIAL BONE PROCEDURES,03,"DISEASES AND DISORDERS OF THE EAR, NOSE, MOUTH AND THROAT",2,Moderate,Minor,Surgical,Medicare,Private Health Insurance,Self-Pay,,,N,67979.55,20342.74
New York City,Manhattan,7002054,001458,New York-Presbyterian Hospital - New York Weill Cornell Center,30 to 49,112,F,White,Not Span/Hispanic,1,Emergency,Home or Self Care,2020,INJ001,"FRACTURE OF HEAD AND NECK, INITIAL ENCOUNTER",MST012,BONE FIXATION (EXCLUDING EXTREMITIES),089,MAJOR CRANIAL/FACIAL BONE PROCEDURES,03,"DISEASES AND DISORDERS OF THE EAR, NOSE, MOUTH AND THROAT",3,Major,Minor,Surgical,Private Health Insurance,Self-Pay,,,,N,51354.87,17129.38
New York City,Manhattan,7002054,001458,New York-Presbyterian Hospital - New York Weill Cornell Center,50 to 69,OOS,F,Multi-racial,Not Span/Hispanic,4,Elective,Home or Self Care,2020,NEO010,HEAD AND NECK CANCERS - ALL OTHER TYPES,ENT008,NASAL AND SINUS EXCISION,089,MAJOR CRANIAL/FACIAL BONE PROCEDURES,03,"DISEASES AND DISORDERS OF THE EAR, NOSE, MOUTH AND THROAT",1,Minor,Minor,Surgical,Blue Cross/Blue Shield,Self-Pay,,,,N,167482.22,72552.69
New York City,Manhattan,7002054,001458,New York-Presbyterian Hospital - New York Weill Cornell Center,50 to 69,107,M,Other Race,Not Span/Hispanic,3,Elective,Home or Self Care,2020,MUS023,ACQUIRED DEFORMITIES (EXCLUDING FOOT),MST030,"MUSCULOSKELETAL PROCEDURES, NEC",089,MAJOR CRANIAL/FACIAL BONE PROCEDURES,03,"DISEASES AND DISORDERS OF THE EAR, NOSE, MOUTH AND THROAT",2,Moderate,Minor,Surgical,"Managed Care, Unspecified",Medicaid,Self-Pay,,,N,152136.1,73403.96
New York City,Manhattan,7002054,001458,New York-Presbyterian Hospital - New York Weill Cornell Center,0 to 17,111,F,Other Race,Not Span/Hispanic,4,Elective,Home or Self Care,2020,MAL008,MUSCULOSKELETAL CONGENITAL CONDITIONS,MST012,BONE FIXATION (EXCLUDING EXTREMITIES),089,MAJOR CRANIAL/FACIAL BONE PROCEDURES,03,"DISEASES AND DISORDERS OF THE EAR, NOSE, MOUTH AND THROAT",1,Minor,Minor,Surgical,"Managed Care, Unspecified",Medicaid,Self-Pay,,,N,155149.32,64628.26
New York City,Manhattan,7002054,001458,New York-Presbyterian Hospital - New York Weill Cornell Center,70 or Older,117,M,Other Race,Not Span/Hispanic,3,Elective,Home or Self Care,2020,NEO073,BENIGN NEOPLASMS,MST018,BONE EXCISION,089,MAJOR CRANIAL/FACIAL BONE PROCEDURES,03,"DISEASES AND DISORDERS OF THE EAR, NOSE, MOUTH AND THROAT",1,Minor,Minor,Surgical,Blue Cross/Blue Shield,Self-Pay,,,,N,113879.08,46419.86
New York City,Bronx,7000006,001169,Montefiore Medical Center - Henry & Lucy Moses Div,50 to 69,104,F,Other Race,Spanish/Hispanic,2,Emergency,Home or Self Care,2020,MUS023,ACQUIRED DEFORMITIES (EXCLUDING FOOT),MST029,"MUSCULOSKELETAL DEVICE PROCEDURES, NEC",089,MAJOR CRANIAL/FACIAL BONE PROCEDURES,03,"DISEASES AND DISORDERS OF THE EAR, NOSE, MOUTH AND THROAT",3,Major,Moderate,Surgical,Medicaid,,,,,N,81113.25,15326.18
New York City,Bronx,7000006,001169,Montefiore Medical Center - Henry & Lucy Moses Div,30 to 49,OOS,M,Other Race,Unknown,1,Elective,Home or Self Care,2020,MUS029,DISORDERS OF JAW,MST029,"MUSCULOSKELETAL DEVICE PROCEDURES, NEC",089,MAJOR CRANIAL/FACIAL BONE PROCEDURES,03,"DISEASES AND DISORDERS OF THE EAR, NOSE, MOUTH AND THROAT",1,Minor,Minor,Surgical,Private Health Insurance,,,,,N,87507.17,22341.02
Western NY,Erie,1401005,000210,Erie County Medical Center,70 or Older,140,M,White,Not Span/Hispanic,10,Elective,Home or Self Care,2020,NEO002,HEAD AND NECK CANCERS - LIP AND ORAL CAVITY,ENT001,LARYNGOSCOPY (DIAGNOSTIC),089,MAJOR CRANIAL/FACIAL BONE PROCEDURES,03,"DISEASES AND DISORDERS OF THE EAR, NOSE, MOUTH AND THROAT",4,Extreme,Extreme,Surgical,Self-Pay,,,,,N,79876.03,45821.69
Western NY,Erie,1401005,000210,Erie County Medical Center,18 to 29,143,F,Other Race,Not Span/Hispanic,1,Elective,Home or Self Care,2020,NEO073,BENIGN NEOPLASMS,MST018,BONE EXCISION,089,MAJOR CRANIAL/FACIAL BONE PROCEDURES,03,"DISEASES AND DISORDERS OF THE EAR, NOSE, MOUTH AND THROAT",1,Minor,Minor,Surgical,Medicaid,Medicaid,,,,N,48866.55,26368.58
Western NY,Erie,1401005,000210,Erie County Medical Center,70 or Older,141,M,White,Not Span/Hispanic,2,Elective,Home or Self Care,2020,NEO002,HEAD AND NECK CANCERS - LIP AND ORAL CAVITY,ENT012,"ENT EXCISION (EXCLUDING NASAL PASSAGE, SINUSES, TONGUE, SALIVARY GLANDS, LARYNX)",089,MAJOR CRANIAL/FACIAL BONE PROCEDURES,03,"DISEASES AND DISORDERS OF THE EAR, NOSE, MOUTH AND THROAT",2,Moderate,Minor,Surgical,Medicare,Medicare,,,,N,31741.4,18092.41
Western NY,Erie,1401005,000210,Erie County Medical Center,50 to 69,140,F,White,Not Span/Hispanic,16,Elective,Home w/ Home Health Services,2020,NEO002,HEAD AND NECK CANCERS - LIP AND ORAL CAVITY,RES007,AIRWAY INTUBATION,089,MAJOR CRANIAL/FACIAL BONE PROCEDURES,03,"DISEASES AND DISORDERS OF THE EAR, NOSE, MOUTH AND THROAT",3,Major,Moderate,Surgical,Medicare,Federal/State/Local/VA,Medicare,,,N,92362.56,56759.65
New York City,Bronx,7000006,001169,Montefiore Medical Center - Henry & Lucy Moses Div,70 or Older,106,M,Other Race,Unknown,1,Elective,Home or Self Care,2020,NEO073,BENIGN NEOPLASMS,MST018,BONE EXCISION,089,MAJOR CRANIAL/FACIAL BONE PROCEDURES,03,"DISEASES AND DISORDERS OF THE EAR, NOSE, MOUTH AND THROAT",1,Minor,Minor,Surgical,Blue Cross/Blue Shield,,,,,N,98760.82,24048.07
New York City,Manhattan,7002024,001456,Mount Sinai Hospital,50 to 69,OOS,M,Other Race,Not Span/Hispanic,8,Elective,Home w/ Home Health Services,2020,NEO023,BONE CANCER,MST020,SUBCUTANEOUS TISSUE AND FASCIA EXCISION,089,MAJOR CRANIAL/FACIAL BONE PROCEDURES,03,"DISEASES AND DISORDERS OF THE EAR, NOSE, MOUTH AND THROAT",3,Major,Moderate,Surgical,Medicare,Private Health Insurance,Self-Pay,,,N,172935.68,44997.9
New York City,Manhattan,7002024,001456,Mount Sinai Hospital,30 to 49,104,M,Black/African American,Not Span/Hispanic,9,Elective,Home w/ Home Health Services,2020,NEO023,BONE CANCER,RES010,TRACHEOSTOMY,089,MAJOR CRANIAL/FACIAL BONE PROCEDURES,03,"DISEASES AND DISORDERS OF THE EAR, NOSE, MOUTH AND THROAT",3,Major,Moderate,Surgical,Blue Cross/Blue Shield,Self-Pay,,,,N,169315.24,46592.08
New York City,Manhattan,7002053,001463,NYU Langone Hospitals,30 to 49,100,F,White,Not Span/Hispanic,1,Emergency,Home or Self Care,2020,DIG002,DISORDERS OF TEETH AND GINGIVA,MST018,BONE EXCISION,089,MAJOR CRANIAL/FACIAL BONE PROCEDURES,03,"DISEASES AND DISORDERS OF THE EAR, NOSE, MOUTH AND THROAT",1,Minor,Minor,Surgical,Private Health Insurance,,,,,Y,34877.03,7019.82
New York City,Manhattan,7002053,001463,NYU Langone Hospitals,0 to 17,OOS,M,White,Not Span/Hispanic,2,Elective,Home or Self Care,2020,MAL008,MUSCULOSKELETAL CONGENITAL CONDITIONS,MST012,BONE FIXATION (EXCLUDING EXTREMITIES),089,MAJOR CRANIAL/FACIAL BONE PROCEDURES,03,"DISEASES AND DISORDERS OF THE EAR, NOSE, MOUTH AND THROAT",2,Moderate,Minor,Surgical,Blue Cross/Blue Shield,,,,,N,95874.75,17910.13
New York City,Manhattan,7002024,001456,Mount Sinai Hospital,50 to 69,112,M,Other Race,Not Span/Hispanic,1,Elective,Home or Self Care,2020,NEO073,BENIGN NEOPLASMS,MST018,BONE EXCISION,089,MAJOR CRANIAL/FACIAL BONE PROCEDURES,03,"DISEASES AND DISORDERS OF THE EAR, NOSE, MOUTH AND THROAT",2,Moderate,Minor,Surgical,Private Health Insurance,Self-Pay,,,,N,37817.24,10529.98
New York City,Manhattan,7002053,001463,NYU Langone Hospitals,0 to 17,112,F,Other Race,Not Span/Hispanic,2,Elective,Home or Self Care,2020,MAL008,MUSCULOSKELETAL CONGENITAL CONDITIONS,MST012,BONE FIXATION (EXCLUDING EXTREMITIES),089,MAJOR CRANIAL/FACIAL BONE PROCEDURES,03,"DISEASES AND DISORDERS OF THE EAR, NOSE, MOUTH AND THROAT",2,Moderate,Moderate,Surgical,Medicaid,,,,,N,117394.98,19505.41
New York City,Manhattan,7002053,001463,NYU Langone Hospitals,50 to 69,113,M,Other Race,Not Span/Hispanic,6,Elective,Home w/ Home Health Services,2020,NEO002,HEAD AND NECK CANCERS - LIP AND ORAL CAVITY,MST018,BONE EXCISION,089,MAJOR CRANIAL/FACIAL BONE PROCEDURES,03,"DISEASES AND DISORDERS OF THE EAR, NOSE, MOUTH AND THROAT",3,Major,Moderate,Surgical,Blue Cross/Blue Shield,,,,,N,275123.2,46849.9
New York City,Manhattan,7002053,001463,NYU Langone Hospitals,0 to 17,112,M,Black/African American,Not Span/Hispanic,1,Elective,Home or Self Care,2020,MAL008,MUSCULOSKELETAL CONGENITAL CONDITIONS,MST018,BONE EXCISION,089,MAJOR CRANIAL/FACIAL BONE PROCEDURES,03,"DISEASES AND DISORDERS OF THE EAR, NOSE, MOUTH AND THROAT",1,Minor,Minor,Surgical,Medicaid,,,,,N,54986.44,9890.03
New York City,Manhattan,7002024,001456,Mount Sinai Hospital,30 to 49,111,F,White,Not Span/Hispanic,5,Elective,Home w/ Home Health Services,2020,NEO023,BONE CANCER,MST018,BONE EXCISION,089,MAJOR CRANIAL/FACIAL BONE PROCEDURES,03,"DISEASES AND DISORDERS OF THE EAR, NOSE, MOUTH AND THROAT",2,Moderate,Minor,Surgical,Private Health Insurance,Self-Pay,,,,N,142989.07,45623.64
New York City,Bronx,7000006,001169,Montefiore Medical Center - Henry & Lucy Moses Div,0 to 17,100,M,Other Race,Unknown,5,Elective,Home or Self Care,2020,MAL008,MUSCULOSKELETAL CONGENITAL CONDITIONS,MST012,BONE FIXATION (EXCLUDING EXTREMITIES),089,MAJOR CRANIAL/FACIAL BONE PROCEDURES,03,"DISEASES AND DISORDERS OF THE EAR, NOSE, MOUTH AND THROAT",3,Major,Minor,Surgical,Medicaid,,,,,N,162416.33,38124.74
New York City,Manhattan,7002053,001463,NYU Langone Hospitals,0 to 17,112,F,White,Spanish/Hispanic,3,Elective,Home or Self Care,2020,MAL008,MUSCULOSKELETAL CONGENITAL CONDITIONS,MST012,BONE FIXATION (EXCLUDING EXTREMITIES),089,MAJOR CRANIAL/FACIAL BONE PROCEDURES,03,"DISEASES AND DISORDERS OF THE EAR, NOSE, MOUTH AND THROAT",2,Moderate,Minor,Surgical,Medicaid,,,,,N,144072.56,24597.58
New York City,Manhattan,7002053,001463,NYU Langone Hospitals,70 or Older,112,F,Black/African American,Not Span/Hispanic,5,Elective,Home w/ Home Health Services,2020,NEO004,HEAD AND NECK CANCERS - SALIVARY GLAND,MST028,"SUBCUTANEOUS TISSUE AND FASCIA PROCEDURES, NEC",089,MAJOR CRANIAL/FACIAL BONE PROCEDURES,03,"DISEASES AND DISORDERS OF THE EAR, NOSE, MOUTH AND THROAT",3,Major,Moderate,Surgical,Blue Cross/Blue Shield,,,,,N,265766.93,59316.31
New York City,Manhattan,7002053,001463,NYU Langone Hospitals,50 to 69,100,M,Other Race,Not Span/Hispanic,14,Elective,Home w/ Home Health Services,2020,NEO002,HEAD AND NECK CANCERS - LIP AND ORAL CAVITY,MST018,BONE EXCISION,089,MAJOR CRANIAL/FACIAL BONE PROCEDURES,03,"DISEASES AND DISORDERS OF THE EAR, NOSE, MOUTH AND THROAT",3,Major,Major,Surgical,Blue Cross/Blue Shield,,,,,N,683628.39,160684.51
Finger Lakes,Monroe,2701005,000413,Strong Memorial Hospital,70 or Older,144,F,White,Not Span/Hispanic,8,Elective,Home w/ Home Health Services,2020,NEO002,HEAD AND NECK CANCERS - LIP AND ORAL CAVITY,MST018,BONE EXCISION,089,MAJOR CRANIAL/FACIAL BONE PROCEDURES,03,"DISEASES AND DISORDERS OF THE EAR, NOSE, MOUTH AND THROAT",3,Major,Minor,Surgical,Medicare,Blue Cross/Blue Shield,,,,N,39286.45,19193.67
Capital/Adirond,Albany,0101000,000001,Albany Medical Center Hospital,0 to 17,124,M,White,Not Span/Hispanic,3,Elective,Home or Self Care,2020,MAL008,MUSCULOSKELETAL CONGENITAL CONDITIONS,MST012,BONE FIXATION (EXCLUDING EXTREMITIES),089,MAJOR CRANIAL/FACIAL BONE PROCEDURES,03,"DISEASES AND DISORDERS OF THE EAR, NOSE, MOUTH AND THROAT",1,Minor,Minor,Surgical,"Managed Care, Unspecified",,,,,N,62786.8,25371.38
Capital/Adirond,Albany,0101000,000001,Albany Medical Center Hospital,50 to 69,121,M,White,Not Span/Hispanic,10,Elective,Home w/ Home Health Services,2020,NEO002,HEAD AND NECK CANCERS - LIP AND ORAL CAVITY,ENT012,"ENT EXCISION (EXCLUDING NASAL PASSAGE, SINUSES, TONGUE, SALIVARY GLANDS, LARYNX)",089,MAJOR CRANIAL/FACIAL BONE PROCEDURES,03,"DISEASES AND DISORDERS OF THE EAR, NOSE, MOUTH AND THROAT",4,Extreme,Extreme,Surgical,"Managed Care, Unspecified",,,,,N,157932.74,63574.24
Capital/Adirond,Albany,0101000,000001,Albany Medical Center Hospital,50 to 69,128,F,White,Not Span/Hispanic,3,Elective,Medicare Cert Long Term Care Hospital,2020,MUS023,ACQUIRED DEFORMITIES (EXCLUDING FOOT),MST029,"MUSCULOSKELETAL DEVICE PROCEDURES, NEC",089,MAJOR CRANIAL/FACIAL BONE PROCEDURES,03,"DISEASES AND DISORDERS OF THE EAR, NOSE, MOUTH AND THROAT",2,Moderate,Minor,Surgical,Medicaid,,,,,N,18160.55,6777.9
New York City,Manhattan,7002032,001466,Mount Sinai West,70 or Older,121,F,White,Not Span/Hispanic,30,Elective,Skilled Nursing Home,2020,NEO002,HEAD AND NECK CANCERS - LIP AND ORAL CAVITY,ENT012,"ENT EXCISION (EXCLUDING NASAL PASSAGE, SINUSES, TONGUE, SALIVARY GLANDS, LARYNX)",089,MAJOR CRANIAL/FACIAL BONE PROCEDURES,03,"DISEASES AND DISORDERS OF THE EAR, NOSE, MOUTH AND THROAT",3,Major,Major,Surgical,Medicare,Medicare,Self-Pay,,,N,657405.06,158451.8
New York City,Manhattan,7002032,001466,Mount Sinai West,70 or Older,106,F,White,Not Span/Hispanic,2,Elective,Home or Self Care,2020,MUS029,DISORDERS OF JAW,MST018,BONE EXCISION,089,MAJOR CRANIAL/FACIAL BONE PROCEDURES,03,"DISEASES AND DISORDERS OF THE EAR, NOSE, MOUTH AND THROAT",2,Moderate,Minor,Surgical,Medicare,Blue Cross/Blue Shield,Self-Pay,,,N,35868.58,8449.94
New York City,Manhattan,7002032,001466,Mount Sinai West,70 or Older,OOS,M,White,Not Span/Hispanic,7,Elective,Home w/ Home Health Services,2020,NEO002,HEAD AND NECK CANCERS - LIP AND ORAL CAVITY,MST018,BONE EXCISION,089,MAJOR CRANIAL/FACIAL BONE PROCEDURES,03,"DISEASES AND DISORDERS OF THE EAR, NOSE, MOUTH AND THROAT",3,Major,Minor,Surgical,Medicare,Medicare,Self-Pay,,,N,199989.18,48008.81
New York City,Manhattan,7002032,001466,Mount Sinai West,70 or Older,124,F,White,Not Span/Hispanic,11,Elective,Home w/ Home Health Services,2020,NEO002,HEAD AND NECK CANCERS - LIP AND ORAL CAVITY,RES010,TRACHEOSTOMY,089,MAJOR CRANIAL/FACIAL BONE PROCEDURES,03,"DISEASES AND DISORDERS OF THE EAR, NOSE, MOUTH AND THROAT",3,Major,Moderate,Surgical,Medicare,Medicare,Self-Pay,,,N,319240.26,75481.41
New York City,Kings,7002053,001304,NYU Langone Hospital-Brooklyn,70 or Older,112,M,White,Not Span/Hispanic,1,Elective,Home w/ Home Health Services,2020,MUS023,ACQUIRED DEFORMITIES (EXCLUDING FOOT),MST029,"MUSCULOSKELETAL DEVICE PROCEDURES, NEC",089,MAJOR CRANIAL/FACIAL BONE PROCEDURES,03,"DISEASES AND DISORDERS OF THE EAR, NOSE, MOUTH AND THROAT",1,Minor,Minor,Surgical,Medicare,,,,,N,249481.25,36624.41
New York City,Bronx,7000006,001169,Montefiore Medical Center - Henry & Lucy Moses Div,0 to 17,104,M,Other Race,Not Span/Hispanic,1,Elective,Home or Self Care,2020,NEO073,BENIGN NEOPLASMS,MST018,BONE EXCISION,089,MAJOR CRANIAL/FACIAL BONE PROCEDURES,03,"DISEASES AND DISORDERS OF THE EAR, NOSE, MOUTH AND THROAT",1,Minor,Minor,Surgical,Medicaid,,,,,N,38628.39,8950.72
Western NY,Erie,1401014,000208,John R. Oishei Children's Hospital,0 to 17,140,F,White,Not Span/Hispanic,3,Elective,Home or Self Care,2020,MAL008,MUSCULOSKELETAL CONGENITAL CONDITIONS,MST012,BONE FIXATION (EXCLUDING EXTREMITIES),089,MAJOR CRANIAL/FACIAL BONE PROCEDURES,03,"DISEASES AND DISORDERS OF THE EAR, NOSE, MOUTH AND THROAT",1,Minor,Minor,Surgical,Federal/State/Local/VA,Self-Pay,,,,N,130751,55683.49
New York City,Manhattan,7002054,001464,New York-Presbyterian Hospital - Columbia Presbyterian Center,0 to 17,104,M,Other Race,Not Span/Hispanic,7,Elective,Home or Self Care,2020,MAL008,MUSCULOSKELETAL CONGENITAL CONDITIONS,MST012,BONE FIXATION (EXCLUDING EXTREMITIES),089,MAJOR CRANIAL/FACIAL BONE PROCEDURES,03,"DISEASES AND DISORDERS OF THE EAR, NOSE, MOUTH AND THROAT",1,Minor,Minor,Surgical,Medicaid,Medicaid,Self-Pay,,,N,150329.56,45433.99
New York City,Manhattan,7002054,001458,New York-Presbyterian Hospital - New York Weill Cornell Center,70 or Older,113,M,Other Race,Not Span/Hispanic,6,Emergency,Home or Self Care,2020,NEO023,BONE CANCER,MST018,BONE EXCISION,089,MAJOR CRANIAL/FACIAL BONE PROCEDURES,03,"DISEASES AND DISORDERS OF THE EAR, NOSE, MOUTH AND THROAT",2,Moderate,Moderate,Surgical,"Managed Care, Unspecified",Medicaid,Self-Pay,,,N,109958.54,29782.84
New York City,Manhattan,7002054,001458,New York-Presbyterian Hospital - New York Weill Cornell Center,30 to 49,111,F,Other Race,Not Span/Hispanic,2,Elective,Home or Self Care,2020,MUS029,DISORDERS OF JAW,MST012,BONE FIXATION (EXCLUDING EXTREMITIES),089,MAJOR CRANIAL/FACIAL BONE PROCEDURES,03,"DISEASES AND DISORDERS OF THE EAR, NOSE, MOUTH AND THROAT",1,Minor,Minor,Surgical,Private Health Insurance,Self-Pay,,,,N,177388.37,69561.83
New York City,Manhattan,7002054,001458,New York-Presbyterian Hospital - New York Weill Cornell Center,0 to 17,110,M,Other Race,Not Span/Hispanic,1,Elective,Home or Self Care,2020,MAL008,MUSCULOSKELETAL CONGENITAL CONDITIONS,MST012,BONE FIXATION (EXCLUDING EXTREMITIES),089,MAJOR CRANIAL/FACIAL BONE PROCEDURES,03,"DISEASES AND DISORDERS OF THE EAR, NOSE, MOUTH AND THROAT",1,Minor,Minor,Surgical,"Managed Care, Unspecified",Medicaid,Self-Pay,,,N,46796.77,18717.84
New York City,Manhattan,7002054,001458,New York-Presbyterian Hospital - New York Weill Cornell Center,0 to 17,108,M,Other Race,Not Span/Hispanic,1,Elective,Home or Self Care,2020,MAL008,MUSCULOSKELETAL CONGENITAL CONDITIONS,MST012,BONE FIXATION (EXCLUDING EXTREMITIES),089,MAJOR CRANIAL/FACIAL BONE PROCEDURES,03,"DISEASES AND DISORDERS OF THE EAR, NOSE, MOUTH AND THROAT",1,Minor,Minor,Surgical,Private Health Insurance,Self-Pay,,,,N,47956.72,19061.1
New York City,Manhattan,7002054,001458,New York-Presbyterian Hospital - New York Weill Cornell Center,30 to 49,112,M,Black/African American,Not Span/Hispanic,1,Elective,Home or Self Care,2020,MUS029,DISORDERS OF JAW,CAR024,VENOUS AND ARTERIAL CATHETER PLACEMENT,089,MAJOR CRANIAL/FACIAL BONE PROCEDURES,03,"DISEASES AND DISORDERS OF THE EAR, NOSE, MOUTH AND THROAT",2,Moderate,Minor,Surgical,"Managed Care, Unspecified",Medicaid,Self-Pay,,,N,47858.24,12599.62
New York City,Kings,7001021,001306,New York - Presbyterian Brooklyn Methodist Hospital,50 to 69,112,F,White,Not Span/Hispanic,2,Emergency,Home or Self Care,2020,INJ001,"FRACTURE OF HEAD AND NECK, INITIAL ENCOUNTER",MST029,"MUSCULOSKELETAL DEVICE PROCEDURES, NEC",089,MAJOR CRANIAL/FACIAL BONE PROCEDURES,03,"DISEASES AND DISORDERS OF THE EAR, NOSE, MOUTH AND THROAT",2,Moderate,Minor,Surgical,Blue Cross/Blue Shield,Self-Pay,,,,Y,47414.69,18382.2
New York City,Manhattan,7002054,001458,New York-Presbyterian Hospital - New York Weill Cornell Center,70 or Older,OOS,M,Other Race,Not Span/Hispanic,2,Emergency,Home or Self Care,2020,NEO002,HEAD AND NECK CANCERS - LIP AND ORAL CAVITY,LYM003,LYMPH NODE DISSECTION,089,MAJOR CRANIAL/FACIAL BONE PROCEDURES,03,"DISEASES AND DISORDERS OF THE EAR, NOSE, MOUTH AND THROAT",2,Moderate,Minor,Surgical,Private Health Insurance,Self-Pay,,,,N,65954.81,18964.85