Hospital Service Area,Hospital County,Operating Certificate Number,Permanent Facility Id,Facility Name,Age Group,Zip Code - 3 digits,Gender,Race,Ethnicity,Length of Stay,Type of Admission,Patient Disposition,Discharge Year,CCS Diagnosis Code,CCS Diagnosis Description,CCS Procedure Code,CCS Procedure Description,APR DRG Code,APR DRG Description,APR MDC Code,APR MDC Description,APR Severity of Illness Code,APR Severity of Illness Description,APR Risk of Mortality,APR Medical Surgical Description,Payment Typology 1,Payment Typology 2,Payment Typology 3,Birth Weight,Abortion Edit Indicator,Emergency Department Indicator,Total Charges,Total Costs
New York City,Manhattan,7002032,001466,Mount Sinai West,30 to 49,,M,White,Unknown,78,Emergency,Hospice - Home,2017,005,HIV infection,009,OTHER OR THER NERV SYS,890,HIV w multiple major HIV related conditions,24,Human Immunodeficiency Virus Infections,4,Extreme,Extreme,Medical,Blue Cross/Blue Shield,Medicaid,Self-Pay,,N,Y,1294606.32,378528.65
New York City,Manhattan,7002032,001469,Mount Sinai St. Luke's,50 to 69,,M,Black/African American,Not Span/Hispanic,6,Emergency,Left Against Medical Advice,2017,131,Respiratory failure; insufficiency; arrest (adult),216,RESP INTUB/MECH VENTIL,890,HIV w multiple major HIV related conditions,24,Human Immunodeficiency Virus Infections,3,Major,Major,Medical,Medicaid,Medicaid,Self-Pay,,N,Y,55982.25,14985.00
New York City,Bronx,7000006,001168,Montefiore Medical Center-Wakefield Hospital,50 to 69,,F,Other Race,Spanish/Hispanic,3,Emergency,Left Against Medical Advice,2017,002,Septicemia (except in labor),231,OTHER THERAPEUTIC PRCS,890,HIV w multiple major HIV related conditions,24,Human Immunodeficiency Virus Infections,3,Major,Major,Medical,Medicaid,,,,N,Y,52425.91,10109.64
New York City,Bronx,7000006,003058,Montefiore Med Center - Jack D Weiler Hosp of A Einstein College Div,50 to 69,,F,White,Spanish/Hispanic,5,Emergency,Medicaid Cert Nursing Facility,2017,002,Septicemia (except in labor),000,NO PROC,890,HIV w multiple major HIV related conditions,24,Human Immunodeficiency Virus Infections,4,Extreme,Extreme,Medical,Medicaid,,,,N,Y,52963.32,10299.98
New York City,Manhattan,7002002,001439,Mount Sinai Beth Israel,50 to 69,,F,Black/African American,Spanish/Hispanic,23,Emergency,Skilled Nursing Home,2017,005,HIV infection,004,DIAGNOSTIC SPINAL TAP,890,HIV w multiple major HIV related conditions,24,Human Immunodeficiency Virus Infections,3,Major,Major,Medical,Medicaid,Medicaid,Self-Pay,,N,Y,186513.25,58440.36
New York City,Manhattan,7002002,001439,Mount Sinai Beth Israel,30 to 49,,M,Other Race,Not Span/Hispanic,6,Emergency,Left Against Medical Advice,2017,005,HIV infection,231,OTHER THERAPEUTIC PRCS,890,HIV w multiple major HIV related conditions,24,Human Immunodeficiency Virus Infections,4,Extreme,Major,Medical,Medicaid,Self-Pay,,,N,Y,61042.41,17738.37
New York City,Manhattan,7002024,001456,Mount Sinai Hospital,50 to 69,,M,Other Race,Not Span/Hispanic,11,Emergency,Home w/ Home Health Services,2017,131,Respiratory failure; insufficiency; arrest (adult),216,RESP INTUB/MECH VENTIL,890,HIV w multiple major HIV related conditions,24,Human Immunodeficiency Virus Infections,4,Extreme,Extreme,Medical,Medicare,Medicare,Medicaid,,N,Y,151785.77,56439.90
New York City,Manhattan,7002032,001466,Mount Sinai West,30 to 49,,F,Black/African American,Spanish/Hispanic,6,Emergency,Home or Self Care,2017,002,Septicemia (except in labor),231,OTHER THERAPEUTIC PRCS,890,HIV w multiple major HIV related conditions,24,Human Immunodeficiency Virus Infections,4,Extreme,Extreme,Medical,Medicaid,Medicaid,Self-Pay,,N,Y,50277.48,13518.07
New York City,Bronx,7000006,001168,Montefiore Medical Center-Wakefield Hospital,50 to 69,,M,Black/African American,Not Span/Hispanic,54,Emergency,Skilled Nursing Home,2017,005,HIV infection,231,OTHER THERAPEUTIC PRCS,890,HIV w multiple major HIV related conditions,24,Human Immunodeficiency Virus Infections,4,Extreme,Extreme,Medical,Medicaid,,,,N,Y,506454.05,108328.89
New York City,Bronx,7000006,001169,Montefiore Medical Center - Henry & Lucy Moses Div,18 to 29,,F,Black/African American,Not Span/Hispanic,11,Emergency,Home or Self Care,2017,005,HIV infection,070,UP GASTRO ENDOSC/BIOPSY,890,HIV w multiple major HIV related conditions,24,Human Immunodeficiency Virus Infections,3,Major,Major,Medical,Medicaid,,,,N,Y,113288.12,24940.49
New York City,Manhattan,7002002,001439,Mount Sinai Beth Israel,18 to 29,,M,Black/African American,Spanish/Hispanic,10,Emergency,Home or Self Care,2017,005,HIV infection,224,CANCER CHEMOTHERAPY,890,HIV w multiple major HIV related conditions,24,Human Immunodeficiency Virus Infections,3,Major,Major,Medical,Medicaid,Medicaid,Self-Pay,,N,Y,129672.75,38315.60
New York City,Manhattan,7002024,001456,Mount Sinai Hospital,30 to 49,,M,Black/African American,Not Span/Hispanic,2,Urgent,Home or Self Care,2017,005,HIV infection,019,OT THER PRCS EYELIDS,890,HIV w multiple major HIV related conditions,24,Human Immunodeficiency Virus Infections,3,Major,Moderate,Medical,Blue Cross/Blue Shield,Self-Pay,,,N,N,13964.65,4667.93
New York City,Manhattan,7002024,001456,Mount Sinai Hospital,30 to 49,,M,Black/African American,Not Span/Hispanic,9,Emergency,Home or Self Care,2017,005,HIV infection,070,UP GASTRO ENDOSC/BIOPSY,890,HIV w multiple major HIV related conditions,24,Human Immunodeficiency Virus Infections,3,Major,Moderate,Medical,Self-Pay,Self-Pay,,,N,Y,96546.48,30911.17
New York City,Manhattan,7002024,001456,Mount Sinai Hospital,18 to 29,,M,Other Race,Not Span/Hispanic,10,Emergency,Home or Self Care,2017,005,HIV infection,173,OT DX PRC SKIN/SUBCUTAN,890,HIV w multiple major HIV related conditions,24,Human Immunodeficiency Virus Infections,4,Extreme,Major,Medical,Medicaid,Self-Pay,,,N,Y,85930.89,29703.53
New York City,Manhattan,7002032,001469,Mount Sinai St. Luke's,30 to 49,,F,Black/African American,Not Span/Hispanic,6,Emergency,Expired,2017,005,HIV infection,216,RESP INTUB/MECH VENTIL,890,HIV w multiple major HIV related conditions,24,Human Immunodeficiency Virus Infections,4,Extreme,Extreme,Medical,Medicaid,Medicaid,Self-Pay,,N,Y,78235.20,24697.49
New York City,Manhattan,7002032,001469,Mount Sinai St. Luke's,50 to 69,,F,Black/African American,Not Span/Hispanic,3,Emergency,Left Against Medical Advice,2017,002,Septicemia (except in labor),070,UP GASTRO ENDOSC/BIOPSY,890,HIV w multiple major HIV related conditions,24,Human Immunodeficiency Virus Infections,3,Major,Major,Medical,Medicaid,Medicaid,Self-Pay,,N,Y,45675.65,12904.86
New York City,Bronx,7000006,001168,Montefiore Medical Center-Wakefield Hospital,50 to 69,,M,Other Race,Spanish/Hispanic,3,Emergency,Home or Self Care,2017,002,Septicemia (except in labor),168,"INCIS/DRAIN, SKIN/SUBCU",890,HIV w multiple major HIV related conditions,24,Human Immunodeficiency Virus Infections,3,Major,Major,Medical,Medicaid,,,,N,Y,52092.57,8717.85
New York City,Bronx,7000006,001169,Montefiore Medical Center - Henry & Lucy Moses Div,50 to 69,,M,Other Race,Not Span/Hispanic,19,Emergency,Home w/ Home Health Services,2017,005,HIV infection,216,RESP INTUB/MECH VENTIL,890,HIV w multiple major HIV related conditions,24,Human Immunodeficiency Virus Infections,4,Extreme,Extreme,Medical,Medicaid,,,,N,Y,340267.67,75528.14
New York City,Bronx,7000006,001169,Montefiore Medical Center - Henry & Lucy Moses Div,50 to 69,,F,Other Race,Not Span/Hispanic,8,Emergency,Left Against Medical Advice,2017,002,Septicemia (except in labor),231,OTHER THERAPEUTIC PRCS,890,HIV w multiple major HIV related conditions,24,Human Immunodeficiency Virus Infections,4,Extreme,Extreme,Medical,Medicaid,,,,N,Y,162941.95,36635.02
New York City,Bronx,7000006,001169,Montefiore Medical Center - Henry & Lucy Moses Div,18 to 29,,M,Black/African American,Not Span/Hispanic,5,Emergency,Home or Self Care,2017,002,Septicemia (except in labor),054,OT VASC CATH; NOT HEART,890,HIV w multiple major HIV related conditions,24,Human Immunodeficiency Virus Infections,4,Extreme,Extreme,Medical,Medicaid,,,,N,Y,89760.94,19149.50
New York City,Bronx,7000006,001169,Montefiore Medical Center - Henry & Lucy Moses Div,50 to 69,,M,Black/African American,Not Span/Hispanic,4,Emergency,Home or Self Care,2017,002,Septicemia (except in labor),000,NO PROC,890,HIV w multiple major HIV related conditions,24,Human Immunodeficiency Virus Infections,3,Major,Major,Medical,Medicaid,,,,N,Y,43678.30,8807.88
New York City,Bronx,7000006,001169,Montefiore Medical Center - Henry & Lucy Moses Div,30 to 49,,M,Black/African American,Not Span/Hispanic,5,Emergency,Home or Self Care,2017,002,Septicemia (except in labor),231,OTHER THERAPEUTIC PRCS,890,HIV w multiple major HIV related conditions,24,Human Immunodeficiency Virus Infections,3,Major,Major,Medical,Medicare,Medicaid,,,N,Y,60665.44,11365.86
New York City,Kings,7001003,001288,Brooklyn Hospital Center - Downtown Campus,50 to 69,,M,Black/African American,Not Span/Hispanic,14,Elective,Expired,2017,005,HIV infection,000,NO PROC,890,HIV w multiple major HIV related conditions,24,Human Immunodeficiency Virus Infections,4,Extreme,Extreme,Medical,Private Health Insurance,Medicaid,Self-Pay,,N,N,74209.66,14602.82
New York City,Kings,7001037,001320,University Hospital of Brooklyn,50 to 69,,M,Black/African American,Not Span/Hispanic,9,Emergency,Home or Self Care,2017,002,Septicemia (except in labor),231,OTHER THERAPEUTIC PRCS,890,HIV w multiple major HIV related conditions,24,Human Immunodeficiency Virus Infections,3,Major,Major,Medical,Private Health Insurance,Self-Pay,,,N,Y,51532.35,31542.97
New York City,Kings,7001037,001320,University Hospital of Brooklyn,50 to 69,,F,Black/African American,Not Span/Hispanic,4,Emergency,Left Against Medical Advice,2017,002,Septicemia (except in labor),231,OTHER THERAPEUTIC PRCS,890,HIV w multiple major HIV related conditions,24,Human Immunodeficiency Virus Infections,3,Major,Major,Medical,Medicaid,Medicaid,Self-Pay,,N,N,28015.60,15304.21
New York City,Manhattan,7002002,001439,Mount Sinai Beth Israel,30 to 49,,M,Black/African American,Not Span/Hispanic,22,Emergency,Expired,2017,002,Septicemia (except in labor),216,RESP INTUB/MECH VENTIL,890,HIV w multiple major HIV related conditions,24,Human Immunodeficiency Virus Infections,4,Extreme,Extreme,Medical,Medicaid,Self-Pay,,,N,Y,246035.66,93249.22
New York City,Manhattan,7002002,001439,Mount Sinai Beth Israel,50 to 69,,M,White,Unknown,7,Emergency,Skilled Nursing Home,2017,002,Septicemia (except in labor),231,OTHER THERAPEUTIC PRCS,890,HIV w multiple major HIV related conditions,24,Human Immunodeficiency Virus Infections,3,Major,Major,Medical,Self-Pay,Self-Pay,,,N,Y,64875.11,21479.38
New York City,Manhattan,7002024,001456,Mount Sinai Hospital,50 to 69,,F,Black/African American,Not Span/Hispanic,30,Emergency,Skilled Nursing Home,2017,002,Septicemia (except in labor),224,CANCER CHEMOTHERAPY,890,HIV w multiple major HIV related conditions,24,Human Immunodeficiency Virus Infections,4,Extreme,Extreme,Medical,"Managed Care, Unspecified",Medicaid,Self-Pay,,N,Y,293497.38,99762.50
New York City,Manhattan,7002024,001456,Mount Sinai Hospital,50 to 69,,F,Black/African American,Not Span/Hispanic,11,Emergency,Home w/ Home Health Services,2017,002,Septicemia (except in labor),000,NO PROC,890,HIV w multiple major HIV related conditions,24,Human Immunodeficiency Virus Infections,4,Extreme,Major,Medical,Medicaid,Self-Pay,,,N,Y,95308.25,31822.12
New York City,Manhattan,7002024,001456,Mount Sinai Hospital,50 to 69,,M,Black/African American,Not Span/Hispanic,13,Emergency,Skilled Nursing Home,2017,002,Septicemia (except in labor),054,OT VASC CATH; NOT HEART,890,HIV w multiple major HIV related conditions,24,Human Immunodeficiency Virus Infections,4,Extreme,Extreme,Medical,Medicaid,Self-Pay,,,N,Y,126047.11,43219.94
New York City,Manhattan,7002032,001469,Mount Sinai St. Luke's,50 to 69,,F,Black/African American,Not Span/Hispanic,26,Emergency,Skilled Nursing Home,2017,005,HIV infection,216,RESP INTUB/MECH VENTIL,890,HIV w multiple major HIV related conditions,24,Human Immunodeficiency Virus Infections,4,Extreme,Extreme,Medical,Medicaid,Self-Pay,,,N,Y,358950.42,119049.69
New York City,Manhattan,7002032,001469,Mount Sinai St. Luke's,50 to 69,,F,White,Spanish/Hispanic,12,Emergency,Skilled Nursing Home,2017,005,HIV infection,193,DX ULTRASOUND HEART,890,HIV w multiple major HIV related conditions,24,Human Immunodeficiency Virus Infections,4,Extreme,Major,Medical,Medicaid,Medicaid,Self-Pay,,N,Y,111502.87,34593.86
New York City,Manhattan,7002032,001469,Mount Sinai St. Luke's,50 to 69,,M,Black/African American,Spanish/Hispanic,5,Emergency,Home or Self Care,2017,002,Septicemia (except in labor),004,DIAGNOSTIC SPINAL TAP,890,HIV w multiple major HIV related conditions,24,Human Immunodeficiency Virus Infections,3,Major,Major,Medical,Medicare,Blue Cross/Blue Shield,Medicaid,,N,Y,55113.97,15966.17
New York City,Kings,7001021,001306,New York - Presbyterian Brooklyn Methodist Hospital,30 to 49,,F,Black/African American,Not Span/Hispanic,10,Emergency,Home or Self Care,2017,005,HIV infection,171,SUTURE SKIN/SUBCUT TISS,890,HIV w multiple major HIV related conditions,24,Human Immunodeficiency Virus Infections,3,Major,Extreme,Medical,Medicaid,Medicaid,Self-Pay,,N,Y,65197.80,22644.99
New York City,Kings,7001021,001306,New York - Presbyterian Brooklyn Methodist Hospital,50 to 69,,M,Black/African American,Not Span/Hispanic,27,Emergency,Skilled Nursing Home,2017,005,HIV infection,222,BLOOD TRANSFUSION,890,HIV w multiple major HIV related conditions,24,Human Immunodeficiency Virus Infections,4,Extreme,Major,Medical,Private Health Insurance,Medicaid,Self-Pay,,N,Y,170238.48,48937.61
New York City,Kings,7001021,001306,New York - Presbyterian Brooklyn Methodist Hospital,50 to 69,,M,Black/African American,Not Span/Hispanic,12,Emergency,Expired,2017,005,HIV infection,058,HEMODIALYSIS,890,HIV w multiple major HIV related conditions,24,Human Immunodeficiency Virus Infections,3,Major,Major,Medical,Blue Cross/Blue Shield,Medicaid,Self-Pay,,N,Y,96203.83,35458.72
New York City,Kings,7001021,001306,New York - Presbyterian Brooklyn Methodist Hospital,50 to 69,,M,White,Not Span/Hispanic,7,Emergency,Home or Self Care,2017,005,HIV infection,000,NO PROC,890,HIV w multiple major HIV related conditions,24,Human Immunodeficiency Virus Infections,3,Major,Moderate,Medical,Medicaid,Medicaid,Self-Pay,,N,Y,48666.96,16125.78
New York City,Kings,7001021,001306,New York - Presbyterian Brooklyn Methodist Hospital,50 to 69,,M,White,Spanish/Hispanic,6,Emergency,Skilled Nursing Home,2017,005,HIV infection,222,BLOOD TRANSFUSION,890,HIV w multiple major HIV related conditions,24,Human Immunodeficiency Virus Infections,3,Major,Major,Medical,Medicaid,Medicaid,Self-Pay,,N,Y,39103.14,11428.54
New York City,Manhattan,7002054,001437,New York-Presbyterian/Lower Manhattan Hospital,50 to 69,,F,Other Race,Spanish/Hispanic,6,Emergency,Home w/ Home Health Services,2017,005,HIV infection,231,OTHER THERAPEUTIC PRCS,890,HIV w multiple major HIV related conditions,24,Human Immunodeficiency Virus Infections,4,Extreme,Extreme,Medical,Medicaid,Medicaid,Self-Pay,,N,Y,128745.84,72021.17
New York City,Manhattan,7002054,001437,New York-Presbyterian/Lower Manhattan Hospital,50 to 69,,M,White,Spanish/Hispanic,8,Emergency,Skilled Nursing Home,2017,005,HIV infection,199,ELECTROENCEPHALOGRAM,890,HIV w multiple major HIV related conditions,24,Human Immunodeficiency Virus Infections,3,Major,Major,Medical,Medicaid,Self-Pay,,,N,Y,89824.53,22653.64
New York City,Manhattan,7002002,001439,Mount Sinai Beth Israel,50 to 69,,F,Black/African American,Unknown,8,Emergency,Hospice - Medical Facility,2017,005,HIV infection,231,OTHER THERAPEUTIC PRCS,890,HIV w multiple major HIV related conditions,24,Human Immunodeficiency Virus Infections,4,Extreme,Extreme,Medical,Medicaid,Medicaid,Self-Pay,,N,Y,85596.99,31054.62
New York City,Manhattan,7002002,001439,Mount Sinai Beth Israel,30 to 49,,M,Other Race,Not Span/Hispanic,8,Emergency,Home or Self Care,2017,005,HIV infection,039,INCISION OF PLEURA,890,HIV w multiple major HIV related conditions,24,Human Immunodeficiency Virus Infections,3,Major,Extreme,Medical,Medicaid,Medicaid,Self-Pay,,N,Y,88096.03,30872.43
New York City,Manhattan,7002002,001439,Mount Sinai Beth Israel,50 to 69,,M,Black/African American,Spanish/Hispanic,3,Emergency,Home or Self Care,2017,135,Intestinal infection,183,ROUTINE CHEST X-RAY,890,HIV w multiple major HIV related conditions,24,Human Immunodeficiency Virus Infections,4,Extreme,Major,Medical,Medicare,Medicaid,Self-Pay,,N,Y,32714.89,10901.25
New York City,Manhattan,7002024,001456,Mount Sinai Hospital,50 to 69,,M,Black/African American,Not Span/Hispanic,23,Emergency,Skilled Nursing Home,2017,002,Septicemia (except in labor),000,NO PROC,890,HIV w multiple major HIV related conditions,24,Human Immunodeficiency Virus Infections,4,Extreme,Extreme,Medical,Medicare,Medicaid,Self-Pay,,N,Y,179334.36,59536.49
New York City,Manhattan,7002024,001456,Mount Sinai Hospital,50 to 69,,F,Black/African American,Not Span/Hispanic,10,Emergency,Home w/ Home Health Services,2017,002,Septicemia (except in labor),058,HEMODIALYSIS,890,HIV w multiple major HIV related conditions,24,Human Immunodeficiency Virus Infections,4,Extreme,Major,Medical,"Managed Care, Unspecified",Medicaid,Self-Pay,,N,Y,89130.11,29319.18
New York City,Manhattan,7002054,001458,New York Presbyterian Hospital - New York Weill Cornell Center,30 to 49,,M,White,Not Span/Hispanic,17,Emergency,Home w/ Home Health Services,2017,131,Respiratory failure; insufficiency; arrest (adult),222,BLOOD TRANSFUSION,890,HIV w multiple major HIV related conditions,24,Human Immunodeficiency Virus Infections,4,Extreme,Extreme,Medical,Blue Cross/Blue Shield,Self-Pay,,,N,Y,341834.00,170686.15
New York City,Manhattan,7002054,001458,New York Presbyterian Hospital - New York Weill Cornell Center,50 to 69,,F,Multi-racial,Not Span/Hispanic,6,Emergency,Home or Self Care,2017,002,Septicemia (except in labor),231,OTHER THERAPEUTIC PRCS,890,HIV w multiple major HIV related conditions,24,Human Immunodeficiency Virus Infections,3,Major,Major,Medical,Medicaid,Self-Pay,,,N,Y,66040.19,16769.02
New York City,Manhattan,7002054,001464,New York Presbyterian Hospital - Columbia Presbyterian Center,30 to 49,,M,Other Race,Not Span/Hispanic,48,Emergency,Home w/ Home Health Services,2017,005,HIV infection,175,OT OR THER PRC SKN/BRST,890,HIV w multiple major HIV related conditions,24,Human Immunodeficiency Virus Infections,4,Extreme,Major,Medical,Medicaid,Self-Pay,,,N,Y,497518.05,127069.75
New York City,Manhattan,7002054,001464,New York Presbyterian Hospital - Columbia Presbyterian Center,30 to 49,,F,Other Race,Not Span/Hispanic,44,Emergency,Home w/ Home Health Services,2017,002,Septicemia (except in labor),216,RESP INTUB/MECH VENTIL,890,HIV w multiple major HIV related conditions,24,Human Immunodeficiency Virus Infections,4,Extreme,Extreme,Medical,Medicaid,Medicaid,Self-Pay,,N,Y,541063.22,183810.82
New York City,Manhattan,7002054,001464,New York Presbyterian Hospital - Columbia Presbyterian Center,30 to 49,,F,Other Race,Not Span/Hispanic,1,Emergency,Expired,2017,005,HIV infection,216,RESP INTUB/MECH VENTIL,890,HIV w multiple major HIV related conditions,24,Human Immunodeficiency Virus Infections,4,Extreme,Extreme,Medical,Medicare,Medicaid,Self-Pay,,N,Y,29692.17,7755.92
New York City,Manhattan,7002054,001464,New York Presbyterian Hospital - Columbia Presbyterian Center,30 to 49,,M,Other Race,Multi-ethnic,5,Emergency,Home or Self Care,2017,158,Chronic kidney disease,058,HEMODIALYSIS,890,HIV w multiple major HIV related conditions,24,Human Immunodeficiency Virus Infections,3,Major,Moderate,Medical,Medicaid,Medicaid,Self-Pay,,N,Y,66017.76,18319.62
New York City,Manhattan,7002054,001464,New York Presbyterian Hospital - Columbia Presbyterian Center,18 to 29,,M,Multi-racial,Multi-ethnic,17,Emergency,Skilled Nursing Home,2017,005,HIV infection,000,NO PROC,890,HIV w multiple major HIV related conditions,24,Human Immunodeficiency Virus Infections,4,Extreme,Major,Medical,Medicaid,Medicaid,Self-Pay,,N,Y,180893.36,48668.00
New York City,Manhattan,7002032,001469,Mount Sinai St. Luke's,30 to 49,,M,Black/African American,Spanish/Hispanic,28,Emergency,Inpatient Rehabilitation Facility,2017,005,HIV infection,054,OT VASC CATH; NOT HEART,890,HIV w multiple major HIV related conditions,24,Human Immunodeficiency Virus Infections,3,Major,Major,Medical,Medicaid,Medicaid,Self-Pay,,N,Y,203455.75,59583.34
New York City,Manhattan,7002032,001469,Mount Sinai St. Luke's,50 to 69,,M,Other Race,Not Span/Hispanic,9,Emergency,Home or Self Care,2017,005,HIV infection,231,OTHER THERAPEUTIC PRCS,890,HIV w multiple major HIV related conditions,24,Human Immunodeficiency Virus Infections,4,Extreme,Major,Medical,Medicaid,Medicaid,Self-Pay,,N,Y,87729.54,23309.51
New York City,Manhattan,7002054,003975,New York Presbyterian Hospital - Allen Hospital,50 to 69,,M,Black/African American,Not Span/Hispanic,34,Emergency,Expired,2017,002,Septicemia (except in labor),216,RESP INTUB/MECH VENTIL,890,HIV w multiple major HIV related conditions,24,Human Immunodeficiency Virus Infections,4,Extreme,Extreme,Medical,Medicaid,Medicaid,Self-Pay,,N,Y,489337.97,176048.15
New York City,Queens,7003010,001637,New York - Presbyterian/Queens,50 to 69,,F,Other Race,Not Span/Hispanic,17,Emergency,Home or Self Care,2017,002,Septicemia (except in labor),037,DX BRONCHOSCOPY & BIOPS,890,HIV w multiple major HIV related conditions,24,Human Immunodeficiency Virus Infections,4,Extreme,Extreme,Medical,Private Health Insurance,Self-Pay,,,N,Y,196073.23,82560.24
New York City,Queens,7003010,001637,New York - Presbyterian/Queens,50 to 69,,F,Other Race,Not Span/Hispanic,8,Emergency,Home or Self Care,2017,122,Pneumonia (except that caused by tuberculosis or sexually transmitted disease),054,OT VASC CATH; NOT HEART,890,HIV w multiple major HIV related conditions,24,Human Immunodeficiency Virus Infections,4,Extreme,Major,Medical,Medicaid,Medicaid,Self-Pay,,N,Y,75030.62,23622.61
Central NY,Onondaga,3301008,000636,Crouse Hospital,30 to 49,,M,White,Not Span/Hispanic,29,Emergency,Expired,2017,005,HIV infection,231,OTHER THERAPEUTIC PRCS,890,HIV w multiple major HIV related conditions,24,Human Immunodeficiency Virus Infections,3,Major,Moderate,Medical,Medicaid,,,,N,Y,82397.27,37670.85
Capital/Adirond,Columbia,1001000,000146,Columbia Memorial Hospital,50 to 69,,M,White,Not Span/Hispanic,9,Emergency,Home or Self Care,2017,122,Pneumonia (except that caused by tuberculosis or sexually transmitted disease),039,INCISION OF PLEURA,890,HIV w multiple major HIV related conditions,24,Human Immunodeficiency Virus Infections,4,Extreme,Major,Medical,Blue Cross/Blue Shield,Medicaid,,,N,Y,30421.92,11726.31
Hudson Valley,Rockland,4329000,000779,Good Samaritan Hospital of Suffern,50 to 69,,F,White,Not Span/Hispanic,23,Emergency,Skilled Nursing Home,2017,002,Septicemia (except in labor),004,DIAGNOSTIC SPINAL TAP,890,HIV w multiple major HIV related conditions,24,Human Immunodeficiency Virus Infections,4,Extreme,Major,Medical,Medicaid,,,,N,Y,304113.42,73795.54
Hudson Valley,Rockland,4329000,000779,Good Samaritan Hospital of Suffern,50 to 69,,F,Black/African American,Not Span/Hispanic,12,Emergency,Home w/ Home Health Services,2017,002,Septicemia (except in labor),000,NO PROC,890,HIV w multiple major HIV related conditions,24,Human Immunodeficiency Virus Infections,4,Extreme,Major,Medical,Private Health Insurance,,,,N,Y,167045.87,42789.32
Hudson Valley,Westchester,5903001,001061,Montefiore Mount Vernon Hospital,50 to 69,,M,Black/African American,Not Span/Hispanic,3,Emergency,Home or Self Care,2017,005,HIV infection,058,HEMODIALYSIS,890,HIV w multiple major HIV related conditions,24,Human Immunodeficiency Virus Infections,3,Major,Major,Medical,Medicare,Medicare,Medicaid,,N,N,31375.10,12354.54