Hospital Service Area,Hospital County,Operating Certificate Number,Permanent Facility Id,Facility Name,Age Group,Zip Code - 3 digits,Gender,Race,Ethnicity,Length of Stay,Type of Admission,Patient Disposition,Discharge Year,CCS Diagnosis Code,CCS Diagnosis Description,CCS Procedure Code,CCS Procedure Description,APR DRG Code,APR DRG Description,APR MDC Code,APR MDC Description,APR Severity of Illness Code,APR Severity of Illness Description,APR Risk of Mortality,APR Medical Surgical Description,Payment Typology 1,Payment Typology 2,Payment Typology 3,Birth Weight,Abortion Edit Indicator,Emergency Department Indicator,Total Charges,Total Costs
New York City,Manhattan,7002001,001438,Bellevue Hospital Center,30 to 49,,M,Black/African American,Not Span/Hispanic,44,Emergency,Expired,2019,INF006,HIV INFECTION,GIS002,COLONOSCOPY AND PROCTOSCOPY WITH BIOPSY,890,HIV W MULTIPLE MAJOR HIV RELATED CONDITIONS,24,MULTIPLE SIGNIFICANT TRAUMA,4,Extreme,Extreme,Medical,Medicaid,Medicaid,,,,true,279492.93,185751
New York City,Manhattan,7002001,001438,Bellevue Hospital Center,50 to 69,,M,Black/African American,Not Span/Hispanic,5,Emergency,Home or Self Care,2019,INF002,SEPTICEMIA,IMG009,PLAIN RADIOGRAPHY,890,HIV W MULTIPLE MAJOR HIV RELATED CONDITIONS,24,MULTIPLE SIGNIFICANT TRAUMA,4,Extreme,Major,Medical,Self-Pay,,,,,false,26566.95,17656.39
New York City,Manhattan,7002001,001438,Bellevue Hospital Center,30 to 49,,M,White,Not Span/Hispanic,6,Emergency,Home or Self Care,2019,INF006,HIV INFECTION,ADM021,"ADMINISTRATION OF THERAPEUTIC SUBSTANCES, NEC",890,HIV W MULTIPLE MAJOR HIV RELATED CONDITIONS,24,MULTIPLE SIGNIFICANT TRAUMA,4,Extreme,Major,Medical,Medicaid,,,,,true,37573.59,24971.41
New York City,Manhattan,7002001,001438,Bellevue Hospital Center,30 to 49,,M,Black/African American,Not Span/Hispanic,5,Emergency,Home or Self Care,2019,INF002,SEPTICEMIA,IMG009,PLAIN RADIOGRAPHY,890,HIV W MULTIPLE MAJOR HIV RELATED CONDITIONS,24,MULTIPLE SIGNIFICANT TRAUMA,4,Extreme,Major,Medical,Medicaid,,,,,true,35221.55,23408.24
New York City,Manhattan,7002001,001438,Bellevue Hospital Center,50 to 69,,M,Black/African American,Not Span/Hispanic,21,Emergency,Skilled Nursing Home,2019,INF002,SEPTICEMIA,URN005,NEPHROSTOMY AND URETEROSTOMY PROCEDURES (INCLUDING STENTS),890,HIV W MULTIPLE MAJOR HIV RELATED CONDITIONS,24,MULTIPLE SIGNIFICANT TRAUMA,4,Extreme,Extreme,Medical,Medicare,Medicaid,,,,true,150434.48,99978.76
New York City,Manhattan,7002001,001438,Bellevue Hospital Center,50 to 69,,M,Black/African American,Not Span/Hispanic,52,Emergency,Skilled Nursing Home,2019,INF006,HIV INFECTION,CNS002,LUMBAR PUNCTURE,890,HIV W MULTIPLE MAJOR HIV RELATED CONDITIONS,24,MULTIPLE SIGNIFICANT TRAUMA,4,Extreme,Extreme,Medical,Medicaid,,,,,true,284122.97,188828.13
New York City,Manhattan,7002001,001438,Bellevue Hospital Center,50 to 69,,F,Black/African American,Not Span/Hispanic,9,Emergency,Home or Self Care,2019,INF006,HIV INFECTION,RES001,BRONCHOSCOPY (DIAGNOSTIC),890,HIV W MULTIPLE MAJOR HIV RELATED CONDITIONS,24,MULTIPLE SIGNIFICANT TRAUMA,3,Major,Moderate,Medical,Medicare,Medicare,,,,false,54788.66,36412.54
New York City,Manhattan,7002001,001438,Bellevue Hospital Center,30 to 49,,F,White,Not Span/Hispanic,9,Emergency,Home or Self Care,2019,RSP002,PNEUMONIA (EXCEPT THAT CAUSED BY TUBERCULOSIS),SUD001,SUBSTANCE USE DETOXIFICATION,890,HIV W MULTIPLE MAJOR HIV RELATED CONDITIONS,24,MULTIPLE SIGNIFICANT TRAUMA,4,Extreme,Moderate,Medical,Medicaid,,,,,true,47187.27,31360.66
New York City,Manhattan,7002001,001438,Bellevue Hospital Center,50 to 69,,M,Black/African American,Not Span/Hispanic,14,Emergency,Psychiatric Hospital or Unit of Hosp,2019,INF006,HIV INFECTION,ADM015,ADMINISTRATION OF ANTIBIOTICS,890,HIV W MULTIPLE MAJOR HIV RELATED CONDITIONS,24,MULTIPLE SIGNIFICANT TRAUMA,4,Extreme,Major,Medical,Medicaid,,,,,true,79571.11,52882.96
New York City,Manhattan,7002001,001438,Bellevue Hospital Center,70 or Older,,M,Other Race,Spanish/Hispanic,4,Emergency,Home or Self Care,2019,RSP002,PNEUMONIA (EXCEPT THAT CAUSED BY TUBERCULOSIS),RES007,AIRWAY INTUBATION,890,HIV W MULTIPLE MAJOR HIV RELATED CONDITIONS,24,MULTIPLE SIGNIFICANT TRAUMA,4,Extreme,Extreme,Medical,Medicare,Medicare,Medicaid,,,false,30806.87,20474.25
New York City,Manhattan,7002001,001438,Bellevue Hospital Center,50 to 69,,M,Other Race,Spanish/Hispanic,86,Emergency,Skilled Nursing Home,2019,INF002,SEPTICEMIA,RES007,AIRWAY INTUBATION,890,HIV W MULTIPLE MAJOR HIV RELATED CONDITIONS,24,MULTIPLE SIGNIFICANT TRAUMA,4,Extreme,Extreme,Medical,Private Health Insurance,,,,,false,519060.39,344967.54
New York City,Manhattan,7002001,001438,Bellevue Hospital Center,30 to 49,,F,Black/African American,Not Span/Hispanic,8,Emergency,Home or Self Care,2019,INF002,SEPTICEMIA,RES002,"LUNG, PLEURA, OR DIAPHRAGM BIOPSY (NON-ENDOSCOPIC)",890,HIV W MULTIPLE MAJOR HIV RELATED CONDITIONS,24,MULTIPLE SIGNIFICANT TRAUMA,4,Extreme,Extreme,Medical,Medicaid,Medicaid,,,,true,50789.59,33754.76
New York City,Manhattan,7002001,001438,Bellevue Hospital Center,50 to 69,,M,Other Race,Spanish/Hispanic,4,Emergency,Home or Self Care,2019,RSP002,PNEUMONIA (EXCEPT THAT CAUSED BY TUBERCULOSIS),IMG007,COMPUTERIZED TOMOGRAPHY (CT) WITHOUT CONTRAST,890,HIV W MULTIPLE MAJOR HIV RELATED CONDITIONS,24,MULTIPLE SIGNIFICANT TRAUMA,3,Major,Major,Medical,Blue Cross/Blue Shield,,,,,true,26473.92,17594.57
New York City,Manhattan,7002001,001438,Bellevue Hospital Center,50 to 69,,M,Black/African American,Not Span/Hispanic,6,Emergency,Home or Self Care,2019,INF002,SEPTICEMIA,SUD001,SUBSTANCE USE DETOXIFICATION,890,HIV W MULTIPLE MAJOR HIV RELATED CONDITIONS,24,MULTIPLE SIGNIFICANT TRAUMA,3,Major,Moderate,Medical,Private Health Insurance,Medicaid,,,,true,35337.14,23485.06
New York City,Manhattan,7002001,001438,Bellevue Hospital Center,30 to 49,,M,Other Race,Not Span/Hispanic,58,Emergency,Home or Self Care,2019,INF002,SEPTICEMIA,RES007,AIRWAY INTUBATION,890,HIV W MULTIPLE MAJOR HIV RELATED CONDITIONS,24,MULTIPLE SIGNIFICANT TRAUMA,4,Extreme,Extreme,Medical,Medicaid,,,,,true,407101.25,270559.49
New York City,Manhattan,7002001,001438,Bellevue Hospital Center,50 to 69,,M,Other Race,Not Span/Hispanic,20,Emergency,Skilled Nursing Home,2019,INF002,SEPTICEMIA,ESA003,MECHANICAL VENTILATION,890,HIV W MULTIPLE MAJOR HIV RELATED CONDITIONS,24,MULTIPLE SIGNIFICANT TRAUMA,4,Extreme,Extreme,Medical,Medicare,Medicaid,,,,true,136712.32,90859.01
New York City,Manhattan,7002001,001438,Bellevue Hospital Center,50 to 69,,M,Black/African American,Not Span/Hispanic,4,Emergency,Home or Self Care,2019,INF002,SEPTICEMIA,,,890,HIV W MULTIPLE MAJOR HIV RELATED CONDITIONS,24,MULTIPLE SIGNIFICANT TRAUMA,4,Extreme,Extreme,Medical,Medicare,Medicaid,,,,true,32732.48,21754.01
New York City,Manhattan,7002001,001438,Bellevue Hospital Center,30 to 49,,M,White,Spanish/Hispanic,9,Emergency,Left Against Medical Advice,2019,INF002,SEPTICEMIA,IMG007,COMPUTERIZED TOMOGRAPHY (CT) WITHOUT CONTRAST,890,HIV W MULTIPLE MAJOR HIV RELATED CONDITIONS,24,MULTIPLE SIGNIFICANT TRAUMA,4,Extreme,Extreme,Medical,Medicaid,,,,,true,76222.61,50657.55
New York City,Manhattan,7002001,001438,Bellevue Hospital Center,50 to 69,,M,White,Not Span/Hispanic,13,Emergency,Skilled Nursing Home,2019,INF006,HIV INFECTION,ADM017,ADMINISTRATION OF NUTRITIONAL AND ELECTROLYTIC SUBSTANCES,890,HIV W MULTIPLE MAJOR HIV RELATED CONDITIONS,24,MULTIPLE SIGNIFICANT TRAUMA,3,Major,Major,Medical,Medicare,Private Health Insurance,,,,true,101991.12,67783.3
New York City,Manhattan,7002001,001438,Bellevue Hospital Center,30 to 49,,M,Other Race,Not Span/Hispanic,6,Emergency,Psychiatric Hospital or Unit of Hosp,2019,INF006,HIV INFECTION,CNS002,LUMBAR PUNCTURE,890,HIV W MULTIPLE MAJOR HIV RELATED CONDITIONS,24,MULTIPLE SIGNIFICANT TRAUMA,2,Moderate,Minor,Medical,Medicaid,,,,,true,46991.06,31230.26
New York City,Manhattan,7002001,001438,Bellevue Hospital Center,50 to 69,,M,Black/African American,Not Span/Hispanic,41,Emergency,Expired,2019,INF002,SEPTICEMIA,ADM015,ADMINISTRATION OF ANTIBIOTICS,890,HIV W MULTIPLE MAJOR HIV RELATED CONDITIONS,24,MULTIPLE SIGNIFICANT TRAUMA,4,Extreme,Extreme,Medical,Medicaid,,,,,true,343903.66,228558.37
New York City,Manhattan,7002001,001438,Bellevue Hospital Center,18 to 29,,M,Other Race,Unknown,29,Urgent,Expired,2019,INF006,HIV INFECTION,CNS002,LUMBAR PUNCTURE,890,HIV W MULTIPLE MAJOR HIV RELATED CONDITIONS,24,MULTIPLE SIGNIFICANT TRAUMA,4,Extreme,Extreme,Medical,Private Health Insurance,,,,,false,292103.5,194131.99
New York City,Manhattan,7002001,001438,Bellevue Hospital Center,50 to 69,,F,Black/African American,Not Span/Hispanic,1,Emergency,Home or Self Care,2019,INF002,SEPTICEMIA,ADM015,ADMINISTRATION OF ANTIBIOTICS,890,HIV W MULTIPLE MAJOR HIV RELATED CONDITIONS,24,MULTIPLE SIGNIFICANT TRAUMA,3,Major,Major,Medical,Medicaid,,,,,true,11795.68,7839.41
New York City,Manhattan,7002001,001438,Bellevue Hospital Center,30 to 49,,M,Other Race,Unknown,33,Urgent,Home or Self Care,2019,INF006,HIV INFECTION,RES005,CHEST TUBE PLACEMENT AND THERAPEUTIC THORACENTESIS,890,HIV W MULTIPLE MAJOR HIV RELATED CONDITIONS,24,MULTIPLE SIGNIFICANT TRAUMA,4,Extreme,Extreme,Medical,Medicaid,,,,,false,361595.29,240316.23
New York City,Manhattan,7002001,001438,Bellevue Hospital Center,30 to 49,,M,Black/African American,Unknown,6,Emergency,Home or Self Care,2019,INF001,TUBERCULOSIS,CNS001,MINIMALLY INVASIVE CNS BIOPSY,890,HIV W MULTIPLE MAJOR HIV RELATED CONDITIONS,24,MULTIPLE SIGNIFICANT TRAUMA,2,Moderate,Moderate,Medical,Medicaid,,,,,true,97951.26,65098.41
New York City,Manhattan,7002001,001438,Bellevue Hospital Center,30 to 49,,F,Black/African American,Not Span/Hispanic,5,Emergency,Home or Self Care,2019,INF006,HIV INFECTION,IMG007,COMPUTERIZED TOMOGRAPHY (CT) WITHOUT CONTRAST,890,HIV W MULTIPLE MAJOR HIV RELATED CONDITIONS,24,MULTIPLE SIGNIFICANT TRAUMA,3,Major,Major,Medical,Private Health Insurance,Private Health Insurance,,,,true,39727.43,26402.85
New York City,Manhattan,7002001,001438,Bellevue Hospital Center,50 to 69,,M,Black/African American,Not Span/Hispanic,8,Emergency,Home or Self Care,2019,END011,FLUID AND ELECTROLYTE DISORDERS,ESA001,HEMODIALYSIS,890,HIV W MULTIPLE MAJOR HIV RELATED CONDITIONS,24,MULTIPLE SIGNIFICANT TRAUMA,4,Extreme,Extreme,Medical,Medicare,Medicaid,,,,true,73663.92,48957.04
New York City,Manhattan,7002001,001438,Bellevue Hospital Center,50 to 69,,M,White,Not Span/Hispanic,20,Emergency,Home or Self Care,2019,INF006,HIV INFECTION,ADM015,ADMINISTRATION OF ANTIBIOTICS,890,HIV W MULTIPLE MAJOR HIV RELATED CONDITIONS,24,MULTIPLE SIGNIFICANT TRAUMA,4,Extreme,Extreme,Medical,Private Health Insurance,,,,,true,149949.31,99656.31
New York City,Manhattan,7002001,001438,Bellevue Hospital Center,50 to 69,,M,Black/African American,Not Span/Hispanic,11,Urgent,Expired,2019,INF002,SEPTICEMIA,ESA003,MECHANICAL VENTILATION,890,HIV W MULTIPLE MAJOR HIV RELATED CONDITIONS,24,MULTIPLE SIGNIFICANT TRAUMA,4,Extreme,Extreme,Medical,Medicaid,,,,,false,115319.17,76641.12
New York City,Manhattan,7002001,001438,Bellevue Hospital Center,30 to 49,,M,Other Race,Spanish/Hispanic,5,Emergency,Court/Law Enforcement,2019,INF006,HIV INFECTION,ADM015,ADMINISTRATION OF ANTIBIOTICS,890,HIV W MULTIPLE MAJOR HIV RELATED CONDITIONS,24,MULTIPLE SIGNIFICANT TRAUMA,4,Extreme,Major,Medical,Medicaid,,,,,true,40414.43,26859.43
New York City,Manhattan,7002001,001438,Bellevue Hospital Center,30 to 49,,M,Black/African American,Not Span/Hispanic,16,Emergency,Home or Self Care,2019,INF002,SEPTICEMIA,ADM015,ADMINISTRATION OF ANTIBIOTICS,890,HIV W MULTIPLE MAJOR HIV RELATED CONDITIONS,24,MULTIPLE SIGNIFICANT TRAUMA,4,Extreme,Major,Medical,Medicare,Medicaid,,,,true,129250.34,85899.78
New York City,Manhattan,7002001,001438,Bellevue Hospital Center,50 to 69,,M,Black/African American,Not Span/Hispanic,6,Emergency,Home or Self Care,2019,INF002,SEPTICEMIA,ADM015,ADMINISTRATION OF ANTIBIOTICS,890,HIV W MULTIPLE MAJOR HIV RELATED CONDITIONS,24,MULTIPLE SIGNIFICANT TRAUMA,3,Major,Major,Medical,Medicare,,,,,true,51725.94,34377.06
New York City,Manhattan,7002001,001438,Bellevue Hospital Center,30 to 49,,M,Black/African American,Spanish/Hispanic,120 +,Elective,Home or Self Care,2019,INF006,HIV INFECTION,GIS011,SMALL BOWEL RESECTION,890,HIV W MULTIPLE MAJOR HIV RELATED CONDITIONS,24,MULTIPLE SIGNIFICANT TRAUMA,4,Extreme,Extreme,Medical,Medicaid,,,,,true,2369543.14,1574798.37
New York City,Manhattan,7002001,001438,Bellevue Hospital Center,30 to 49,,M,Other Race,Unknown,26,Emergency,Home or Self Care,2019,INF002,SEPTICEMIA,ADM015,ADMINISTRATION OF ANTIBIOTICS,890,HIV W MULTIPLE MAJOR HIV RELATED CONDITIONS,24,MULTIPLE SIGNIFICANT TRAUMA,4,Extreme,Extreme,Medical,Medicaid,,,,,true,295845.8,196619.12
New York City,Manhattan,7002001,001438,Bellevue Hospital Center,30 to 49,,M,White,Not Span/Hispanic,22,Emergency,Skilled Nursing Home,2019,INF002,SEPTICEMIA,ADM015,ADMINISTRATION OF ANTIBIOTICS,890,HIV W MULTIPLE MAJOR HIV RELATED CONDITIONS,24,MULTIPLE SIGNIFICANT TRAUMA,4,Extreme,Extreme,Medical,Medicaid,,,,,true,179265.9,119140.12
New York City,Manhattan,7002001,001438,Bellevue Hospital Center,30 to 49,,F,Black/African American,Not Span/Hispanic,2,Emergency,Left Against Medical Advice,2019,INF006,HIV INFECTION,CNS002,LUMBAR PUNCTURE,890,HIV W MULTIPLE MAJOR HIV RELATED CONDITIONS,24,MULTIPLE SIGNIFICANT TRAUMA,3,Major,Moderate,Medical,Medicaid,,,,,true,22673.68,15068.93
New York City,Manhattan,7002001,001438,Bellevue Hospital Center,30 to 49,,M,Black/African American,Not Span/Hispanic,3,Emergency,Home or Self Care,2019,INF002,SEPTICEMIA,IMG009,PLAIN RADIOGRAPHY,890,HIV W MULTIPLE MAJOR HIV RELATED CONDITIONS,24,MULTIPLE SIGNIFICANT TRAUMA,3,Major,Moderate,Medical,Medicaid,,,,,true,26215.45,17422.79
New York City,Manhattan,7002001,001438,Bellevue Hospital Center,50 to 69,,F,Other Race,Unknown,3,Emergency,Home or Self Care,2019,INF002,SEPTICEMIA,ADM015,ADMINISTRATION OF ANTIBIOTICS,890,HIV W MULTIPLE MAJOR HIV RELATED CONDITIONS,24,MULTIPLE SIGNIFICANT TRAUMA,4,Extreme,Major,Medical,Self-Pay,,,,,true,25876.97,17197.83
New York City,Manhattan,7002001,001438,Bellevue Hospital Center,50 to 69,,M,White,Not Span/Hispanic,11,Emergency,Left Against Medical Advice,2019,INF006,HIV INFECTION,IMG008,ULTRASONOGRAPHY,890,HIV W MULTIPLE MAJOR HIV RELATED CONDITIONS,24,MULTIPLE SIGNIFICANT TRAUMA,3,Major,Major,Medical,Medicaid,,,,,true,97482.63,64786.96
New York City,Manhattan,7002001,001438,Bellevue Hospital Center,50 to 69,,M,Other Race,Unknown,6,Emergency,Court/Law Enforcement,2019,INF002,SEPTICEMIA,RES001,BRONCHOSCOPY (DIAGNOSTIC),890,HIV W MULTIPLE MAJOR HIV RELATED CONDITIONS,24,MULTIPLE SIGNIFICANT TRAUMA,3,Major,Major,Medical,Medicaid,,,,,true,58704.86,39015.25
New York City,Manhattan,7002001,001438,Bellevue Hospital Center,50 to 69,,F,Black/African American,Not Span/Hispanic,4,Emergency,Expired,2019,INF002,SEPTICEMIA,IMG006,COMPUTERIZED TOMOGRAPHY (CT) WITH CONTRAST,890,HIV W MULTIPLE MAJOR HIV RELATED CONDITIONS,24,MULTIPLE SIGNIFICANT TRAUMA,4,Extreme,Extreme,Medical,Medicare,Medicaid,,,,true,39463.72,26227.59
New York City,Manhattan,7002001,001438,Bellevue Hospital Center,50 to 69,,M,Other Race,Spanish/Hispanic,8,Emergency,Home or Self Care,2019,INF006,HIV INFECTION,LYM007,BONE MARROW BIOPSY,890,HIV W MULTIPLE MAJOR HIV RELATED CONDITIONS,24,MULTIPLE SIGNIFICANT TRAUMA,4,Extreme,Major,Medical,Medicaid,,,,,true,74361.17,49420.43
New York City,Manhattan,7002001,001438,Bellevue Hospital Center,50 to 69,,M,Other Race,Not Span/Hispanic,13,Emergency,Home or Self Care,2019,INF006,HIV INFECTION,ADM015,ADMINISTRATION OF ANTIBIOTICS,890,HIV W MULTIPLE MAJOR HIV RELATED CONDITIONS,24,MULTIPLE SIGNIFICANT TRAUMA,4,Extreme,Major,Medical,Medicaid,,,,,true,77287.3,51365.14
New York City,Manhattan,7002001,001438,Bellevue Hospital Center,50 to 69,,M,Other Race,Not Span/Hispanic,21,Emergency,Home or Self Care,2019,INF006,HIV INFECTION,ADM015,ADMINISTRATION OF ANTIBIOTICS,890,HIV W MULTIPLE MAJOR HIV RELATED CONDITIONS,24,MULTIPLE SIGNIFICANT TRAUMA,3,Major,Major,Medical,Medicaid,,,,,true,164608.41,109398.75
New York City,Manhattan,7002001,001438,Bellevue Hospital Center,30 to 49,,M,Other Race,Spanish/Hispanic,8,Urgent,Court/Law Enforcement,2019,INF002,SEPTICEMIA,CNS002,LUMBAR PUNCTURE,890,HIV W MULTIPLE MAJOR HIV RELATED CONDITIONS,24,MULTIPLE SIGNIFICANT TRAUMA,4,Extreme,Major,Medical,Medicaid,,,,,false,68031.29,45213.6
New York City,Manhattan,7002001,001438,Bellevue Hospital Center,30 to 49,,M,Other Race,Spanish/Hispanic,6,Emergency,Home or Self Care,2019,INF006,HIV INFECTION,IMG007,COMPUTERIZED TOMOGRAPHY (CT) WITHOUT CONTRAST,890,HIV W MULTIPLE MAJOR HIV RELATED CONDITIONS,24,MULTIPLE SIGNIFICANT TRAUMA,4,Extreme,Major,Medical,Medicaid,,,,,true,46637.26,30995.12
New York City,Manhattan,7002001,001438,Bellevue Hospital Center,30 to 49,,M,Other Race,Spanish/Hispanic,12,Emergency,Home or Self Care,2019,INF002,SEPTICEMIA,CNS002,LUMBAR PUNCTURE,890,HIV W MULTIPLE MAJOR HIV RELATED CONDITIONS,24,MULTIPLE SIGNIFICANT TRAUMA,4,Extreme,Extreme,Medical,Medicaid,,,,,true,100121.1,66540.48
New York City,Manhattan,7002001,001438,Bellevue Hospital Center,30 to 49,,M,Other Race,Spanish/Hispanic,9,Emergency,Home or Self Care,2019,INF002,SEPTICEMIA,IMG007,COMPUTERIZED TOMOGRAPHY (CT) WITHOUT CONTRAST,890,HIV W MULTIPLE MAJOR HIV RELATED CONDITIONS,24,MULTIPLE SIGNIFICANT TRAUMA,4,Extreme,Extreme,Medical,Self-Pay,,,,,true,77805.66,51709.64
New York City,Manhattan,7002001,001438,Bellevue Hospital Center,50 to 69,,M,Black/African American,Spanish/Hispanic,5,Emergency,Home or Self Care,2019,RSP012,RESPIRATORY FAILURE; INSUFFICIENCY; ARREST,RES007,AIRWAY INTUBATION,890,HIV W MULTIPLE MAJOR HIV RELATED CONDITIONS,24,MULTIPLE SIGNIFICANT TRAUMA,4,Extreme,Extreme,Medical,Medicaid,,,,,true,61679.93,40992.48
New York City,Manhattan,7002001,001438,Bellevue Hospital Center,50 to 69,,M,Black/African American,Not Span/Hispanic,19,Emergency,Home or Self Care,2019,INF002,SEPTICEMIA,ADM015,ADMINISTRATION OF ANTIBIOTICS,890,HIV W MULTIPLE MAJOR HIV RELATED CONDITIONS,24,MULTIPLE SIGNIFICANT TRAUMA,3,Major,Major,Medical,Medicaid,,,,,true,132704.7,88195.54
