Hospital Service Area,Hospital County,Operating Certificate Number,Permanent Facility Id,Facility Name,Age Group,Zip Code - 3 digits,Gender,Race,Ethnicity,Length of Stay,Type of Admission,Patient Disposition,Discharge Year,CCS Diagnosis Code,CCS Diagnosis Description,CCS Procedure Code,CCS Procedure Description,APR DRG Code,APR DRG Description,APR MDC Code,APR MDC Description,APR Severity of Illness Code,APR Severity of Illness Description,APR Risk of Mortality,APR Medical Surgical Description,Payment Typology 1,Payment Typology 2,Payment Typology 3,Birth Weight,Abortion Edit Indicator,Emergency Department Indicator,Total Charges,Total Costs
New York City,Manhattan,7002053,001463,NYU Langone Hospitals,50 to 69,,M,Black/African American,Not Span/Hispanic,4,Emergency,Home w/ Home Health Services,2019,INF002,SEPTICEMIA,ESA001,HEMODIALYSIS,890,HIV W MULTIPLE MAJOR HIV RELATED CONDITIONS,24,MULTIPLE SIGNIFICANT TRAUMA,3,Major,Major,Medical,Private Health Insurance,Federal/State/Local/VA,,,,true,60558.93,19951.86
New York City,Manhattan,7002053,001463,NYU Langone Hospitals,50 to 69,,M,Black/African American,Unknown,2,Emergency,Left Against Medical Advice,2019,INF002,SEPTICEMIA,,,890,HIV W MULTIPLE MAJOR HIV RELATED CONDITIONS,24,MULTIPLE SIGNIFICANT TRAUMA,4,Extreme,Major,Medical,Medicaid,,,,,true,44791.39,11314.53
New York City,Manhattan,7002053,001463,NYU Langone Hospitals,50 to 69,,M,Other Race,Spanish/Hispanic,7,Emergency,Home or Self Care,2019,INF002,SEPTICEMIA,OTR004,ISOLATION PROCEDURES,890,HIV W MULTIPLE MAJOR HIV RELATED CONDITIONS,24,MULTIPLE SIGNIFICANT TRAUMA,4,Extreme,Extreme,Medical,Medicare,,,,,true,108846.35,29931.81
New York City,Manhattan,7002053,001463,NYU Langone Hospitals,50 to 69,,F,Other Race,Spanish/Hispanic,73,Emergency,Home w/ Home Health Services,2019,INF006,HIV INFECTION,MAM005,MEASUREMENT DURING CARDIAC CATHETERIZATION,890,HIV W MULTIPLE MAJOR HIV RELATED CONDITIONS,24,MULTIPLE SIGNIFICANT TRAUMA,4,Extreme,Extreme,Medical,Medicaid,,,,,true,3332952.75,608425.08
New York City,Manhattan,7002053,001463,NYU Langone Hospitals,50 to 69,,M,Other Race,Unknown,50,Elective,Skilled Nursing Home,2019,NVS020,OTHER SPECIFIED NERVOUS SYSTEM DISORDERS,CNS002,LUMBAR PUNCTURE,890,HIV W MULTIPLE MAJOR HIV RELATED CONDITIONS,24,MULTIPLE SIGNIFICANT TRAUMA,4,Extreme,Extreme,Medical,Medicaid,,,,,false,1024380.14,273111.98
New York City,Manhattan,7002053,001463,NYU Langone Hospitals,30 to 49,,M,Other Race,Not Span/Hispanic,4,Emergency,Home or Self Care,2019,RSP002,PNEUMONIA (EXCEPT THAT CAUSED BY TUBERCULOSIS),ESA001,HEMODIALYSIS,890,HIV W MULTIPLE MAJOR HIV RELATED CONDITIONS,24,MULTIPLE SIGNIFICANT TRAUMA,4,Extreme,Extreme,Medical,Medicaid,,,,,true,74661.71,23513.05
New York City,Manhattan,7002053,001463,NYU Langone Hospitals,50 to 69,,M,Other Race,Spanish/Hispanic,8,Emergency,Home w/ Home Health Services,2019,INF006,HIV INFECTION,CAR024,VENOUS AND ARTERIAL CATHETER PLACEMENT,890,HIV W MULTIPLE MAJOR HIV RELATED CONDITIONS,24,MULTIPLE SIGNIFICANT TRAUMA,4,Extreme,Extreme,Medical,Medicare,,,,,true,87405.27,29615.06
New York City,Manhattan,7002053,001463,NYU Langone Hospitals,50 to 69,,M,White,Not Span/Hispanic,7,Emergency,Home or Self Care,2019,INF002,SEPTICEMIA,RES001,BRONCHOSCOPY (DIAGNOSTIC),890,HIV W MULTIPLE MAJOR HIV RELATED CONDITIONS,24,MULTIPLE SIGNIFICANT TRAUMA,4,Extreme,Extreme,Medical,Medicaid,,,,,true,122420.08,32510.93
New York City,Manhattan,7002053,001463,NYU Langone Hospitals,30 to 49,,M,Black/African American,Not Span/Hispanic,3,Emergency,Home or Self Care,2019,BLD001,NUTRITIONAL ANEMIA,MST001,ARTHROCENTESIS,890,HIV W MULTIPLE MAJOR HIV RELATED CONDITIONS,24,MULTIPLE SIGNIFICANT TRAUMA,4,Extreme,Moderate,Medical,Medicaid,,,,,true,63285.61,15378.63
New York City,Manhattan,7002053,001463,NYU Langone Hospitals,70 or Older,,M,White,Not Span/Hispanic,10,Emergency,Home w/ Home Health Services,2019,DIG018,HEPATIC FAILURE,GIS006,PARACENTESIS,890,HIV W MULTIPLE MAJOR HIV RELATED CONDITIONS,24,MULTIPLE SIGNIFICANT TRAUMA,3,Major,Major,Medical,Medicare,Medicare,,,,true,143394.37,39770.03
New York City,Manhattan,7002053,001463,NYU Langone Hospitals,50 to 69,,M,Black/African American,Unknown,7,Emergency,Home or Self Care,2019,INF006,HIV INFECTION,OTR004,ISOLATION PROCEDURES,890,HIV W MULTIPLE MAJOR HIV RELATED CONDITIONS,24,MULTIPLE SIGNIFICANT TRAUMA,3,Major,Major,Medical,Medicaid,,,,,true,116255.54,32115.89
New York City,Manhattan,7002053,001463,NYU Langone Hospitals,50 to 69,,M,White,Unknown,11,Emergency,Skilled Nursing Home,2019,INF002,SEPTICEMIA,ESA003,MECHANICAL VENTILATION,890,HIV W MULTIPLE MAJOR HIV RELATED CONDITIONS,24,MULTIPLE SIGNIFICANT TRAUMA,4,Extreme,Extreme,Medical,Medicaid,,,,,true,177400.78,64321.91
New York City,Manhattan,7002053,001463,NYU Langone Hospitals,30 to 49,,M,Black/African American,Not Span/Hispanic,1,Emergency,Home or Self Care,2019,INF006,HIV INFECTION,,,890,HIV W MULTIPLE MAJOR HIV RELATED CONDITIONS,24,MULTIPLE SIGNIFICANT TRAUMA,3,Major,Minor,Medical,Medicaid,,,,,true,38222.32,12649.33
New York City,Manhattan,7002053,001463,NYU Langone Hospitals,50 to 69,,M,Other Race,Spanish/Hispanic,6,Emergency,Home or Self Care,2019,RSP002,PNEUMONIA (EXCEPT THAT CAUSED BY TUBERCULOSIS),ESA004,NON-INVASIVE VENTILATION,890,HIV W MULTIPLE MAJOR HIV RELATED CONDITIONS,24,MULTIPLE SIGNIFICANT TRAUMA,4,Extreme,Major,Medical,Medicare,,,,,true,91666.46,27973.17
New York City,Manhattan,7002053,001463,NYU Langone Hospitals,70 or Older,,M,White,Not Span/Hispanic,48,Emergency,Skilled Nursing Home,2019,INF006,HIV INFECTION,CNS002,LUMBAR PUNCTURE,890,HIV W MULTIPLE MAJOR HIV RELATED CONDITIONS,24,MULTIPLE SIGNIFICANT TRAUMA,4,Extreme,Major,Medical,Medicare,Blue Cross/Blue Shield,,,,true,1066731.96,266309.59
New York City,Manhattan,7002053,001463,NYU Langone Hospitals,50 to 69,,M,Other Race,Spanish/Hispanic,7,Emergency,Home or Self Care,2019,INF002,SEPTICEMIA,,,890,HIV W MULTIPLE MAJOR HIV RELATED CONDITIONS,24,MULTIPLE SIGNIFICANT TRAUMA,4,Extreme,Extreme,Medical,Private Health Insurance,,,,,true,90761.2,27079.63
New York City,Manhattan,7002053,001463,NYU Langone Hospitals,50 to 69,,F,Black/African American,Not Span/Hispanic,2,Elective,Home or Self Care,2019,RSP002,PNEUMONIA (EXCEPT THAT CAUSED BY TUBERCULOSIS),OTR004,ISOLATION PROCEDURES,890,HIV W MULTIPLE MAJOR HIV RELATED CONDITIONS,24,MULTIPLE SIGNIFICANT TRAUMA,3,Major,Moderate,Medical,Medicare,,,,,false,25580.55,8391.79
New York City,Manhattan,7002053,001463,NYU Langone Hospitals,30 to 49,,M,White,Not Span/Hispanic,9,Emergency,Home or Self Care,2019,INF002,SEPTICEMIA,RES005,CHEST TUBE PLACEMENT AND THERAPEUTIC THORACENTESIS,890,HIV W MULTIPLE MAJOR HIV RELATED CONDITIONS,24,MULTIPLE SIGNIFICANT TRAUMA,4,Extreme,Major,Medical,Blue Cross/Blue Shield,,,,,true,206509.33,43990.24
New York City,Manhattan,7002053,001463,NYU Langone Hospitals,30 to 49,,M,Black/African American,Unknown,4,Emergency,Skilled Nursing Home,2019,INF006,HIV INFECTION,,,890,HIV W MULTIPLE MAJOR HIV RELATED CONDITIONS,24,MULTIPLE SIGNIFICANT TRAUMA,3,Major,Moderate,Medical,Medicaid,,,,,true,61409.77,16528.71
New York City,Manhattan,7002053,001463,NYU Langone Hospitals,70 or Older,,F,Black/African American,Not Span/Hispanic,45,Emergency,Skilled Nursing Home,2019,INF006,HIV INFECTION,CNS002,LUMBAR PUNCTURE,890,HIV W MULTIPLE MAJOR HIV RELATED CONDITIONS,24,MULTIPLE SIGNIFICANT TRAUMA,4,Extreme,Major,Medical,Private Health Insurance,,,,,true,654926.26,175776.03
New York City,Manhattan,7002053,001463,NYU Langone Hospitals,70 or Older,,M,Black/African American,Not Span/Hispanic,8,Emergency,Home w/ Home Health Services,2019,NVS020,OTHER SPECIFIED NERVOUS SYSTEM DISORDERS,CNS002,LUMBAR PUNCTURE,890,HIV W MULTIPLE MAJOR HIV RELATED CONDITIONS,24,MULTIPLE SIGNIFICANT TRAUMA,3,Major,Major,Medical,Medicare,Medicaid,,,,true,173537.46,39574.9
New York City,Manhattan,7002053,001463,NYU Langone Hospitals,30 to 49,,M,Other Race,Spanish/Hispanic,11,Emergency,Skilled Nursing Home,2019,INF002,SEPTICEMIA,RES001,BRONCHOSCOPY (DIAGNOSTIC),890,HIV W MULTIPLE MAJOR HIV RELATED CONDITIONS,24,MULTIPLE SIGNIFICANT TRAUMA,4,Extreme,Major,Medical,Medicare,,,,,true,188473.5,50106.48
New York City,Manhattan,7002053,001463,NYU Langone Hospitals,50 to 69,,M,White,Not Span/Hispanic,14,Emergency,Home or Self Care,2019,NVS020,OTHER SPECIFIED NERVOUS SYSTEM DISORDERS,ADM012,CHEMOTHERAPY,890,HIV W MULTIPLE MAJOR HIV RELATED CONDITIONS,24,MULTIPLE SIGNIFICANT TRAUMA,4,Extreme,Extreme,Medical,Medicare,Medicaid,,,,true,161573.38,48959.56
New York City,Manhattan,7002053,001463,NYU Langone Hospitals,50 to 69,,F,Black/African American,Not Span/Hispanic,6,Emergency,Home or Self Care,2019,INF002,SEPTICEMIA,,,890,HIV W MULTIPLE MAJOR HIV RELATED CONDITIONS,24,MULTIPLE SIGNIFICANT TRAUMA,4,Extreme,Major,Medical,Medicare,,,,,true,108370.21,34067
New York City,Manhattan,7002053,001463,NYU Langone Hospitals,30 to 49,,M,Black/African American,Not Span/Hispanic,4,Emergency,Home or Self Care,2019,INF002,SEPTICEMIA,HEP010,HEPATOBILIARY AND PANCREATIC DRAINAGE,890,HIV W MULTIPLE MAJOR HIV RELATED CONDITIONS,24,MULTIPLE SIGNIFICANT TRAUMA,3,Major,Moderate,Medical,Medicaid,,,,,true,69322.03,18768.25
New York City,Manhattan,7002053,001463,NYU Langone Hospitals,30 to 49,,M,Black/African American,Not Span/Hispanic,3,Emergency,Home or Self Care,2019,INF002,SEPTICEMIA,IMG008,ULTRASONOGRAPHY,890,HIV W MULTIPLE MAJOR HIV RELATED CONDITIONS,24,MULTIPLE SIGNIFICANT TRAUMA,3,Major,Extreme,Medical,Medicare,Medicaid,,,,true,83298.7,25215.71
New York City,Manhattan,7002053,001463,NYU Langone Hospitals,50 to 69,,M,Other Race,Spanish/Hispanic,8,Emergency,Skilled Nursing Home,2019,CIR020,CEREBRAL INFARCTION,MAM011,ELECTROENCEPHALOGRAM (EEG),890,HIV W MULTIPLE MAJOR HIV RELATED CONDITIONS,24,MULTIPLE SIGNIFICANT TRAUMA,4,Extreme,Extreme,Medical,Medicaid,,,,,true,124280,36351.89
New York City,Manhattan,7002053,001463,NYU Langone Hospitals,30 to 49,,M,Black/African American,Not Span/Hispanic,7,Emergency,Home or Self Care,2019,INF002,SEPTICEMIA,SKB001,SKIN BIOPSY AND DIAGNOSTIC DRAINAGE,890,HIV W MULTIPLE MAJOR HIV RELATED CONDITIONS,24,MULTIPLE SIGNIFICANT TRAUMA,4,Extreme,Extreme,Medical,Blue Cross/Blue Shield,,,,,true,138222.25,32065.32
New York City,Manhattan,7002053,001463,NYU Langone Hospitals,50 to 69,,F,Other Race,Spanish/Hispanic,10,Emergency,Medicare Cert Long Term Care Hospital,2019,INF002,SEPTICEMIA,,,890,HIV W MULTIPLE MAJOR HIV RELATED CONDITIONS,24,MULTIPLE SIGNIFICANT TRAUMA,4,Extreme,Extreme,Medical,Blue Cross/Blue Shield,,,,,true,123487.12,38601.09
New York City,Manhattan,7002053,001463,NYU Langone Hospitals,50 to 69,,M,Other Race,Spanish/Hispanic,5,Emergency,Home w/ Home Health Services,2019,RSP012,RESPIRATORY FAILURE; INSUFFICIENCY; ARREST,,,890,HIV W MULTIPLE MAJOR HIV RELATED CONDITIONS,24,MULTIPLE SIGNIFICANT TRAUMA,4,Extreme,Extreme,Medical,Private Health Insurance,Medicaid,,,,true,68991.21,19758.6
New York City,Manhattan,7002053,001463,NYU Langone Hospitals,18 to 29,,M,Other Race,Spanish/Hispanic,8,Emergency,Home or Self Care,2019,INF002,SEPTICEMIA,CNS002,LUMBAR PUNCTURE,890,HIV W MULTIPLE MAJOR HIV RELATED CONDITIONS,24,MULTIPLE SIGNIFICANT TRAUMA,3,Major,Major,Medical,Medicaid,,,,,true,95575.72,32356.32
New York City,Manhattan,7002053,001463,NYU Langone Hospitals,70 or Older,,M,White,Not Span/Hispanic,17,Emergency,Home w/ Home Health Services,2019,INF002,SEPTICEMIA,OTR004,ISOLATION PROCEDURES,890,HIV W MULTIPLE MAJOR HIV RELATED CONDITIONS,24,MULTIPLE SIGNIFICANT TRAUMA,3,Major,Major,Medical,Medicare,Medicare,Medicaid,,,true,303982.17,75697.19
New York City,Manhattan,7002053,001463,NYU Langone Hospitals,50 to 69,,M,Black/African American,Not Span/Hispanic,1,Emergency,Left Against Medical Advice,2019,INF002,SEPTICEMIA,,,890,HIV W MULTIPLE MAJOR HIV RELATED CONDITIONS,24,MULTIPLE SIGNIFICANT TRAUMA,3,Major,Major,Medical,Medicaid,,,,,true,21222.35,5308.56
New York City,Manhattan,7002053,001463,NYU Langone Hospitals,50 to 69,,M,White,Not Span/Hispanic,13,Emergency,Skilled Nursing Home,2019,INF002,SEPTICEMIA,RAD003,STEREOTACTIC RADIOSURGERY,890,HIV W MULTIPLE MAJOR HIV RELATED CONDITIONS,24,MULTIPLE SIGNIFICANT TRAUMA,4,Extreme,Extreme,Medical,Medicaid,,,,,false,160499.12,66392.96
New York City,Manhattan,7002053,001463,NYU Langone Hospitals,70 or Older,,M,Black/African American,Not Span/Hispanic,63,Emergency,Skilled Nursing Home,2019,INF002,SEPTICEMIA,RES007,AIRWAY INTUBATION,890,HIV W MULTIPLE MAJOR HIV RELATED CONDITIONS,24,MULTIPLE SIGNIFICANT TRAUMA,4,Extreme,Extreme,Medical,Medicare,,,,,true,1403308.77,408579.88
New York City,Manhattan,7002053,001463,NYU Langone Hospitals,50 to 69,,M,Black/African American,Not Span/Hispanic,4,Emergency,Home w/ Home Health Services,2019,INF002,SEPTICEMIA,OTR004,ISOLATION PROCEDURES,890,HIV W MULTIPLE MAJOR HIV RELATED CONDITIONS,24,MULTIPLE SIGNIFICANT TRAUMA,3,Major,Moderate,Medical,Medicaid,,,,,true,48412,16008.77
New York City,Manhattan,7002053,001463,NYU Langone Hospitals,50 to 69,,M,Black/African American,Not Span/Hispanic,8,Emergency,Hospice - Medical Facility,2019,INF006,HIV INFECTION,CAR024,VENOUS AND ARTERIAL CATHETER PLACEMENT,890,HIV W MULTIPLE MAJOR HIV RELATED CONDITIONS,24,MULTIPLE SIGNIFICANT TRAUMA,3,Major,Major,Medical,Medicaid,,,,,true,210056.16,49409.87
New York City,Manhattan,7002053,001463,NYU Langone Hospitals,50 to 69,,M,White,Not Span/Hispanic,5,Emergency,Home or Self Care,2019,INF002,SEPTICEMIA,,,890,HIV W MULTIPLE MAJOR HIV RELATED CONDITIONS,24,MULTIPLE SIGNIFICANT TRAUMA,4,Extreme,Major,Medical,Self-Pay,,,,,true,75569.37,18863.95
New York City,Manhattan,7002053,001463,NYU Langone Hospitals,30 to 49,,M,Other Race,Not Span/Hispanic,9,Emergency,Expired,2019,INF006,HIV INFECTION,LYM007,BONE MARROW BIOPSY,890,HIV W MULTIPLE MAJOR HIV RELATED CONDITIONS,24,MULTIPLE SIGNIFICANT TRAUMA,4,Extreme,Extreme,Medical,Private Health Insurance,,,,,true,183981.94,44930.32
New York City,Manhattan,7002053,001463,NYU Langone Hospitals,30 to 49,,M,Other Race,Spanish/Hispanic,44,Emergency,Expired,2019,NVS003,OTHER SPECIFIED CNS INFECTION AND POLIOMYELITIS,CNS002,LUMBAR PUNCTURE,890,HIV W MULTIPLE MAJOR HIV RELATED CONDITIONS,24,MULTIPLE SIGNIFICANT TRAUMA,4,Extreme,Extreme,Medical,Medicaid,,,,,true,555396,166807.13
New York City,Manhattan,7002053,001463,NYU Langone Hospitals,50 to 69,,M,Black/African American,Not Span/Hispanic,13,Emergency,Expired,2019,INF006,HIV INFECTION,ESA009,CARDIAC ASSISTANCE WITH BALLOON PUMP,890,HIV W MULTIPLE MAJOR HIV RELATED CONDITIONS,24,MULTIPLE SIGNIFICANT TRAUMA,4,Extreme,Extreme,Medical,Medicare,Medicaid,,,,true,565837.77,131341.56
