Hospital Service Area,Hospital County,Operating Certificate Number,Permanent Facility Id,Facility Name,Age Group,Zip Code - 3 digits,Gender,Race,Ethnicity,Length of Stay,Type of Admission,Patient Disposition,Discharge Year,CCS Diagnosis Code,CCS Diagnosis Description,CCS Procedure Code,CCS Procedure Description,APR DRG Code,APR DRG Description,APR MDC Code,APR MDC Description,APR Severity of Illness Code,APR Severity of Illness Description,APR Risk of Mortality,APR Medical Surgical Description,Payment Typology 1,Payment Typology 2,Payment Typology 3,Birth Weight,Abortion Edit Indicator,Emergency Department Indicator,Total Charges,Total Costs
New York City,Bronx,7000006,003058,Montefiore Med Center - Jack D Weiler Hosp of A Einstein College Div,50 to 69,,F,Other Race,Spanish/Hispanic,8,Emergency,Home w/ Home Health Services,2020,INF002,SEPTICEMIA,ADM015,ADMINISTRATION OF ANTIBIOTICS,890,HIV W MULTIPLE MAJOR HIV RELATED CONDITIONS,24,MULTIPLE SIGNIFICANT TRAUMA,4,Extreme,Extreme,Medical,Medicaid,,,,,Y,94596.93,14874.1
New York City,Bronx,7000006,003058,Montefiore Med Center - Jack D Weiler Hosp of A Einstein College Div,50 to 69,,F,Black/African American,Not Span/Hispanic,4,Emergency,Home or Self Care,2020,INF002,SEPTICEMIA,ADM015,ADMINISTRATION OF ANTIBIOTICS,890,HIV W MULTIPLE MAJOR HIV RELATED CONDITIONS,24,MULTIPLE SIGNIFICANT TRAUMA,3,Major,Major,Medical,Medicaid,,,,,Y,65325.57,9455.82
New York City,Bronx,7000006,001169,Montefiore Medical Center - Henry & Lucy Moses Div,50 to 69,,M,Multi-racial,Spanish/Hispanic,6,Emergency,Left Against Medical Advice,2020,INF002,SEPTICEMIA,ADM021,"ADMINISTRATION OF THERAPEUTIC SUBSTANCES, NEC",890,HIV W MULTIPLE MAJOR HIV RELATED CONDITIONS,24,MULTIPLE SIGNIFICANT TRAUMA,3,Major,Major,Medical,Medicaid,,,,,Y,86395.97,14720.08
New York City,Bronx,7000006,003058,Montefiore Med Center - Jack D Weiler Hosp of A Einstein College Div,30 to 49,,F,Black/African American,Not Span/Hispanic,11,Emergency,Skilled Nursing Home,2020,INF006,HIV INFECTION,CAR024,VENOUS AND ARTERIAL CATHETER PLACEMENT,890,HIV W MULTIPLE MAJOR HIV RELATED CONDITIONS,24,MULTIPLE SIGNIFICANT TRAUMA,3,Major,Major,Medical,Medicaid,,,,,Y,154757.99,26840.57
New York City,Manhattan,7002024,001456,Mount Sinai Hospital,50 to 69,,M,Black/African American,Not Span/Hispanic,6,Emergency,Home or Self Care,2020,BLD001,NUTRITIONAL ANEMIA,ESA001,HEMODIALYSIS,890,HIV W MULTIPLE MAJOR HIV RELATED CONDITIONS,24,MULTIPLE SIGNIFICANT TRAUMA,4,Extreme,Extreme,Medical,Medicaid,Self-Pay,,,,Y,77115.21,20371.92
New York City,Bronx,7000006,003058,Montefiore Med Center - Jack D Weiler Hosp of A Einstein College Div,50 to 69,,F,Other Race,Spanish/Hispanic,5,Emergency,Home or Self Care,2020,INF006,HIV INFECTION,ADM015,ADMINISTRATION OF ANTIBIOTICS,890,HIV W MULTIPLE MAJOR HIV RELATED CONDITIONS,24,MULTIPLE SIGNIFICANT TRAUMA,3,Major,Major,Medical,Medicaid,,,,,Y,67039.36,10629.03
New York City,Bronx,7000006,001169,Montefiore Medical Center - Henry & Lucy Moses Div,50 to 69,,F,Black/African American,Not Span/Hispanic,15,Emergency,Home or Self Care,2020,RSP012,RESPIRATORY FAILURE; INSUFFICIENCY; ARREST,ESA001,HEMODIALYSIS,890,HIV W MULTIPLE MAJOR HIV RELATED CONDITIONS,24,MULTIPLE SIGNIFICANT TRAUMA,3,Major,Major,Medical,Private Health Insurance,Medicaid,,,,Y,237693.09,42816.93
New York City,Manhattan,7002032,001469,Mount Sinai Morningside,50 to 69,,M,Other Race,Spanish/Hispanic,11,Emergency,Home w/ Home Health Services,2020,RSP002,PNEUMONIA (EXCEPT THAT CAUSED BY TUBERCULOSIS),ESA004,NON-INVASIVE VENTILATION,890,HIV W MULTIPLE MAJOR HIV RELATED CONDITIONS,24,MULTIPLE SIGNIFICANT TRAUMA,4,Extreme,Extreme,Medical,Medicare,Medicaid,Self-Pay,,,Y,141217.81,34826.51
New York City,Manhattan,7002032,001469,Mount Sinai Morningside,50 to 69,,M,Black/African American,Not Span/Hispanic,4,Emergency,Home or Self Care,2020,INF002,SEPTICEMIA,ADM015,ADMINISTRATION OF ANTIBIOTICS,890,HIV W MULTIPLE MAJOR HIV RELATED CONDITIONS,24,MULTIPLE SIGNIFICANT TRAUMA,4,Extreme,Extreme,Medical,Medicaid,Medicaid,Self-Pay,,,Y,62422.58,15554.18
New York City,Manhattan,7002032,001469,Mount Sinai Morningside,70 or Older,,F,Black/African American,Not Span/Hispanic,3,Emergency,Home or Self Care,2020,INF002,SEPTICEMIA,ESA004,NON-INVASIVE VENTILATION,890,HIV W MULTIPLE MAJOR HIV RELATED CONDITIONS,24,MULTIPLE SIGNIFICANT TRAUMA,4,Extreme,Extreme,Medical,Medicare,Medicare,Medicaid,,,Y,41342.64,9079.59
New York City,Manhattan,7002032,001469,Mount Sinai Morningside,50 to 69,,F,Black/African American,Not Span/Hispanic,6,Emergency,Home w/ Home Health Services,2020,GEN002,ACUTE AND UNSPECIFIED RENAL FAILURE,ADM015,ADMINISTRATION OF ANTIBIOTICS,890,HIV W MULTIPLE MAJOR HIV RELATED CONDITIONS,24,MULTIPLE SIGNIFICANT TRAUMA,4,Extreme,Extreme,Medical,Medicare,Medicare,Medicaid,,,Y,74850.83,16522.89
New York City,Manhattan,7002002,001439,Mount Sinai Beth Israel,50 to 69,,M,Other Race,Unknown,7,Emergency,Home w/ Home Health Services,2020,RSP012,RESPIRATORY FAILURE; INSUFFICIENCY; ARREST,RES007,AIRWAY INTUBATION,890,HIV W MULTIPLE MAJOR HIV RELATED CONDITIONS,24,MULTIPLE SIGNIFICANT TRAUMA,4,Extreme,Extreme,Medical,Medicare,Miscellaneous/Other,Medicaid,,,Y,140777.74,43519.12
New York City,Manhattan,7002002,001439,Mount Sinai Beth Israel,50 to 69,,M,Other Race,Unknown,5,Emergency,Home w/ Home Health Services,2020,INF002,SEPTICEMIA,ADM015,ADMINISTRATION OF ANTIBIOTICS,890,HIV W MULTIPLE MAJOR HIV RELATED CONDITIONS,24,MULTIPLE SIGNIFICANT TRAUMA,4,Extreme,Extreme,Medical,Private Health Insurance,Self-Pay,,,,Y,79537.06,15520.79
New York City,Manhattan,7002024,001456,Mount Sinai Hospital,50 to 69,,F,Black/African American,Unknown,5,Urgent,Psychiatric Hospital or Unit of Hosp,2020,NVS020,OTHER SPECIFIED NERVOUS SYSTEM DISORDERS,IMG007,COMPUTERIZED TOMOGRAPHY (CT) WITHOUT CONTRAST,890,HIV W MULTIPLE MAJOR HIV RELATED CONDITIONS,24,MULTIPLE SIGNIFICANT TRAUMA,3,Major,Moderate,Medical,Medicare,Medicaid,Self-Pay,,,N,60316.13,14616.82
New York City,Bronx,7000006,001169,Montefiore Medical Center - Henry & Lucy Moses Div,50 to 69,,M,Other Race,Spanish/Hispanic,7,Emergency,Expired,2020,INF002,SEPTICEMIA,GIS017,GASTROSTOMY,890,HIV W MULTIPLE MAJOR HIV RELATED CONDITIONS,24,MULTIPLE SIGNIFICANT TRAUMA,4,Extreme,Extreme,Medical,Medicaid,,,,,Y,206728.74,28976.12
New York City,Manhattan,7002024,001456,Mount Sinai Hospital,50 to 69,,F,Other Race,Not Span/Hispanic,29,Emergency,Skilled Nursing Home,2020,RSP012,RESPIRATORY FAILURE; INSUFFICIENCY; ARREST,CNS002,LUMBAR PUNCTURE,890,HIV W MULTIPLE MAJOR HIV RELATED CONDITIONS,24,MULTIPLE SIGNIFICANT TRAUMA,4,Extreme,Extreme,Medical,Medicaid,Self-Pay,,,,Y,477056.84,116607.72
Long Island,Nassau,2908000,000511,NYU Langone Hospital-Long Island,30 to 49,,M,White,Spanish/Hispanic,15,Emergency,Home w/ Home Health Services,2020,INF006,HIV INFECTION,RES001,BRONCHOSCOPY (DIAGNOSTIC),890,HIV W MULTIPLE MAJOR HIV RELATED CONDITIONS,24,MULTIPLE SIGNIFICANT TRAUMA,3,Major,Major,Medical,Medicaid,,,,,Y,200631.95,56341.67
New York City,Manhattan,7002054,003975,New York Presbyterian Hospital - Allen Hospital,50 to 69,,F,Black/African American,Not Span/Hispanic,6,Emergency,Home w/ Home Health Services,2020,RSP002,PNEUMONIA (EXCEPT THAT CAUSED BY TUBERCULOSIS),,,890,HIV W MULTIPLE MAJOR HIV RELATED CONDITIONS,24,MULTIPLE SIGNIFICANT TRAUMA,3,Major,Major,Medical,Medicaid,Self-Pay,,,,Y,83279.53,17839.66
,,,,Redacted for Confidentiality,50 to 69,,F,Multi-racial,Multi-ethnic,12,Emergency,Home or Self Care,2020,INF002,SEPTICEMIA,RES007,AIRWAY INTUBATION,890,HIV W MULTIPLE MAJOR HIV RELATED CONDITIONS,24,MULTIPLE SIGNIFICANT TRAUMA,4,Extreme,Extreme,Medical,Medicaid,Medicaid,Self-Pay,,,Y,293516.81,115219.23
New York City,Manhattan,7002054,001464,New York-Presbyterian Hospital - Columbia Presbyterian Center,50 to 69,,M,Black/African American,Not Span/Hispanic,8,Emergency,Skilled Nursing Home,2020,INF002,SEPTICEMIA,,,890,HIV W MULTIPLE MAJOR HIV RELATED CONDITIONS,24,MULTIPLE SIGNIFICANT TRAUMA,3,Major,Extreme,Medical,Medicare,Medicaid,Self-Pay,,,Y,109388.59,25283.57
New York City,Manhattan,7002054,001464,New York-Presbyterian Hospital - Columbia Presbyterian Center,30 to 49,,M,Other Race,Not Span/Hispanic,17,Emergency,Home or Self Care,2020,INF006,HIV INFECTION,CNS002,LUMBAR PUNCTURE,890,HIV W MULTIPLE MAJOR HIV RELATED CONDITIONS,24,MULTIPLE SIGNIFICANT TRAUMA,4,Extreme,Major,Medical,Medicaid,Medicaid,Self-Pay,,,Y,276163.06,77446.87
New York City,Manhattan,7002054,001464,New York-Presbyterian Hospital - Columbia Presbyterian Center,30 to 49,,M,Black/African American,Not Span/Hispanic,13,Emergency,Home w/ Home Health Services,2020,INF006,HIV INFECTION,RES001,BRONCHOSCOPY (DIAGNOSTIC),890,HIV W MULTIPLE MAJOR HIV RELATED CONDITIONS,24,MULTIPLE SIGNIFICANT TRAUMA,4,Extreme,Extreme,Medical,Medicaid,Medicaid,Self-Pay,,,Y,254548.07,108511.57
New York City,Manhattan,7002054,001464,New York-Presbyterian Hospital - Columbia Presbyterian Center,30 to 49,,M,Black/African American,Not Span/Hispanic,22,Emergency,Left Against Medical Advice,2020,INF006,HIV INFECTION,CNS002,LUMBAR PUNCTURE,890,HIV W MULTIPLE MAJOR HIV RELATED CONDITIONS,24,MULTIPLE SIGNIFICANT TRAUMA,3,Major,Major,Medical,Medicaid,Medicaid,Self-Pay,,,Y,289583.34,75784.43
,,,,Redacted for Confidentiality,70 or Older,,M,Black/African American,Not Span/Hispanic,15,Emergency,Skilled Nursing Home,2020,INF006,HIV INFECTION,ADM017,ADMINISTRATION OF NUTRITIONAL AND ELECTROLYTIC SUBSTANCES,890,HIV W MULTIPLE MAJOR HIV RELATED CONDITIONS,24,MULTIPLE SIGNIFICANT TRAUMA,3,Major,Major,Medical,Medicare,Medicare,Self-Pay,,,Y,113601.36,26859.28
New York City,Kings,7002053,001304,NYU Langone Hospital-Brooklyn,50 to 69,,M,White,Not Span/Hispanic,2,Emergency,Home or Self Care,2020,INF002,SEPTICEMIA,,,890,HIV W MULTIPLE MAJOR HIV RELATED CONDITIONS,24,MULTIPLE SIGNIFICANT TRAUMA,4,Extreme,Extreme,Medical,Medicaid,,,,,Y,51748.73,13531.61
New York City,Manhattan,7002053,001463,NYU Langone Hospitals,50 to 69,,M,Black/African American,Not Span/Hispanic,8,Emergency,Home or Self Care,2020,INF002,SEPTICEMIA,ADM001,TRANSFUSION OF BLOOD AND BLOOD PRODUCTS,890,HIV W MULTIPLE MAJOR HIV RELATED CONDITIONS,24,MULTIPLE SIGNIFICANT TRAUMA,3,Major,Major,Medical,Medicare,Medicaid,,,,Y,171452.6,35938.75
New York City,Kings,7002053,001304,NYU Langone Hospital-Brooklyn,30 to 49,,M,White,Not Span/Hispanic,16,Emergency,Home or Self Care,2020,INF002,SEPTICEMIA,ADM015,ADMINISTRATION OF ANTIBIOTICS,890,HIV W MULTIPLE MAJOR HIV RELATED CONDITIONS,24,MULTIPLE SIGNIFICANT TRAUMA,4,Extreme,Extreme,Medical,Medicaid,,,,,Y,281668.72,85123.71
New York City,Manhattan,7002053,001463,NYU Langone Hospitals,70 or Older,,M,Black/African American,Not Span/Hispanic,13,Emergency,Skilled Nursing Home,2020,INF002,SEPTICEMIA,GIS002,COLONOSCOPY AND PROCTOSCOPY WITH BIOPSY,890,HIV W MULTIPLE MAJOR HIV RELATED CONDITIONS,24,MULTIPLE SIGNIFICANT TRAUMA,3,Major,Major,Medical,Medicare,Medicaid,,,,Y,149928.15,46924.99
New York City,Bronx,7000006,001169,Montefiore Medical Center - Henry & Lucy Moses Div,50 to 69,,M,Other Race,Spanish/Hispanic,9,Emergency,Home or Self Care,2020,INF002,SEPTICEMIA,CAR024,VENOUS AND ARTERIAL CATHETER PLACEMENT,890,HIV W MULTIPLE MAJOR HIV RELATED CONDITIONS,24,MULTIPLE SIGNIFICANT TRAUMA,4,Extreme,Extreme,Medical,Medicare,Medicaid,,,,Y,199341.84,29280.76
New York City,Kings,7001021,001306,New York - Presbyterian Brooklyn Methodist Hospital,18 to 29,,M,Black/African American,Not Span/Hispanic,9,Emergency,Home or Self Care,2020,INF002,SEPTICEMIA,ESA001,HEMODIALYSIS,890,HIV W MULTIPLE MAJOR HIV RELATED CONDITIONS,24,MULTIPLE SIGNIFICANT TRAUMA,3,Major,Major,Medical,"Managed Care, Unspecified",Medicaid,Self-Pay,,,Y,94682.35,21738.66
New York City,Kings,7001021,001306,New York - Presbyterian Brooklyn Methodist Hospital,30 to 49,,M,Black/African American,Not Span/Hispanic,10,Emergency,Home or Self Care,2020,INF002,SEPTICEMIA,RES007,AIRWAY INTUBATION,890,HIV W MULTIPLE MAJOR HIV RELATED CONDITIONS,24,MULTIPLE SIGNIFICANT TRAUMA,4,Extreme,Extreme,Medical,Medicare,Medicaid,Self-Pay,,,Y,139270.38,43634.7
New York City,Kings,7001021,001306,New York - Presbyterian Brooklyn Methodist Hospital,30 to 49,,M,White,Spanish/Hispanic,21,Emergency,Hospice - Medical Facility,2020,INF002,SEPTICEMIA,URN005,NEPHROSTOMY AND URETEROSTOMY PROCEDURES (INCLUDING STENTS),890,HIV W MULTIPLE MAJOR HIV RELATED CONDITIONS,24,MULTIPLE SIGNIFICANT TRAUMA,4,Extreme,Extreme,Medical,"Managed Care, Unspecified",Medicaid,Self-Pay,,,Y,202706.13,61594.79
New York City,Manhattan,7002054,001458,New York-Presbyterian Hospital - New York Weill Cornell Center,70 or Older,,F,Black/African American,Not Span/Hispanic,16,Emergency,Skilled Nursing Home,2020,CIR020,CEREBRAL INFARCTION,IMG008,ULTRASONOGRAPHY,890,HIV W MULTIPLE MAJOR HIV RELATED CONDITIONS,24,MULTIPLE SIGNIFICANT TRAUMA,4,Extreme,Extreme,Medical,Medicare,Medicare,Self-Pay,,,Y,219724.35,48696.31
New York City,Manhattan,7002054,001458,New York-Presbyterian Hospital - New York Weill Cornell Center,50 to 69,,F,White,Spanish/Hispanic,3,Emergency,Home w/ Home Health Services,2020,INF006,HIV INFECTION,ADM017,ADMINISTRATION OF NUTRITIONAL AND ELECTROLYTIC SUBSTANCES,890,HIV W MULTIPLE MAJOR HIV RELATED CONDITIONS,24,MULTIPLE SIGNIFICANT TRAUMA,3,Major,Major,Medical,Medicaid,Self-Pay,,,,Y,52541.62,11172.97
New York City,Kings,7001021,001306,New York - Presbyterian Brooklyn Methodist Hospital,50 to 69,,M,Black/African American,Not Span/Hispanic,7,Emergency,Expired,2020,INF002,SEPTICEMIA,ADM017,ADMINISTRATION OF NUTRITIONAL AND ELECTROLYTIC SUBSTANCES,890,HIV W MULTIPLE MAJOR HIV RELATED CONDITIONS,24,MULTIPLE SIGNIFICANT TRAUMA,4,Extreme,Extreme,Medical,Medicare,Medicaid,Self-Pay,,,Y,57618.05,14028.21
Long Island,Nassau,2950002,000528,Nassau University Medical Center,50 to 69,,M,Black/African American,Not Span/Hispanic,17,Emergency,Home w/ Home Health Services,2020,INF002,SEPTICEMIA,OTR004,ISOLATION PROCEDURES,890,HIV W MULTIPLE MAJOR HIV RELATED CONDITIONS,24,MULTIPLE SIGNIFICANT TRAUMA,4,Extreme,Extreme,Medical,Medicare,Medicaid,Self-Pay,,,N,141884.93,46454.03
New York City,Kings,7002002,001324,Mount Sinai Brooklyn,70 or Older,,F,Black/African American,Not Span/Hispanic,9,Emergency,Skilled Nursing Home,2020,RSP002,PNEUMONIA (EXCEPT THAT CAUSED BY TUBERCULOSIS),ADM001,TRANSFUSION OF BLOOD AND BLOOD PRODUCTS,890,HIV W MULTIPLE MAJOR HIV RELATED CONDITIONS,24,MULTIPLE SIGNIFICANT TRAUMA,3,Major,Major,Medical,Medicare,Miscellaneous/Other,Medicaid,,,Y,102795.92,17391.06
New York City,Kings,7002002,001324,Mount Sinai Brooklyn,30 to 49,,M,Black/African American,Not Span/Hispanic,31,Emergency,Home or Self Care,2020,INF006,HIV INFECTION,CNS002,LUMBAR PUNCTURE,890,HIV W MULTIPLE MAJOR HIV RELATED CONDITIONS,24,MULTIPLE SIGNIFICANT TRAUMA,3,Major,Major,Medical,Medicaid,Self-Pay,,,,Y,477838.55,82405.72
New York City,Kings,7002002,001324,Mount Sinai Brooklyn,50 to 69,,M,Black/African American,Not Span/Hispanic,8,Emergency,Home or Self Care,2020,INF002,SEPTICEMIA,IMG008,ULTRASONOGRAPHY,890,HIV W MULTIPLE MAJOR HIV RELATED CONDITIONS,24,MULTIPLE SIGNIFICANT TRAUMA,3,Major,Major,Medical,Medicaid,Self-Pay,,,,Y,97089.36,16028.26
Western NY,Erie,1401005,000210,Erie County Medical Center,18 to 29,,M,White,Not Span/Hispanic,5,Emergency,Home or Self Care,2020,INF006,HIV INFECTION,,,890,HIV W MULTIPLE MAJOR HIV RELATED CONDITIONS,24,MULTIPLE SIGNIFICANT TRAUMA,3,Major,Major,Medical,Medicaid,,,,,Y,17420.1,9179.05
Western NY,Erie,1401005,000210,Erie County Medical Center,30 to 49,,F,White,Not Span/Hispanic,6,Emergency,Expired,2020,INF002,SEPTICEMIA,ESA003,MECHANICAL VENTILATION,890,HIV W MULTIPLE MAJOR HIV RELATED CONDITIONS,24,MULTIPLE SIGNIFICANT TRAUMA,4,Extreme,Extreme,Medical,Medicaid,Medicaid,,,,Y,55886.56,27157.93
New York City,Manhattan,7002002,001439,Mount Sinai Beth Israel,30 to 49,,M,Black/African American,Unknown,3,Emergency,Home or Self Care,2020,INF002,SEPTICEMIA,ADM015,ADMINISTRATION OF ANTIBIOTICS,890,HIV W MULTIPLE MAJOR HIV RELATED CONDITIONS,24,MULTIPLE SIGNIFICANT TRAUMA,3,Major,Major,Medical,Medicaid,Medicaid,Self-Pay,,,Y,38713.3,8522.52
New York City,Bronx,7000006,001169,Montefiore Medical Center - Henry & Lucy Moses Div,50 to 69,,M,Black/African American,Not Span/Hispanic,34,Emergency,Home or Self Care,2020,NVS001,MENINGITIS,CNS002,LUMBAR PUNCTURE,890,HIV W MULTIPLE MAJOR HIV RELATED CONDITIONS,24,MULTIPLE SIGNIFICANT TRAUMA,3,Major,Extreme,Medical,Medicaid,,,,,Y,607365.34,95126.85
New York City,Manhattan,7002032,001466,Mount Sinai West,50 to 69,,F,Black/African American,Not Span/Hispanic,4,Emergency,Home w/ Home Health Services,2020,INF002,SEPTICEMIA,ESA001,HEMODIALYSIS,890,HIV W MULTIPLE MAJOR HIV RELATED CONDITIONS,24,MULTIPLE SIGNIFICANT TRAUMA,3,Major,Major,Medical,Medicare,Medicare,Medicaid,,,Y,50168.52,12278.42
New York City,Manhattan,7002032,001469,Mount Sinai Morningside,70 or Older,,M,Other Race,Spanish/Hispanic,15,Emergency,Expired,2020,NVS009,EPILEPSY; CONVULSIONS,MAM011,ELECTROENCEPHALOGRAM (EEG),890,HIV W MULTIPLE MAJOR HIV RELATED CONDITIONS,24,MULTIPLE SIGNIFICANT TRAUMA,4,Extreme,Extreme,Medical,Medicare,Medicare,Medicaid,,,Y,308881.03,69798.76
New York City,Manhattan,7002032,001469,Mount Sinai Morningside,50 to 69,,M,Black/African American,Not Span/Hispanic,2,Emergency,Home or Self Care,2020,NVS009,EPILEPSY; CONVULSIONS,MAM011,ELECTROENCEPHALOGRAM (EEG),890,HIV W MULTIPLE MAJOR HIV RELATED CONDITIONS,24,MULTIPLE SIGNIFICANT TRAUMA,2,Moderate,Major,Medical,Medicaid,Medicaid,Self-Pay,,,Y,30624.49,7215.19
New York City,Manhattan,7002032,001469,Mount Sinai Morningside,50 to 69,,M,Black/African American,Not Span/Hispanic,2,Emergency,Home or Self Care,2020,NVS009,EPILEPSY; CONVULSIONS,CNS002,LUMBAR PUNCTURE,890,HIV W MULTIPLE MAJOR HIV RELATED CONDITIONS,24,MULTIPLE SIGNIFICANT TRAUMA,2,Moderate,Major,Medical,Medicare,Self-Pay,,,,Y,46632.13,10482.25
New York City,Bronx,7000006,003058,Montefiore Med Center - Jack D Weiler Hosp of A Einstein College Div,50 to 69,,F,Black/African American,Not Span/Hispanic,16,Emergency,Expired,2020,INF002,SEPTICEMIA,ESA003,MECHANICAL VENTILATION,890,HIV W MULTIPLE MAJOR HIV RELATED CONDITIONS,24,MULTIPLE SIGNIFICANT TRAUMA,4,Extreme,Extreme,Medical,Medicare,Medicaid,,,,Y,449155.42,73039.3
New York City,Bronx,7000006,003058,Montefiore Med Center - Jack D Weiler Hosp of A Einstein College Div,50 to 69,,M,Other Race,Spanish/Hispanic,9,Emergency,Expired,2020,RSP002,PNEUMONIA (EXCEPT THAT CAUSED BY TUBERCULOSIS),ESA005,CARDIAC CHEST COMPRESSION,890,HIV W MULTIPLE MAJOR HIV RELATED CONDITIONS,24,MULTIPLE SIGNIFICANT TRAUMA,4,Extreme,Extreme,Medical,Medicaid,,,,,Y,101822.97,16070.65
New York City,Bronx,7000006,001169,Montefiore Medical Center - Henry & Lucy Moses Div,50 to 69,,M,White,Spanish/Hispanic,6,Emergency,Home w/ Home Health Services,2020,RSP012,RESPIRATORY FAILURE; INSUFFICIENCY; ARREST,ESA004,NON-INVASIVE VENTILATION,890,HIV W MULTIPLE MAJOR HIV RELATED CONDITIONS,24,MULTIPLE SIGNIFICANT TRAUMA,4,Extreme,Major,Medical,Medicaid,,,,,Y,136034.91,20403.67
New York City,Manhattan,7002053,001463,NYU Langone Hospitals,30 to 49,,M,Black/African American,Not Span/Hispanic,12,Emergency,Home or Self Care,2020,INF006,HIV INFECTION,URN002,KIDNEY AND OTHER URINARY TRACT BIOPSY (NON-ENDOSCOPIC),890,HIV W MULTIPLE MAJOR HIV RELATED CONDITIONS,24,MULTIPLE SIGNIFICANT TRAUMA,3,Major,Major,Medical,Private Health Insurance,,,,,Y,182915.87,63579.85
New York City,Kings,7002053,001304,NYU Langone Hospital-Brooklyn,50 to 69,,M,Black/African American,Not Span/Hispanic,20,Emergency,Home or Self Care,2020,GEN002,ACUTE AND UNSPECIFIED RENAL FAILURE,CAR025,PLACEMENT OF TUNNELED OR IMPLANTABLE PORTION OF A VASCULAR ACCESS DEVICE,890,HIV W MULTIPLE MAJOR HIV RELATED CONDITIONS,24,MULTIPLE SIGNIFICANT TRAUMA,4,Extreme,Extreme,Medical,Blue Cross/Blue Shield,Medicaid,,,,Y,363713.32,81078.59
New York City,Bronx,7000006,001169,Montefiore Medical Center - Henry & Lucy Moses Div,30 to 49,,F,Black/African American,Not Span/Hispanic,6,Emergency,Expired,2020,INF002,SEPTICEMIA,CAR024,VENOUS AND ARTERIAL CATHETER PLACEMENT,890,HIV W MULTIPLE MAJOR HIV RELATED CONDITIONS,24,MULTIPLE SIGNIFICANT TRAUMA,4,Extreme,Extreme,Medical,Medicare,Medicaid,,,,Y,203641.29,27526.21
Hudson Valley,Rockland,4322000,000775,Helen Hayes Hospital,50 to 69,,F,White,Unknown,5,Elective,Short-term Hospital,2020,DIG016,PERITONITIS AND INTRA-ABDOMINAL ABSCESS,,,890,HIV W MULTIPLE MAJOR HIV RELATED CONDITIONS,24,MULTIPLE SIGNIFICANT TRAUMA,2,Moderate,Major,Medical,Medicare,Medicaid,Medicare,,,N,13404,9650.9
New York City,Bronx,7000006,001169,Montefiore Medical Center - Henry & Lucy Moses Div,50 to 69,,M,White,Not Span/Hispanic,2,Emergency,Home or Self Care,2020,INF002,SEPTICEMIA,,,890,HIV W MULTIPLE MAJOR HIV RELATED CONDITIONS,24,MULTIPLE SIGNIFICANT TRAUMA,4,Extreme,Extreme,Medical,Medicare,,,,,Y,32564.49,5324.27
New York City,Manhattan,7002053,001463,NYU Langone Hospitals,30 to 49,,F,White,Not Span/Hispanic,8,Emergency,Home or Self Care,2020,INF002,SEPTICEMIA,,,890,HIV W MULTIPLE MAJOR HIV RELATED CONDITIONS,24,MULTIPLE SIGNIFICANT TRAUMA,4,Extreme,Major,Medical,Medicaid,,,,,Y,86997.31,27893.95
New York City,Bronx,7000006,001168,Montefiore Medical Center-Wakefield Hospital,50 to 69,,M,White,Not Span/Hispanic,18,Emergency,Home w/ Home Health Services,2020,INF002,SEPTICEMIA,ESA004,NON-INVASIVE VENTILATION,890,HIV W MULTIPLE MAJOR HIV RELATED CONDITIONS,24,MULTIPLE SIGNIFICANT TRAUMA,4,Extreme,Extreme,Medical,Private Health Insurance,,,,,Y,250493.4,43673.4
New York City,Manhattan,7002053,001463,NYU Langone Hospitals,30 to 49,,M,Black/African American,Not Span/Hispanic,14,Emergency,Hospice - Medical Facility,2020,INF006,HIV INFECTION,RES007,AIRWAY INTUBATION,890,HIV W MULTIPLE MAJOR HIV RELATED CONDITIONS,24,MULTIPLE SIGNIFICANT TRAUMA,4,Extreme,Extreme,Medical,Medicaid,,,,,Y,333001.47,86481.84
New York City,Kings,7002053,001304,NYU Langone Hospital-Brooklyn,30 to 49,,M,White,Not Span/Hispanic,4,Emergency,Home or Self Care,2020,INF006,HIV INFECTION,,,890,HIV W MULTIPLE MAJOR HIV RELATED CONDITIONS,24,MULTIPLE SIGNIFICANT TRAUMA,4,Extreme,Extreme,Medical,Private Health Insurance,,,,,Y,60874.38,15895.16
New York City,Bronx,7000006,001169,Montefiore Medical Center - Henry & Lucy Moses Div,30 to 49,,M,Other Race,Unknown,31,Emergency,Home w/ Home Health Services,2020,INF006,HIV INFECTION,MST003,"SUBCUTANEOUS TISSUE, FASCIA, AND MUSCLE BIOPSY",890,HIV W MULTIPLE MAJOR HIV RELATED CONDITIONS,24,MULTIPLE SIGNIFICANT TRAUMA,3,Major,Major,Medical,Private Health Insurance,,,,,N,597697.85,98124.17
New York City,Manhattan,7002024,001456,Mount Sinai Hospital,50 to 69,,M,Black/African American,Not Span/Hispanic,8,Emergency,Expired,2020,INF002,SEPTICEMIA,ESA003,MECHANICAL VENTILATION,890,HIV W MULTIPLE MAJOR HIV RELATED CONDITIONS,24,MULTIPLE SIGNIFICANT TRAUMA,4,Extreme,Extreme,Medical,Medicare,Medicaid,Self-Pay,,,Y,221027.75,52511.46
New York City,Bronx,7000001,001178,BronxCare Hospital Center,50 to 69,,F,Other Race,Spanish/Hispanic,6,Emergency,Home or Self Care,2020,INF006,HIV INFECTION,,,890,HIV W MULTIPLE MAJOR HIV RELATED CONDITIONS,24,MULTIPLE SIGNIFICANT TRAUMA,2,Moderate,Moderate,Medical,Medicaid,Medicaid,,,,Y,22940.32,33540.12
New York City,Bronx,7000001,001178,BronxCare Hospital Center,50 to 69,,M,Black/African American,Not Span/Hispanic,39,Emergency,Skilled Nursing Home,2020,INF006,HIV INFECTION,CNS002,LUMBAR PUNCTURE,890,HIV W MULTIPLE MAJOR HIV RELATED CONDITIONS,24,MULTIPLE SIGNIFICANT TRAUMA,3,Major,Major,Medical,Medicare,Medicare,Medicaid,,,Y,121437.72,155262.39
New York City,Bronx,7000001,001178,BronxCare Hospital Center,50 to 69,,F,Black/African American,Not Span/Hispanic,6,Emergency,Home or Self Care,2020,RSP002,PNEUMONIA (EXCEPT THAT CAUSED BY TUBERCULOSIS),,,890,HIV W MULTIPLE MAJOR HIV RELATED CONDITIONS,24,MULTIPLE SIGNIFICANT TRAUMA,4,Extreme,Major,Medical,Medicare,Medicare,Medicaid,,,Y,22741.37,33742.32