Hospital Service Area,Hospital County,Operating Certificate Number,Permanent Facility Id,Facility Name,Age Group,Zip Code - 3 digits,Gender,Race,Ethnicity,Length of Stay,Type of Admission,Patient Disposition,Discharge Year,CCS Diagnosis Code,CCS Diagnosis Description,CCS Procedure Code,CCS Procedure Description,APR DRG Code,APR DRG Description,APR MDC Code,APR MDC Description,APR Severity of Illness Code,APR Severity of Illness Description,APR Risk of Mortality,APR Medical Surgical Description,Payment Typology 1,Payment Typology 2,Payment Typology 3,Birth Weight,Abortion Edit Indicator,Emergency Department Indicator,Total Charges,Total Costs
New York City,Manhattan,7002053,001463,NYU Langone Hospitals,30 to 49,,F,Black/African American,Unknown,8,Emergency,Home w/ Home Health Services,2020,INF006,HIV INFECTION,LYM001,LYMPH NODE BIOPSY,892,HIV W MAJOR HIV RELATED CONDITION,24,MULTIPLE SIGNIFICANT TRAUMA,2,Moderate,Moderate,Medical,Medicaid,,,,,N,152540.77,36703.44
New York City,Manhattan,7002053,001463,NYU Langone Hospitals,18 to 29,,M,Other Race,Not Span/Hispanic,13,Emergency,Home or Self Care,2020,INF006,HIV INFECTION,,,892,HIV W MAJOR HIV RELATED CONDITION,24,MULTIPLE SIGNIFICANT TRAUMA,3,Major,Moderate,Medical,Private Health Insurance,,,,,Y,176490.44,50110.06
New York City,Manhattan,7002053,001463,NYU Langone Hospitals,50 to 69,,M,White,Not Span/Hispanic,9,Emergency,Skilled Nursing Home,2020,INF006,HIV INFECTION,SKB001,SKIN BIOPSY AND DIAGNOSTIC DRAINAGE,892,HIV W MAJOR HIV RELATED CONDITION,24,MULTIPLE SIGNIFICANT TRAUMA,3,Major,Major,Medical,Medicaid,,,,,Y,158915.49,35520.39
New York City,Manhattan,7002053,001463,NYU Langone Hospitals,18 to 29,,M,Other Race,Spanish/Hispanic,8,Emergency,Home w/ Home Health Services,2020,SKN001,SKIN AND SUBCUTANEOUS TISSUE INFECTIONS,,,892,HIV W MAJOR HIV RELATED CONDITION,24,MULTIPLE SIGNIFICANT TRAUMA,3,Major,Major,Medical,Medicaid,,,,,Y,69214.1,26467.44
New York City,Manhattan,7002053,001463,NYU Langone Hospitals,50 to 69,,M,White,Not Span/Hispanic,1,Emergency,Home or Self Care,2020,SKN001,SKIN AND SUBCUTANEOUS TISSUE INFECTIONS,,,892,HIV W MAJOR HIV RELATED CONDITION,24,MULTIPLE SIGNIFICANT TRAUMA,2,Moderate,Moderate,Medical,Private Health Insurance,,,,,Y,29692.65,9171.6
New York City,Manhattan,7002053,001463,NYU Langone Hospitals,50 to 69,,M,Other Race,Unknown,2,Emergency,Home w/ Home Health Services,2020,END011,FLUID AND ELECTROLYTE DISORDERS,,,892,HIV W MAJOR HIV RELATED CONDITION,24,MULTIPLE SIGNIFICANT TRAUMA,2,Moderate,Major,Medical,Medicare,,,,,Y,40726.76,8420.75
New York City,Manhattan,7002053,001463,NYU Langone Hospitals,50 to 69,,M,White,Not Span/Hispanic,2,Emergency,Home or Self Care,2020,INF002,SEPTICEMIA,,,892,HIV W MAJOR HIV RELATED CONDITION,24,MULTIPLE SIGNIFICANT TRAUMA,3,Major,Moderate,Medical,Medicare,Medicaid,,,,Y,61531.07,11981.96
New York City,Manhattan,7002053,001463,NYU Langone Hospitals,50 to 69,,M,Black/African American,Not Span/Hispanic,2,Emergency,Home w/ Home Health Services,2020,GEN002,ACUTE AND UNSPECIFIED RENAL FAILURE,,,892,HIV W MAJOR HIV RELATED CONDITION,24,MULTIPLE SIGNIFICANT TRAUMA,2,Moderate,Moderate,Medical,Medicare,Medicaid,,,,Y,53077.82,14473.48
New York City,Manhattan,7002053,001463,NYU Langone Hospitals,50 to 69,,F,Black/African American,Not Span/Hispanic,6,Emergency,Home or Self Care,2020,BLD006,COAGULATION AND HEMORRHAGIC DISORDERS,ADM001,TRANSFUSION OF BLOOD AND BLOOD PRODUCTS,892,HIV W MAJOR HIV RELATED CONDITION,24,MULTIPLE SIGNIFICANT TRAUMA,3,Major,Major,Medical,Blue Cross/Blue Shield,,,,,Y,117201.05,25280.42
New York City,Manhattan,7002053,001463,NYU Langone Hospitals,50 to 69,,M,Black/African American,Not Span/Hispanic,6,Emergency,Skilled Nursing Home,2020,INF002,SEPTICEMIA,OTR004,ISOLATION PROCEDURES,892,HIV W MAJOR HIV RELATED CONDITION,24,MULTIPLE SIGNIFICANT TRAUMA,4,Extreme,Major,Medical,Medicaid,,,,,Y,86076.18,23523.15
New York City,Manhattan,7002053,001463,NYU Langone Hospitals,18 to 29,,F,Other Race,Spanish/Hispanic,3,Emergency,Left Against Medical Advice,2020,BLD004,ACUTE POSTHEMORRHAGIC ANEMIA,ADM001,TRANSFUSION OF BLOOD AND BLOOD PRODUCTS,892,HIV W MAJOR HIV RELATED CONDITION,24,MULTIPLE SIGNIFICANT TRAUMA,3,Major,Major,Medical,Medicaid,,,,,Y,87070.9,21157.75
New York City,Manhattan,7002053,001463,NYU Langone Hospitals,30 to 49,,M,Black/African American,Not Span/Hispanic,3,Emergency,Home or Self Care,2020,GEN002,ACUTE AND UNSPECIFIED RENAL FAILURE,,,892,HIV W MAJOR HIV RELATED CONDITION,24,MULTIPLE SIGNIFICANT TRAUMA,2,Moderate,Moderate,Medical,Medicaid,,,,,Y,35605.17,14483.09
New York City,Manhattan,7002053,001463,NYU Langone Hospitals,30 to 49,,F,White,Not Span/Hispanic,8,Emergency,Inpatient Rehabilitation Facility,2020,INF006,HIV INFECTION,OTR004,ISOLATION PROCEDURES,892,HIV W MAJOR HIV RELATED CONDITION,24,MULTIPLE SIGNIFICANT TRAUMA,3,Major,Moderate,Medical,Private Health Insurance,,,,,Y,127254.4,41154.87
New York City,Manhattan,7002053,001463,NYU Langone Hospitals,30 to 49,,F,White,Not Span/Hispanic,14,Emergency,Inpatient Rehabilitation Facility,2020,INF006,HIV INFECTION,CNS002,LUMBAR PUNCTURE,892,HIV W MAJOR HIV RELATED CONDITION,24,MULTIPLE SIGNIFICANT TRAUMA,3,Major,Moderate,Medical,Private Health Insurance,,,,,Y,220805.86,56451.49
New York City,Manhattan,7002053,001463,NYU Langone Hospitals,18 to 29,,F,Other Race,Spanish/Hispanic,13,Emergency,Left Against Medical Advice,2020,INF002,SEPTICEMIA,CAR024,VENOUS AND ARTERIAL CATHETER PLACEMENT,892,HIV W MAJOR HIV RELATED CONDITION,24,MULTIPLE SIGNIFICANT TRAUMA,4,Extreme,Major,Medical,Medicaid,,,,,Y,208033.63,67269.67
New York City,Manhattan,7002053,001463,NYU Langone Hospitals,30 to 49,,F,White,Not Span/Hispanic,7,Emergency,Home or Self Care,2020,INF006,HIV INFECTION,,,892,HIV W MAJOR HIV RELATED CONDITION,24,MULTIPLE SIGNIFICANT TRAUMA,2,Moderate,Moderate,Medical,Private Health Insurance,,,,,Y,92600.09,33503.54
New York City,Manhattan,7002053,001463,NYU Langone Hospitals,30 to 49,,M,White,Not Span/Hispanic,1,Elective,Left Against Medical Advice,2020,INF006,HIV INFECTION,MAM005,MEASUREMENT DURING CARDIAC CATHETERIZATION,892,HIV W MAJOR HIV RELATED CONDITION,24,MULTIPLE SIGNIFICANT TRAUMA,3,Major,Major,Medical,Medicaid,,,,,N,52735.26,12354.11
New York City,Manhattan,7002053,001463,NYU Langone Hospitals,50 to 69,,M,Black/African American,Not Span/Hispanic,6,Emergency,Home w/ Home Health Services,2020,DIG001,INTESTINAL INFECTION,,,892,HIV W MAJOR HIV RELATED CONDITION,24,MULTIPLE SIGNIFICANT TRAUMA,4,Extreme,Major,Medical,Medicaid,,,,,N,101856.49,30637.92
New York City,Manhattan,7002053,001463,NYU Langone Hospitals,50 to 69,,M,Black/African American,Not Span/Hispanic,1,Elective,Expired,2020,INF006,HIV INFECTION,URN011,KIDNEY TRANSPLANT,892,HIV W MAJOR HIV RELATED CONDITION,24,MULTIPLE SIGNIFICANT TRAUMA,3,Major,Major,Medical,Medicare,Medicaid,,,,N,593423.75,243219.31
New York City,Manhattan,7002053,001463,NYU Langone Hospitals,30 to 49,,M,Other Race,Unknown,7,Emergency,Home w/ Home Health Services,2020,INF002,SEPTICEMIA,SKB001,SKIN BIOPSY AND DIAGNOSTIC DRAINAGE,892,HIV W MAJOR HIV RELATED CONDITION,24,MULTIPLE SIGNIFICANT TRAUMA,4,Extreme,Moderate,Medical,Medicaid,,,,,Y,167401.59,51611.84
New York City,Manhattan,7002053,001463,NYU Langone Hospitals,50 to 69,,M,White,Not Span/Hispanic,21,Emergency,Left Against Medical Advice,2020,DIG016,PERITONITIS AND INTRA-ABDOMINAL ABSCESS,OTR004,ISOLATION PROCEDURES,892,HIV W MAJOR HIV RELATED CONDITION,24,MULTIPLE SIGNIFICANT TRAUMA,2,Moderate,Minor,Medical,Medicaid,,,,,Y,220821.11,96365.64
New York City,Manhattan,7002053,001463,NYU Langone Hospitals,50 to 69,,M,Other Race,Spanish/Hispanic,3,Emergency,Home w/ Home Health Services,2020,INF002,SEPTICEMIA,ESA004,NON-INVASIVE VENTILATION,892,HIV W MAJOR HIV RELATED CONDITION,24,MULTIPLE SIGNIFICANT TRAUMA,3,Major,Major,Medical,Medicaid,Medicaid,,,,Y,85467.03,18728.32
New York City,Manhattan,7002053,001463,NYU Langone Hospitals,30 to 49,,M,Black/African American,Not Span/Hispanic,5,Emergency,Home or Self Care,2020,DIG001,INTESTINAL INFECTION,GNR004,ENDOSCOPIC CONTROL OF BLEEDING,892,HIV W MAJOR HIV RELATED CONDITION,24,MULTIPLE SIGNIFICANT TRAUMA,3,Major,Major,Medical,Medicaid,,,,,Y,118036.11,35024.18
New York City,Manhattan,7002053,001463,NYU Langone Hospitals,50 to 69,,M,Black/African American,Not Span/Hispanic,1,Emergency,Home or Self Care,2020,END011,FLUID AND ELECTROLYTE DISORDERS,,,892,HIV W MAJOR HIV RELATED CONDITION,24,MULTIPLE SIGNIFICANT TRAUMA,3,Major,Moderate,Medical,Private Health Insurance,,,,,Y,31264.14,12082.43
New York City,Manhattan,7002053,001463,NYU Langone Hospitals,50 to 69,,M,White,Not Span/Hispanic,13,Emergency,Home w/ Home Health Services,2020,INF006,HIV INFECTION,URN011,KIDNEY TRANSPLANT,892,HIV W MAJOR HIV RELATED CONDITION,24,MULTIPLE SIGNIFICANT TRAUMA,3,Major,Moderate,Medical,Medicare,Medicare,,,,N,812423.17,311486.34
New York City,Manhattan,7002053,001463,NYU Langone Hospitals,30 to 49,,M,Black/African American,Not Span/Hispanic,3,Emergency,Left Against Medical Advice,2020,INF002,SEPTICEMIA,,,892,HIV W MAJOR HIV RELATED CONDITION,24,MULTIPLE SIGNIFICANT TRAUMA,3,Major,Major,Medical,Medicaid,,,,,Y,39736.44,14918.32
New York City,Manhattan,7002053,001463,NYU Langone Hospitals,50 to 69,,M,Black/African American,Not Span/Hispanic,21,Emergency,Skilled Nursing Home,2020,CIR020,CEREBRAL INFARCTION,CNS002,LUMBAR PUNCTURE,892,HIV W MAJOR HIV RELATED CONDITION,24,MULTIPLE SIGNIFICANT TRAUMA,4,Extreme,Extreme,Medical,Medicare,,,,,N,373429.73,113683.08
New York City,Manhattan,7002053,001463,NYU Langone Hospitals,50 to 69,,M,Multi-racial,Not Span/Hispanic,3,Emergency,Home or Self Care,2020,GEN002,ACUTE AND UNSPECIFIED RENAL FAILURE,,,892,HIV W MAJOR HIV RELATED CONDITION,24,MULTIPLE SIGNIFICANT TRAUMA,2,Moderate,Moderate,Medical,Medicare,Medicaid,,,,Y,63608.56,17054.24
New York City,Manhattan,7002053,001463,NYU Langone Hospitals,50 to 69,,M,Black/African American,Not Span/Hispanic,7,Emergency,Left Against Medical Advice,2020,INF006,HIV INFECTION,,,892,HIV W MAJOR HIV RELATED CONDITION,24,MULTIPLE SIGNIFICANT TRAUMA,3,Major,Major,Medical,Medicare,Medicaid,,,,Y,120217.87,40654.88
