Hospital Service Area,Hospital County,Operating Certificate Number,Permanent Facility Id,Facility Name,Age Group,Zip Code - 3 digits,Gender,Race,Ethnicity,Length of Stay,Type of Admission,Patient Disposition,Discharge Year,CCS Diagnosis Code,CCS Diagnosis Description,CCS Procedure Code,CCS Procedure Description,APR DRG Code,APR DRG Description,APR MDC Code,APR MDC Description,APR Severity of Illness Code,APR Severity of Illness Description,APR Risk of Mortality,APR Medical Surgical Description,Payment Typology 1,Payment Typology 2,Payment Typology 3,Birth Weight,Abortion Edit Indicator,Emergency Department Indicator,Total Charges,Total Costs
New York City,Manhattan,7002024,001456,Mount Sinai Hospital,50 to 69,,M,Other Race,Spanish/Hispanic,4,Emergency,Home or Self Care,2020,RSP002,PNEUMONIA (EXCEPT THAT CAUSED BY TUBERCULOSIS),OTR004,ISOLATION PROCEDURES,893,HIV W MULTIPLE SIGNIFICANT HIV RELATED CONDITIONS,24,MULTIPLE SIGNIFICANT TRAUMA,2,Moderate,Moderate,Medical,Medicaid,Medicaid,Self-Pay,,,Y,53250.26,13291.15
New York City,Manhattan,7002032,001469,Mount Sinai Morningside,30 to 49,,F,Other Race,Not Span/Hispanic,3,Emergency,Home or Self Care,2020,SKN001,SKIN AND SUBCUTANEOUS TISSUE INFECTIONS,ADM015,ADMINISTRATION OF ANTIBIOTICS,893,HIV W MULTIPLE SIGNIFICANT HIV RELATED CONDITIONS,24,MULTIPLE SIGNIFICANT TRAUMA,3,Major,Major,Medical,Medicare,Medicaid,Self-Pay,,,Y,39747.2,9383
New York City,Bronx,7000006,001169,Montefiore Medical Center - Henry & Lucy Moses Div,30 to 49,,M,Other Race,Spanish/Hispanic,7,Emergency,Home or Self Care,2020,INF006,HIV INFECTION,ADM001,TRANSFUSION OF BLOOD AND BLOOD PRODUCTS,893,HIV W MULTIPLE SIGNIFICANT HIV RELATED CONDITIONS,24,MULTIPLE SIGNIFICANT TRAUMA,2,Moderate,Moderate,Medical,Private Health Insurance,,,,,Y,123669.3,20133.39
New York City,Manhattan,7002054,003975,New York Presbyterian Hospital - Allen Hospital,50 to 69,,F,Black/African American,Not Span/Hispanic,3,Emergency,Home or Self Care,2020,INF006,HIV INFECTION,,,893,HIV W MULTIPLE SIGNIFICANT HIV RELATED CONDITIONS,24,MULTIPLE SIGNIFICANT TRAUMA,2,Moderate,Moderate,Medical,Medicaid,Medicaid,Self-Pay,,,Y,52533.07,11093.83
New York City,Manhattan,7002054,001464,New York-Presbyterian Hospital - Columbia Presbyterian Center,18 to 29,,M,Other Race,Not Span/Hispanic,4,Emergency,Home or Self Care,2020,RSP002,PNEUMONIA (EXCEPT THAT CAUSED BY TUBERCULOSIS),,,893,HIV W MULTIPLE SIGNIFICANT HIV RELATED CONDITIONS,24,MULTIPLE SIGNIFICANT TRAUMA,2,Moderate,Minor,Medical,Medicaid,Medicaid,Self-Pay,,,Y,55470.9,11901.63
New York City,Manhattan,7002054,001464,New York-Presbyterian Hospital - Columbia Presbyterian Center,30 to 49,,F,Other Race,Not Span/Hispanic,9,Emergency,Home or Self Care,2020,INF006,HIV INFECTION,GIS001,ESOPHAGOGASTRODUODENOSCOPY (EGD) WITH BIOPSY,893,HIV W MULTIPLE SIGNIFICANT HIV RELATED CONDITIONS,24,MULTIPLE SIGNIFICANT TRAUMA,3,Major,Major,Medical,Blue Cross/Blue Shield,Self-Pay,,,,Y,119883.86,26898.85
New York City,Manhattan,7002054,001464,New York-Presbyterian Hospital - Columbia Presbyterian Center,50 to 69,,F,Multi-racial,Not Span/Hispanic,3,Emergency,Left Against Medical Advice,2020,INF006,HIV INFECTION,,,893,HIV W MULTIPLE SIGNIFICANT HIV RELATED CONDITIONS,24,MULTIPLE SIGNIFICANT TRAUMA,2,Moderate,Moderate,Medical,Medicaid,Medicaid,Self-Pay,,,Y,44356.33,9470.54
New York City,Manhattan,7002054,001437,New York-Presbyterian/Lower Manhattan Hospital,30 to 49,,M,Black/African American,Not Span/Hispanic,9,Emergency,Skilled Nursing Home,2020,INF006,HIV INFECTION,MST017,JOINT TISSUE EXCISION (EXCLUDING DISCECTOMY),893,HIV W MULTIPLE SIGNIFICANT HIV RELATED CONDITIONS,24,MULTIPLE SIGNIFICANT TRAUMA,2,Moderate,Minor,Medical,Private Health Insurance,Self-Pay,,,,Y,164429.61,38178.98
New York City,Manhattan,7002002,001439,Mount Sinai Beth Israel,50 to 69,,F,Other Race,Spanish/Hispanic,7,Emergency,Home or Self Care,2020,SKN001,SKIN AND SUBCUTANEOUS TISSUE INFECTIONS,SKB008,SKIN EXCISION AND DEBRIDEMENT,893,HIV W MULTIPLE SIGNIFICANT HIV RELATED CONDITIONS,24,MULTIPLE SIGNIFICANT TRAUMA,3,Major,Moderate,Medical,Medicaid,Medicaid,Self-Pay,,,Y,90420.84,21377.8
New York City,Bronx,7000006,001169,Montefiore Medical Center - Henry & Lucy Moses Div,50 to 69,,F,Other Race,Spanish/Hispanic,2,Emergency,Home or Self Care,2020,DIG001,INTESTINAL INFECTION,ADM015,ADMINISTRATION OF ANTIBIOTICS,893,HIV W MULTIPLE SIGNIFICANT HIV RELATED CONDITIONS,24,MULTIPLE SIGNIFICANT TRAUMA,2,Moderate,Moderate,Medical,Medicaid,,,,,Y,39951.31,5643.3
New York City,Bronx,7000006,003058,Montefiore Med Center - Jack D Weiler Hosp of A Einstein College Div,30 to 49,,M,Black/African American,Not Span/Hispanic,2,Emergency,Home or Self Care,2020,INF006,HIV INFECTION,ADM015,ADMINISTRATION OF ANTIBIOTICS,893,HIV W MULTIPLE SIGNIFICANT HIV RELATED CONDITIONS,24,MULTIPLE SIGNIFICANT TRAUMA,2,Moderate,Minor,Medical,Medicaid,,,,,Y,25788.06,3913.09
New York City,Manhattan,7002053,001463,NYU Langone Hospitals,70 or Older,,M,Black/African American,Not Span/Hispanic,5,Emergency,Skilled Nursing Home,2020,MUS002,OSTEOMYELITIS,,,893,HIV W MULTIPLE SIGNIFICANT HIV RELATED CONDITIONS,24,MULTIPLE SIGNIFICANT TRAUMA,2,Moderate,Minor,Medical,Medicare,Medicaid,,,,Y,48636.34,19612.78
New York City,Manhattan,7002053,001463,NYU Langone Hospitals,50 to 69,,F,White,Not Span/Hispanic,11,Emergency,Home or Self Care,2020,INF006,HIV INFECTION,,,893,HIV W MULTIPLE SIGNIFICANT HIV RELATED CONDITIONS,24,MULTIPLE SIGNIFICANT TRAUMA,2,Moderate,Minor,Medical,Medicaid,,,,,Y,135578.53,39359.09
New York City,Bronx,7000006,001169,Montefiore Medical Center - Henry & Lucy Moses Div,30 to 49,,F,Multi-racial,Spanish/Hispanic,4,Emergency,Home or Self Care,2020,RSP002,PNEUMONIA (EXCEPT THAT CAUSED BY TUBERCULOSIS),,,893,HIV W MULTIPLE SIGNIFICANT HIV RELATED CONDITIONS,24,MULTIPLE SIGNIFICANT TRAUMA,3,Major,Moderate,Medical,Medicaid,,,,,Y,56529.06,9844.43
Finger Lakes,Monroe,2701005,000413,Strong Memorial Hospital,18 to 29,,M,Black/African American,Not Span/Hispanic,1,Emergency,Home or Self Care,2020,INF008,VIRAL INFECTION,,,893,HIV W MULTIPLE SIGNIFICANT HIV RELATED CONDITIONS,24,MULTIPLE SIGNIFICANT TRAUMA,2,Moderate,Moderate,Medical,Self-Pay,,,,,Y,5794.7,2294.95
New York City,Bronx,7000001,001178,BronxCare Hospital Center,30 to 49,,M,Black/African American,Not Span/Hispanic,6,Emergency,Left Against Medical Advice,2020,MUS008,IMMUNE-MEDIATED/REACTIVE ARTHROPATHIES,MST001,ARTHROCENTESIS,893,HIV W MULTIPLE SIGNIFICANT HIV RELATED CONDITIONS,24,MULTIPLE SIGNIFICANT TRAUMA,1,Minor,Minor,Medical,Medicaid,Medicaid,,,,Y,22620.62,31308.66
New York City,Bronx,7000001,001178,BronxCare Hospital Center,70 or Older,,F,Other Race,Spanish/Hispanic,3,Emergency,Home or Self Care,2020,RSP002,PNEUMONIA (EXCEPT THAT CAUSED BY TUBERCULOSIS),,,893,HIV W MULTIPLE SIGNIFICANT HIV RELATED CONDITIONS,24,MULTIPLE SIGNIFICANT TRAUMA,3,Major,Major,Medical,Medicare,Medicare,Medicaid,,,Y,11962.8,16769.71
New York City,Bronx,7000001,001178,BronxCare Hospital Center,50 to 69,,M,Other Race,Spanish/Hispanic,3,Emergency,Left Against Medical Advice,2020,INF006,HIV INFECTION,,,893,HIV W MULTIPLE SIGNIFICANT HIV RELATED CONDITIONS,24,MULTIPLE SIGNIFICANT TRAUMA,2,Moderate,Minor,Medical,Medicaid,Medicaid,,,,Y,12577.48,17073.78
New York City,Bronx,7000001,001178,BronxCare Hospital Center,50 to 69,,F,Other Race,Unknown,6,Emergency,Home or Self Care,2020,RSP002,PNEUMONIA (EXCEPT THAT CAUSED BY TUBERCULOSIS),,,893,HIV W MULTIPLE SIGNIFICANT HIV RELATED CONDITIONS,24,MULTIPLE SIGNIFICANT TRAUMA,3,Major,Major,Medical,Medicaid,,,,,Y,23524.19,33659.81
Finger Lakes,Monroe,2701005,000413,Strong Memorial Hospital,50 to 69,,M,Black/African American,Not Span/Hispanic,2,Emergency,Left Against Medical Advice,2020,INF009,"PARASITIC, OTHER SPECIFIED AND UNSPECIFIED INFECTIONS",,,893,HIV W MULTIPLE SIGNIFICANT HIV RELATED CONDITIONS,24,MULTIPLE SIGNIFICANT TRAUMA,2,Moderate,Moderate,Medical,Medicaid,,,,,Y,11811.18,4283.45
New York City,Kings,7001033,001315,Kingsbrook Jewish Medical Center,50 to 69,,F,Black/African American,Not Span/Hispanic,6,Emergency,Home or Self Care,2020,RSP002,PNEUMONIA (EXCEPT THAT CAUSED BY TUBERCULOSIS),ADM015,ADMINISTRATION OF ANTIBIOTICS,893,HIV W MULTIPLE SIGNIFICANT HIV RELATED CONDITIONS,24,MULTIPLE SIGNIFICANT TRAUMA,3,Major,Major,Medical,Medicaid,Medicaid,Self-Pay,,,Y,45376.8,13388.01
New York City,Manhattan,7002002,001439,Mount Sinai Beth Israel,30 to 49,,M,Black/African American,Not Span/Hispanic,2,Emergency,Left Against Medical Advice,2020,MUS002,OSTEOMYELITIS,IMG009,PLAIN RADIOGRAPHY,893,HIV W MULTIPLE SIGNIFICANT HIV RELATED CONDITIONS,24,MULTIPLE SIGNIFICANT TRAUMA,3,Major,Moderate,Medical,Medicaid,Medicaid,Self-Pay,,,N,26909.53,6628.78
New York City,Manhattan,7002032,001466,Mount Sinai West,30 to 49,,M,Black/African American,Not Span/Hispanic,3,Emergency,Home w/ Home Health Services,2020,INF006,HIV INFECTION,SKB001,SKIN BIOPSY AND DIAGNOSTIC DRAINAGE,893,HIV W MULTIPLE SIGNIFICANT HIV RELATED CONDITIONS,24,MULTIPLE SIGNIFICANT TRAUMA,2,Moderate,Moderate,Medical,Medicaid,Medicaid,Self-Pay,,,Y,39590.57,9054.39
New York City,Manhattan,7002053,001463,NYU Langone Hospitals,50 to 69,,F,White,Not Span/Hispanic,6,Emergency,Skilled Nursing Home,2020,SKN003,PRESSURE ULCER OF SKIN,,,893,HIV W MULTIPLE SIGNIFICANT HIV RELATED CONDITIONS,24,MULTIPLE SIGNIFICANT TRAUMA,2,Moderate,Major,Medical,Medicare,Blue Cross/Blue Shield,,,,Y,74625.12,21157.16
New York City,Manhattan,7002032,001466,Mount Sinai West,50 to 69,,M,Black/African American,Not Span/Hispanic,11,Emergency,Home or Self Care,2020,SKN001,SKIN AND SUBCUTANEOUS TISSUE INFECTIONS,IMG008,ULTRASONOGRAPHY,893,HIV W MULTIPLE SIGNIFICANT HIV RELATED CONDITIONS,24,MULTIPLE SIGNIFICANT TRAUMA,2,Moderate,Moderate,Medical,Medicaid,Self-Pay,,,,Y,120930.44,27312.6
New York City,Bronx,7000006,001169,Montefiore Medical Center - Henry & Lucy Moses Div,50 to 69,,M,Other Race,Spanish/Hispanic,7,Emergency,Home or Self Care,2020,RSP002,PNEUMONIA (EXCEPT THAT CAUSED BY TUBERCULOSIS),,,893,HIV W MULTIPLE SIGNIFICANT HIV RELATED CONDITIONS,24,MULTIPLE SIGNIFICANT TRAUMA,3,Major,Minor,Medical,Medicaid,,,,,Y,84356.39,15303.88
Hudson Valley,Westchester,5904001,001072,Montefiore New Rochelle Hospital,50 to 69,,M,White,Multi-ethnic,2,Emergency,Home or Self Care,2020,RSP002,PNEUMONIA (EXCEPT THAT CAUSED BY TUBERCULOSIS),OTR004,ISOLATION PROCEDURES,893,HIV W MULTIPLE SIGNIFICANT HIV RELATED CONDITIONS,24,MULTIPLE SIGNIFICANT TRAUMA,2,Moderate,Minor,Medical,Medicare,Medicare,Self-Pay,,,Y,18438,4532.78
New York City,Manhattan,7002054,001458,New York-Presbyterian Hospital - New York Weill Cornell Center,50 to 69,,M,Black/African American,Not Span/Hispanic,4,Emergency,Home w/ Home Health Services,2020,INF006,HIV INFECTION,ADM015,ADMINISTRATION OF ANTIBIOTICS,893,HIV W MULTIPLE SIGNIFICANT HIV RELATED CONDITIONS,24,MULTIPLE SIGNIFICANT TRAUMA,3,Major,Major,Medical,Medicare,Blue Cross/Blue Shield,Medicaid,,,Y,56492.87,12700.99
New York City,Bronx,7000006,001169,Montefiore Medical Center - Henry & Lucy Moses Div,18 to 29,,M,Black/African American,Not Span/Hispanic,10,Emergency,Home or Self Care,2020,INF006,HIV INFECTION,MST005,INCISION AND DRAINAGE OF SUBCUTANEOUS TISSUE AND FASCIA,893,HIV W MULTIPLE SIGNIFICANT HIV RELATED CONDITIONS,24,MULTIPLE SIGNIFICANT TRAUMA,2,Moderate,Moderate,Medical,Medicaid,,,,,Y,134193,24738.95
Capital/Adirond,Otsego,3824000,000746,Mary Imogene Bassett Hospital,50 to 69,,M,White,Not Span/Hispanic,13,Urgent,Home w/ Home Health Services,2020,RSP002,PNEUMONIA (EXCEPT THAT CAUSED BY TUBERCULOSIS),ADM015,ADMINISTRATION OF ANTIBIOTICS,893,HIV W MULTIPLE SIGNIFICANT HIV RELATED CONDITIONS,24,MULTIPLE SIGNIFICANT TRAUMA,3,Major,Moderate,Medical,Medicare,Medicaid,Medicaid,,,N,34549.34,22288.22
New York City,Manhattan,7002002,001439,Mount Sinai Beth Israel,50 to 69,,M,Other Race,Unknown,14,Emergency,Home or Self Care,2020,DIG001,INTESTINAL INFECTION,CNS002,LUMBAR PUNCTURE,893,HIV W MULTIPLE SIGNIFICANT HIV RELATED CONDITIONS,24,MULTIPLE SIGNIFICANT TRAUMA,2,Moderate,Moderate,Medical,Private Health Insurance,Medicaid,Self-Pay,,,Y,172044.78,37336.67
New York City,Manhattan,7002032,001469,Mount Sinai Morningside,30 to 49,,M,Other Race,Spanish/Hispanic,3,Emergency,Left Against Medical Advice,2020,INF006,HIV INFECTION,ADM021,"ADMINISTRATION OF THERAPEUTIC SUBSTANCES, NEC",893,HIV W MULTIPLE SIGNIFICANT HIV RELATED CONDITIONS,24,MULTIPLE SIGNIFICANT TRAUMA,3,Major,Moderate,Medical,Medicaid,Medicaid,Self-Pay,,,Y,50590.04,12143.34
New York City,Bronx,7000006,001169,Montefiore Medical Center - Henry & Lucy Moses Div,50 to 69,,F,Other Race,Spanish/Hispanic,3,Emergency,Left Against Medical Advice,2020,INF010,SEXUALLY TRANSMITTED INFECTIONS (EXCLUDING HIV AND HEPATITIS),SKB001,SKIN BIOPSY AND DIAGNOSTIC DRAINAGE,893,HIV W MULTIPLE SIGNIFICANT HIV RELATED CONDITIONS,24,MULTIPLE SIGNIFICANT TRAUMA,1,Minor,Minor,Medical,Private Health Insurance,,,,,Y,57006.71,8112.72
Western NY,Erie,1401005,000210,Erie County Medical Center,50 to 69,,M,Other Race,Unknown,9,Emergency,Short-term Hospital,2020,RSP002,PNEUMONIA (EXCEPT THAT CAUSED BY TUBERCULOSIS),MAM005,MEASUREMENT DURING CARDIAC CATHETERIZATION,893,HIV W MULTIPLE SIGNIFICANT HIV RELATED CONDITIONS,24,MULTIPLE SIGNIFICANT TRAUMA,3,Major,Moderate,Medical,Department of Corrections,,,,,Y,33602.6,18218.76
New York City,Manhattan,7002032,001466,Mount Sinai West,30 to 49,,M,Other Race,Spanish/Hispanic,2,Emergency,Home or Self Care,2020,DIG001,INTESTINAL INFECTION,IMG006,COMPUTERIZED TOMOGRAPHY (CT) WITH CONTRAST,893,HIV W MULTIPLE SIGNIFICANT HIV RELATED CONDITIONS,24,MULTIPLE SIGNIFICANT TRAUMA,1,Minor,Minor,Medical,Medicaid,Medicaid,Self-Pay,,,Y,29549.52,7038.71
New York City,Manhattan,7002017,001450,Lenox Hill Hospital,50 to 69,,F,Black/African American,Not Span/Hispanic,5,Emergency,Left Against Medical Advice,2020,INF006,HIV INFECTION,,,893,HIV W MULTIPLE SIGNIFICANT HIV RELATED CONDITIONS,24,MULTIPLE SIGNIFICANT TRAUMA,3,Major,Moderate,Medical,Medicaid,Medicaid,,,,Y,63555.63,12106.68
Hudson Valley,Westchester,5907002,001098,St. Joseph's Medical Center,50 to 69,,M,Black/African American,Unknown,6,Emergency,Home or Self Care,2020,RSP002,PNEUMONIA (EXCEPT THAT CAUSED BY TUBERCULOSIS),,,893,HIV W MULTIPLE SIGNIFICANT HIV RELATED CONDITIONS,24,MULTIPLE SIGNIFICANT TRAUMA,3,Major,Moderate,Medical,Medicare,Medicare,Medicaid,,,N,27993.77,15046.78
New York City,Kings,7001033,001315,Kingsbrook Jewish Medical Center,50 to 69,,M,Black/African American,Not Span/Hispanic,3,Emergency,Home or Self Care,2020,INF006,HIV INFECTION,ADM001,TRANSFUSION OF BLOOD AND BLOOD PRODUCTS,893,HIV W MULTIPLE SIGNIFICANT HIV RELATED CONDITIONS,24,MULTIPLE SIGNIFICANT TRAUMA,3,Major,Major,Medical,Medicaid,Medicaid,Self-Pay,,,Y,47889.74,13207.96
New York City,Kings,7001033,001315,Kingsbrook Jewish Medical Center,30 to 49,,M,Black/African American,Not Span/Hispanic,1,Emergency,Left Against Medical Advice,2020,RSP002,PNEUMONIA (EXCEPT THAT CAUSED BY TUBERCULOSIS),,,893,HIV W MULTIPLE SIGNIFICANT HIV RELATED CONDITIONS,24,MULTIPLE SIGNIFICANT TRAUMA,2,Moderate,Moderate,Medical,Medicaid,Self-Pay,,,,Y,17843,3906.28
New York City,Bronx,7000006,003058,Montefiore Med Center - Jack D Weiler Hosp of A Einstein College Div,50 to 69,,M,Other Race,Spanish/Hispanic,7,Emergency,Home or Self Care,2020,INF006,HIV INFECTION,GIS001,ESOPHAGOGASTRODUODENOSCOPY (EGD) WITH BIOPSY,893,HIV W MULTIPLE SIGNIFICANT HIV RELATED CONDITIONS,24,MULTIPLE SIGNIFICANT TRAUMA,3,Major,Major,Medical,Medicaid,,,,,Y,85554.21,16473.6
New York City,Kings,7001033,001315,Kingsbrook Jewish Medical Center,30 to 49,,M,White,Spanish/Hispanic,6,Emergency,Home or Self Care,2020,INF006,HIV INFECTION,,,893,HIV W MULTIPLE SIGNIFICANT HIV RELATED CONDITIONS,24,MULTIPLE SIGNIFICANT TRAUMA,2,Moderate,Moderate,Medical,Medicaid,Medicaid,Self-Pay,,,Y,37163,12108.81
New York City,Kings,7001033,001315,Kingsbrook Jewish Medical Center,30 to 49,,M,Black/African American,Not Span/Hispanic,4,Emergency,Home or Self Care,2020,BLD003,APLASTIC ANEMIA,,,893,HIV W MULTIPLE SIGNIFICANT HIV RELATED CONDITIONS,24,MULTIPLE SIGNIFICANT TRAUMA,2,Moderate,Minor,Medical,Medicare,Medicare,Medicaid,,,Y,25359,8300.61
Long Island,Nassau,2951001,000541,North Shore University Hospital,18 to 29,,M,Other Race,Spanish/Hispanic,4,Emergency,Left Against Medical Advice,2020,DIG003,DISEASES OF MOUTH; EXCLUDING DENTAL,,,893,HIV W MULTIPLE SIGNIFICANT HIV RELATED CONDITIONS,24,MULTIPLE SIGNIFICANT TRAUMA,1,Minor,Moderate,Medical,Medicaid,,,,,Y,39887.2,6883.42
New York City,Kings,7002053,001304,NYU Langone Hospital-Brooklyn,30 to 49,,F,Other Race,Unknown,2,Emergency,Home or Self Care,2020,INF006,HIV INFECTION,,,893,HIV W MULTIPLE SIGNIFICANT HIV RELATED CONDITIONS,24,MULTIPLE SIGNIFICANT TRAUMA,3,Major,Moderate,Medical,Medicaid,,,,,Y,35424.07,8773.48
Finger Lakes,Monroe,2701005,000413,Strong Memorial Hospital,50 to 69,,F,Black/African American,Not Span/Hispanic,4,Emergency,Another Type Not Listed,2020,RSP002,PNEUMONIA (EXCEPT THAT CAUSED BY TUBERCULOSIS),,,893,HIV W MULTIPLE SIGNIFICANT HIV RELATED CONDITIONS,24,MULTIPLE SIGNIFICANT TRAUMA,2,Moderate,Moderate,Medical,Medicaid,,,,,Y,13049.16,6022.57
New York City,Manhattan,7002024,001456,Mount Sinai Hospital,30 to 49,,M,Black/African American,Not Span/Hispanic,3,Emergency,Home or Self Care,2020,RSP002,PNEUMONIA (EXCEPT THAT CAUSED BY TUBERCULOSIS),,,893,HIV W MULTIPLE SIGNIFICANT HIV RELATED CONDITIONS,24,MULTIPLE SIGNIFICANT TRAUMA,2,Moderate,Moderate,Medical,Medicaid,Medicaid,Self-Pay,,,Y,44798.46,10440.4
New York City,Bronx,7000006,001169,Montefiore Medical Center - Henry & Lucy Moses Div,70 or Older,,M,Other Race,Spanish/Hispanic,5,Emergency,Home or Self Care,2020,RSP002,PNEUMONIA (EXCEPT THAT CAUSED BY TUBERCULOSIS),OTR004,ISOLATION PROCEDURES,893,HIV W MULTIPLE SIGNIFICANT HIV RELATED CONDITIONS,24,MULTIPLE SIGNIFICANT TRAUMA,2,Moderate,Moderate,Medical,Blue Cross/Blue Shield,Medicare,,,,Y,69122.5,12111.02
New York City,Bronx,7000001,001178,BronxCare Hospital Center,50 to 69,,M,Other Race,Unknown,7,Emergency,Inpatient Rehabilitation Facility,2020,RSP002,PNEUMONIA (EXCEPT THAT CAUSED BY TUBERCULOSIS),,,893,HIV W MULTIPLE SIGNIFICANT HIV RELATED CONDITIONS,24,MULTIPLE SIGNIFICANT TRAUMA,2,Moderate,Moderate,Medical,Medicaid,,,,,Y,25214.55,37872.01
New York City,Bronx,7000001,001178,BronxCare Hospital Center,50 to 69,,F,Black/African American,Not Span/Hispanic,5,Emergency,Skilled Nursing Home,2020,RSP002,PNEUMONIA (EXCEPT THAT CAUSED BY TUBERCULOSIS),,,893,HIV W MULTIPLE SIGNIFICANT HIV RELATED CONDITIONS,24,MULTIPLE SIGNIFICANT TRAUMA,2,Moderate,Minor,Medical,Medicaid,,,,,Y,19798.91,27322.85
New York City,Bronx,7000001,001178,BronxCare Hospital Center,50 to 69,,F,Other Race,Unknown,2,Emergency,Home or Self Care,2020,END011,FLUID AND ELECTROLYTE DISORDERS,,,893,HIV W MULTIPLE SIGNIFICANT HIV RELATED CONDITIONS,24,MULTIPLE SIGNIFICANT TRAUMA,2,Moderate,Moderate,Medical,Medicaid,Medicaid,,,,Y,10463.04,12643.44
New York City,Bronx,7000001,001178,BronxCare Hospital Center,30 to 49,,F,Black/African American,Not Span/Hispanic,6,Emergency,Home or Self Care,2020,RSP002,PNEUMONIA (EXCEPT THAT CAUSED BY TUBERCULOSIS),,,893,HIV W MULTIPLE SIGNIFICANT HIV RELATED CONDITIONS,24,MULTIPLE SIGNIFICANT TRAUMA,3,Major,Moderate,Medical,Medicaid,Medicaid,,,,Y,25992.32,35037.11
New York City,Bronx,7000001,001178,BronxCare Hospital Center,30 to 49,,F,Black/African American,Not Span/Hispanic,10,Emergency,Home or Self Care,2020,INF006,HIV INFECTION,RES001,BRONCHOSCOPY (DIAGNOSTIC),893,HIV W MULTIPLE SIGNIFICANT HIV RELATED CONDITIONS,24,MULTIPLE SIGNIFICANT TRAUMA,2,Moderate,Moderate,Medical,Medicaid,Medicaid,,,,Y,41366.59,57134.66
New York City,Bronx,7000001,001178,BronxCare Hospital Center,30 to 49,,M,Black/African American,Not Span/Hispanic,2,Emergency,Left Against Medical Advice,2020,RSP002,PNEUMONIA (EXCEPT THAT CAUSED BY TUBERCULOSIS),,,893,HIV W MULTIPLE SIGNIFICANT HIV RELATED CONDITIONS,24,MULTIPLE SIGNIFICANT TRAUMA,2,Moderate,Moderate,Medical,Medicaid,,,,,Y,8766.68,11344.24
New York City,Bronx,7000006,003058,Montefiore Med Center - Jack D Weiler Hosp of A Einstein College Div,30 to 49,,F,White,Not Span/Hispanic,15,Emergency,Home w/ Home Health Services,2020,SYM005,DYSPHAGIA,GIS007,GI SYSTEM DRAINAGE (EXCLUDING PARACENTESIS),893,HIV W MULTIPLE SIGNIFICANT HIV RELATED CONDITIONS,24,MULTIPLE SIGNIFICANT TRAUMA,3,Major,Major,Medical,Medicare,Medicaid,,,,Y,175055.14,32068.93
New York City,Bronx,7000006,001168,Montefiore Medical Center-Wakefield Hospital,30 to 49,,M,Black/African American,Not Span/Hispanic,5,Emergency,Left Against Medical Advice,2020,INF006,HIV INFECTION,CNS002,LUMBAR PUNCTURE,893,HIV W MULTIPLE SIGNIFICANT HIV RELATED CONDITIONS,24,MULTIPLE SIGNIFICANT TRAUMA,2,Moderate,Moderate,Medical,Medicaid,,,,,Y,106378.55,13903.3
Capital/Adirond,Schenectady,4601001,000829,Ellis Hospital,50 to 69,,F,White,Not Span/Hispanic,6,Emergency,Home or Self Care,2020,INF006,HIV INFECTION,,,893,HIV W MULTIPLE SIGNIFICANT HIV RELATED CONDITIONS,24,MULTIPLE SIGNIFICANT TRAUMA,2,Moderate,Moderate,Medical,Medicaid,Medicaid,,,,Y,37404.31,9425.93
New York City,Manhattan,7002032,001469,Mount Sinai Morningside,30 to 49,,M,Other Race,Spanish/Hispanic,7,Emergency,Home or Self Care,2020,DIG001,INTESTINAL INFECTION,ADM015,ADMINISTRATION OF ANTIBIOTICS,893,HIV W MULTIPLE SIGNIFICANT HIV RELATED CONDITIONS,24,MULTIPLE SIGNIFICANT TRAUMA,2,Moderate,Moderate,Medical,Blue Cross/Blue Shield,Self-Pay,,,,Y,90319.25,19974.6
New York City,Bronx,7000006,003058,Montefiore Med Center - Jack D Weiler Hosp of A Einstein College Div,30 to 49,,F,Black/African American,Not Span/Hispanic,7,Emergency,Home or Self Care,2020,INF006,HIV INFECTION,GIS001,ESOPHAGOGASTRODUODENOSCOPY (EGD) WITH BIOPSY,893,HIV W MULTIPLE SIGNIFICANT HIV RELATED CONDITIONS,24,MULTIPLE SIGNIFICANT TRAUMA,2,Moderate,Moderate,Medical,Medicaid,,,,,Y,106968.86,17651.93
New York City,Queens,7003003,001629,Jamaica Hospital Medical Center,50 to 69,,M,White,Spanish/Hispanic,6,Emergency,Home or Self Care,2020,INF006,HIV INFECTION,,,893,HIV W MULTIPLE SIGNIFICANT HIV RELATED CONDITIONS,24,MULTIPLE SIGNIFICANT TRAUMA,2,Moderate,Moderate,Medical,Medicaid,,,,,Y,21780,11248.8
Long Island,Nassau,2950002,000528,Nassau University Medical Center,50 to 69,,F,Black/African American,Not Span/Hispanic,6,Emergency,Home or Self Care,2020,RSP002,PNEUMONIA (EXCEPT THAT CAUSED BY TUBERCULOSIS),OTR004,ISOLATION PROCEDURES,893,HIV W MULTIPLE SIGNIFICANT HIV RELATED CONDITIONS,24,MULTIPLE SIGNIFICANT TRAUMA,3,Major,Major,Medical,Medicaid,Medicaid,Self-Pay,,,Y,51984.96,15818.17
New York City,Manhattan,7002054,001437,New York-Presbyterian/Lower Manhattan Hospital,30 to 49,,F,Black/African American,Not Span/Hispanic,1,Emergency,Home or Self Care,2020,INF006,HIV INFECTION,ADM015,ADMINISTRATION OF ANTIBIOTICS,893,HIV W MULTIPLE SIGNIFICANT HIV RELATED CONDITIONS,24,MULTIPLE SIGNIFICANT TRAUMA,2,Moderate,Minor,Medical,"Managed Care, Unspecified",Medicaid,Self-Pay,,,Y,21938.09,4381.13
New York City,Manhattan,7002024,001456,Mount Sinai Hospital,50 to 69,,F,Black/African American,Not Span/Hispanic,4,Emergency,Home w/ Home Health Services,2020,RSP002,PNEUMONIA (EXCEPT THAT CAUSED BY TUBERCULOSIS),OTR004,ISOLATION PROCEDURES,893,HIV W MULTIPLE SIGNIFICANT HIV RELATED CONDITIONS,24,MULTIPLE SIGNIFICANT TRAUMA,3,Major,Major,Medical,Medicare,Medicaid,Self-Pay,,,Y,54370.27,13498.12
Long Island,Suffolk,5154001,000925,Good Samaritan Hospital Medical Center,50 to 69,,M,Black/African American,Not Span/Hispanic,5,Emergency,Home w/ Home Health Services,2020,RSP002,PNEUMONIA (EXCEPT THAT CAUSED BY TUBERCULOSIS),,,893,HIV W MULTIPLE SIGNIFICANT HIV RELATED CONDITIONS,24,MULTIPLE SIGNIFICANT TRAUMA,3,Major,Major,Medical,Medicaid,,,,,Y,70895.16,10784.45