Hospital Service Area,Hospital County,Operating Certificate Number,Permanent Facility Id,Facility Name,Age Group,Zip Code - 3 digits,Gender,Race,Ethnicity,Length of Stay,Type of Admission,Patient Disposition,Discharge Year,CCS Diagnosis Code,CCS Diagnosis Description,CCS Procedure Code,CCS Procedure Description,APR DRG Code,APR DRG Description,APR MDC Code,APR MDC Description,APR Severity of Illness Code,APR Severity of Illness Description,APR Risk of Mortality,APR Medical Surgical Description,Payment Typology 1,Payment Typology 2,Payment Typology 3,Birth Weight,Abortion Edit Indicator,Emergency Department Indicator,Total Charges,Total Costs
New York City,Manhattan,7002001,001438,Bellevue Hospital Center,30 to 49,,M,Black/African American,Not Span/Hispanic,3,Emergency,Court/Law Enforcement,2020,RSP002,PNEUMONIA (EXCEPT THAT CAUSED BY TUBERCULOSIS),MAM007,ELECTROCARDIOGRAM (ECG),893,HIV W MULTIPLE SIGNIFICANT HIV RELATED CONDITIONS,24,MULTIPLE SIGNIFICANT TRAUMA,2,Moderate,Moderate,Medical,Medicaid,,,,,Y,25023.47,14390.6
New York City,Manhattan,7002001,001438,Bellevue Hospital Center,30 to 49,,F,Black/African American,Not Span/Hispanic,6,Emergency,Home or Self Care,2020,INF006,HIV INFECTION,IMG007,COMPUTERIZED TOMOGRAPHY (CT) WITHOUT CONTRAST,893,HIV W MULTIPLE SIGNIFICANT HIV RELATED CONDITIONS,24,MULTIPLE SIGNIFICANT TRAUMA,2,Moderate,Minor,Medical,Medicaid,,,,,Y,48206.84,27722.98
New York City,Manhattan,7002001,001438,Bellevue Hospital Center,30 to 49,,M,Black/African American,Not Span/Hispanic,3,Emergency,Home or Self Care,2020,RSP002,PNEUMONIA (EXCEPT THAT CAUSED BY TUBERCULOSIS),ADM015,ADMINISTRATION OF ANTIBIOTICS,893,HIV W MULTIPLE SIGNIFICANT HIV RELATED CONDITIONS,24,MULTIPLE SIGNIFICANT TRAUMA,3,Major,Moderate,Medical,Private Health Insurance,,,,,Y,29730.62,17097.6
New York City,Manhattan,7002001,001438,Bellevue Hospital Center,30 to 49,,F,Other Race,Spanish/Hispanic,6,Emergency,Home or Self Care,2020,RSP002,PNEUMONIA (EXCEPT THAT CAUSED BY TUBERCULOSIS),,,893,HIV W MULTIPLE SIGNIFICANT HIV RELATED CONDITIONS,24,MULTIPLE SIGNIFICANT TRAUMA,2,Moderate,Moderate,Medical,Medicaid,,,,,Y,44979.34,25866.9
New York City,Manhattan,7002001,001438,Bellevue Hospital Center,50 to 69,,M,Black/African American,Unknown,3,Emergency,Left Against Medical Advice,2020,INF006,HIV INFECTION,IMG006,COMPUTERIZED TOMOGRAPHY (CT) WITH CONTRAST,893,HIV W MULTIPLE SIGNIFICANT HIV RELATED CONDITIONS,24,MULTIPLE SIGNIFICANT TRAUMA,3,Major,Major,Medical,Medicare,,,,,Y,38106.46,21914.42
New York City,Manhattan,7002001,001438,Bellevue Hospital Center,50 to 69,,M,Black/African American,Not Span/Hispanic,15,Emergency,Home or Self Care,2020,INF006,HIV INFECTION,MST001,ARTHROCENTESIS,893,HIV W MULTIPLE SIGNIFICANT HIV RELATED CONDITIONS,24,MULTIPLE SIGNIFICANT TRAUMA,2,Moderate,Minor,Medical,Medicare,Medicaid,,,,Y,113230.87,65117.26
New York City,Manhattan,7002001,001438,Bellevue Hospital Center,30 to 49,,M,Other Race,Spanish/Hispanic,4,Urgent,Home or Self Care,2020,INF012,CORONAVIRUS DISEASE 2019 (COVID-19),MAM010,OTHER CARDIOVASCULAR SYSTEM MEASUREMENT AND MONITORING,893,HIV W MULTIPLE SIGNIFICANT HIV RELATED CONDITIONS,24,MULTIPLE SIGNIFICANT TRAUMA,3,Major,Moderate,Medical,Medicaid,,,,,N,24792.64,14257.85
New York City,Manhattan,7002001,001438,Bellevue Hospital Center,50 to 69,,M,Black/African American,Not Span/Hispanic,4,Emergency,Home or Self Care,2020,RSP002,PNEUMONIA (EXCEPT THAT CAUSED BY TUBERCULOSIS),ADM015,ADMINISTRATION OF ANTIBIOTICS,893,HIV W MULTIPLE SIGNIFICANT HIV RELATED CONDITIONS,24,MULTIPLE SIGNIFICANT TRAUMA,3,Major,Moderate,Medical,Medicaid,,,,,Y,32797.39,18861.25
New York City,Manhattan,7002001,001438,Bellevue Hospital Center,50 to 69,,M,Black/African American,Not Span/Hispanic,2,Emergency,Home or Self Care,2020,INF006,HIV INFECTION,ADM021,"ADMINISTRATION OF THERAPEUTIC SUBSTANCES, NEC",893,HIV W MULTIPLE SIGNIFICANT HIV RELATED CONDITIONS,24,MULTIPLE SIGNIFICANT TRAUMA,2,Moderate,Moderate,Medical,Medicaid,,,,,Y,20469.94,11771.93
New York City,Manhattan,7002001,001438,Bellevue Hospital Center,30 to 49,,M,Other Race,Spanish/Hispanic,5,Emergency,Home or Self Care,2020,INF006,HIV INFECTION,IMG009,PLAIN RADIOGRAPHY,893,HIV W MULTIPLE SIGNIFICANT HIV RELATED CONDITIONS,24,MULTIPLE SIGNIFICANT TRAUMA,2,Moderate,Moderate,Medical,Medicaid,,,,,Y,116784.32,67160.79
New York City,Manhattan,7002001,001438,Bellevue Hospital Center,30 to 49,,F,Other Race,Spanish/Hispanic,7,Emergency,Home or Self Care,2020,INF006,HIV INFECTION,ADM015,ADMINISTRATION OF ANTIBIOTICS,893,HIV W MULTIPLE SIGNIFICANT HIV RELATED CONDITIONS,24,MULTIPLE SIGNIFICANT TRAUMA,2,Moderate,Moderate,Medical,Medicaid,,,,,Y,53878.69,30984.77
New York City,Manhattan,7002001,001438,Bellevue Hospital Center,50 to 69,,M,White,Not Span/Hispanic,1,Emergency,Home or Self Care,2020,RSP002,PNEUMONIA (EXCEPT THAT CAUSED BY TUBERCULOSIS),ADM015,ADMINISTRATION OF ANTIBIOTICS,893,HIV W MULTIPLE SIGNIFICANT HIV RELATED CONDITIONS,24,MULTIPLE SIGNIFICANT TRAUMA,2,Moderate,Moderate,Medical,Medicaid,,,,,Y,12543.15,7213.36
New York City,Manhattan,7002001,001438,Bellevue Hospital Center,30 to 49,,F,Other Race,Spanish/Hispanic,5,Emergency,Left Against Medical Advice,2020,DIG004,ESOPHAGEAL DISORDERS,ADM021,"ADMINISTRATION OF THERAPEUTIC SUBSTANCES, NEC",893,HIV W MULTIPLE SIGNIFICANT HIV RELATED CONDITIONS,24,MULTIPLE SIGNIFICANT TRAUMA,2,Moderate,Major,Medical,Medicaid,,,,,Y,43906.05,25249.67
New York City,Manhattan,7002001,001438,Bellevue Hospital Center,30 to 49,,M,Other Race,Spanish/Hispanic,17,Emergency,Court/Law Enforcement,2020,INF006,HIV INFECTION,MST001,ARTHROCENTESIS,893,HIV W MULTIPLE SIGNIFICANT HIV RELATED CONDITIONS,24,MULTIPLE SIGNIFICANT TRAUMA,2,Moderate,Minor,Medical,Medicaid,,,,,Y,130058.5,74794.56
New York City,Manhattan,7002001,001438,Bellevue Hospital Center,50 to 69,,M,Black/African American,Not Span/Hispanic,6,Emergency,Court/Law Enforcement,2020,INF012,CORONAVIRUS DISEASE 2019 (COVID-19),ADM015,ADMINISTRATION OF ANTIBIOTICS,893,HIV W MULTIPLE SIGNIFICANT HIV RELATED CONDITIONS,24,MULTIPLE SIGNIFICANT TRAUMA,3,Major,Major,Medical,Medicaid,,,,,Y,45930.85,26414.1
