Hospital Service Area,Hospital County,Operating Certificate Number,Permanent Facility Id,Facility Name,Age Group,Zip Code - 3 digits,Gender,Race,Ethnicity,Length of Stay,Type of Admission,Patient Disposition,Discharge Year,CCS Diagnosis Code,CCS Diagnosis Description,CCS Procedure Code,CCS Procedure Description,APR DRG Code,APR DRG Description,APR MDC Code,APR MDC Description,APR Severity of Illness Code,APR Severity of Illness Description,APR Risk of Mortality,APR Medical Surgical Description,Payment Typology 1,Payment Typology 2,Payment Typology 3,Birth Weight,Abortion Edit Indicator,Emergency Department Indicator,Total Charges,Total Costs
Capital/Adirond,Columbia,1001000,000146,Columbia Memorial Hospital,50 to 69,,M,White,Not Span/Hispanic,1,Elective,Expired,2019,INF006,HIV INFECTION,,,894,HIV W ONE SIGNIF HIV COND OR W/O SIGNIF RELATED COND,24,MULTIPLE SIGNIFICANT TRAUMA,2,Moderate,Moderate,Medical,Medicare,,,,,true,7118.02,1843.36
Long Island,Suffolk,5154001,000925,Good Samaritan Hospital Medical Center,50 to 69,,F,Other Race,Spanish/Hispanic,8,Emergency,Skilled Nursing Home,2019,SKN001,SKIN AND SUBCUTANEOUS TISSUE INFECTIONS,SKB008,SKIN EXCISION AND DEBRIDEMENT,894,HIV W ONE SIGNIF HIV COND OR W/O SIGNIF RELATED COND,24,MULTIPLE SIGNIFICANT TRAUMA,2,Moderate,Minor,Medical,Medicare,Medicare,Medicaid,,,true,58177,12118.36
New York City,Manhattan,7002001,001438,Bellevue Hospital Center,30 to 49,,M,Black/African American,Not Span/Hispanic,2,Emergency,Home or Self Care,2019,INF006,HIV INFECTION,,,894,HIV W ONE SIGNIF HIV COND OR W/O SIGNIF RELATED COND,24,MULTIPLE SIGNIFICANT TRAUMA,2,Moderate,Minor,Medical,Private Health Insurance,Medicaid,,,,true,13254.8,8809.14
New York City,Kings,7001020,001305,Maimonides Medical Center,0 to 17,,F,White,Not Span/Hispanic,2,Emergency,Home or Self Care,2019,BLD006,COAGULATION AND HEMORRHAGIC DISORDERS,ADM003,ADMINISTRATION OF ALBUMIN AND GLOBULIN,894,HIV W ONE SIGNIF HIV COND OR W/O SIGNIF RELATED COND,24,MULTIPLE SIGNIFICANT TRAUMA,2,Moderate,Minor,Medical,Medicaid,Self-Pay,,,,true,21769,8007.76
New York City,Manhattan,7002054,003975,New York Presbyterian Hospital - Allen Hospital,50 to 69,,F,Multi-racial,Not Span/Hispanic,2,Emergency,Home or Self Care,2019,INF006,HIV INFECTION,,,894,HIV W ONE SIGNIF HIV COND OR W/O SIGNIF RELATED COND,24,MULTIPLE SIGNIFICANT TRAUMA,2,Moderate,Minor,Medical,Medicaid,Medicaid,Self-Pay,,,true,30138.34,6495.79
New York City,Bronx,7000001,001178,BronxCare Hospital Center,30 to 49,,F,Other Race,Spanish/Hispanic,2,Emergency,Home or Self Care,2019,BLD001,NUTRITIONAL ANEMIA,ADM001,TRANSFUSION OF BLOOD AND BLOOD PRODUCTS,894,HIV W ONE SIGNIF HIV COND OR W/O SIGNIF RELATED COND,24,MULTIPLE SIGNIFICANT TRAUMA,2,Moderate,Minor,Medical,Medicaid,Medicaid,,,,true,13951.67,13089
New York City,Kings,7001003,001288,Brooklyn Hospital Center - Downtown Campus,50 to 69,,M,Black/African American,Not Span/Hispanic,2,Emergency,Home or Self Care,2019,CIR020,CEREBRAL INFARCTION,,,894,HIV W ONE SIGNIF HIV COND OR W/O SIGNIF RELATED COND,24,MULTIPLE SIGNIFICANT TRAUMA,3,Major,Major,Medical,Medicare,Self-Pay,,,,true,56739.86,10659.25
New York City,Manhattan,7002001,001438,Bellevue Hospital Center,18 to 29,,M,Other Race,Not Span/Hispanic,2,Emergency,Home or Self Care,2019,DIG016,PERITONITIS AND INTRA-ABDOMINAL ABSCESS,ADM015,ADMINISTRATION OF ANTIBIOTICS,894,HIV W ONE SIGNIF HIV COND OR W/O SIGNIF RELATED COND,24,MULTIPLE SIGNIFICANT TRAUMA,2,Moderate,Minor,Medical,Medicaid,Medicaid,,,,true,15576.99,10352.47
New York City,Manhattan,7002032,001469,Mount Sinai Morningside,30 to 49,,M,Other Race,Spanish/Hispanic,2,Emergency,Home or Self Care,2019,SKN001,SKIN AND SUBCUTANEOUS TISSUE INFECTIONS,ADM015,ADMINISTRATION OF ANTIBIOTICS,894,HIV W ONE SIGNIF HIV COND OR W/O SIGNIF RELATED COND,24,MULTIPLE SIGNIFICANT TRAUMA,2,Moderate,Minor,Medical,Medicaid,Self-Pay,,,,true,32209.58,8523.43
New York City,Manhattan,7002017,001450,Lenox Hill Hospital,30 to 49,,M,Black/African American,Not Span/Hispanic,1,Emergency,Home or Self Care,2019,INF006,HIV INFECTION,,,894,HIV W ONE SIGNIF HIV COND OR W/O SIGNIF RELATED COND,24,MULTIPLE SIGNIFICANT TRAUMA,2,Moderate,Minor,Medical,Medicaid,Medicaid,,,,true,20407.12,2636.4
New York City,Bronx,7000008,001172,Lincoln Medical & Mental Health Center,30 to 49,,M,Black/African American,Not Span/Hispanic,3,Emergency,Home or Self Care,2019,SKN001,SKIN AND SUBCUTANEOUS TISSUE INFECTIONS,MST004,INCISION AND DRAINAGE OF MUSCULOSKELETAL TISSUE AND JOINTS,894,HIV W ONE SIGNIF HIV COND OR W/O SIGNIF RELATED COND,24,MULTIPLE SIGNIFICANT TRAUMA,1,Minor,Minor,Medical,Blue Cross/Blue Shield,Medicaid,Medicaid,,,true,21880.79,12921.85
New York City,Richmond,7004003,001737,Staten Island University Hospital Prince's Bay,50 to 69,,M,Black/African American,Not Span/Hispanic,2,Elective,Home or Self Care,2019,INF006,HIV INFECTION,MAM011,ELECTROENCEPHALOGRAM (EEG),894,HIV W ONE SIGNIF HIV COND OR W/O SIGNIF RELATED COND,24,MULTIPLE SIGNIFICANT TRAUMA,2,Moderate,Minor,Medical,Medicare,Medicaid,,,,false,23027.32,4625.46
New York City,Queens,7003010,001637,New York - Presbyterian/Queens,18 to 29,,M,White,Not Span/Hispanic,1,Emergency,Home or Self Care,2019,SKN001,SKIN AND SUBCUTANEOUS TISSUE INFECTIONS,MST005,INCISION AND DRAINAGE OF SUBCUTANEOUS TISSUE AND FASCIA,894,HIV W ONE SIGNIF HIV COND OR W/O SIGNIF RELATED COND,24,MULTIPLE SIGNIFICANT TRAUMA,1,Minor,Minor,Medical,"Managed Care, Unspecified",Medicaid,Self-Pay,,,true,12747.84,3063.29
New York City,Manhattan,7002021,001454,Metropolitan Hospital Center,30 to 49,,F,Black/African American,Not Span/Hispanic,6,Emergency,Home or Self Care,2019,RSP002,PNEUMONIA (EXCEPT THAT CAUSED BY TUBERCULOSIS),ADM015,ADMINISTRATION OF ANTIBIOTICS,894,HIV W ONE SIGNIF HIV COND OR W/O SIGNIF RELATED COND,24,MULTIPLE SIGNIFICANT TRAUMA,2,Moderate,Moderate,Medical,Medicaid,Medicaid,,,,true,33337.75,26935.24
New York City,Kings,7001021,001306,New York - Presbyterian Brooklyn Methodist Hospital,50 to 69,,F,Black/African American,Not Span/Hispanic,15,Elective,Home w/ Home Health Services,2019,INF006,HIV INFECTION,FRS001,HYSTERECTOMY,894,HIV W ONE SIGNIF HIV COND OR W/O SIGNIF RELATED COND,24,MULTIPLE SIGNIFICANT TRAUMA,3,Major,Moderate,Medical,Medicare,Medicare,Self-Pay,,,false,130386.48,38799.74
New York City,Manhattan,7002054,001458,New York-Presbyterian Hospital - New York Weill Cornell Center,30 to 49,,F,Black/African American,Not Span/Hispanic,4,Emergency,Home or Self Care,2019,DIG001,INTESTINAL INFECTION,,,894,HIV W ONE SIGNIF HIV COND OR W/O SIGNIF RELATED COND,24,MULTIPLE SIGNIFICANT TRAUMA,3,Major,Minor,Medical,"Managed Care, Unspecified",Medicaid,Self-Pay,,,true,57053.23,12674.47
New York City,Kings,7001021,001306,New York - Presbyterian Brooklyn Methodist Hospital,50 to 69,,F,White,Spanish/Hispanic,6,Emergency,Home or Self Care,2019,INF006,HIV INFECTION,CAR024,VENOUS AND ARTERIAL CATHETER PLACEMENT,894,HIV W ONE SIGNIF HIV COND OR W/O SIGNIF RELATED COND,24,MULTIPLE SIGNIFICANT TRAUMA,3,Major,Moderate,Medical,Medicaid,Self-Pay,,,,true,37498.93,9981.95
New York City,Manhattan,7002054,001464,New York-Presbyterian Hospital - Columbia Presbyterian Center,50 to 69,,F,White,Spanish/Hispanic,2,Emergency,Home or Self Care,2019,INF006,HIV INFECTION,,,894,HIV W ONE SIGNIF HIV COND OR W/O SIGNIF RELATED COND,24,MULTIPLE SIGNIFICANT TRAUMA,2,Moderate,Minor,Medical,Medicaid,Medicaid,Self-Pay,,,true,23397.85,5521.07
Capital/Adirond,Albany,0101000,000001,Albany Medical Center Hospital,30 to 49,,F,Black/African American,Not Span/Hispanic,2,Emergency,Home w/ Home Health Services,2019,SKN001,SKIN AND SUBCUTANEOUS TISSUE INFECTIONS,MST004,INCISION AND DRAINAGE OF MUSCULOSKELETAL TISSUE AND JOINTS,894,HIV W ONE SIGNIF HIV COND OR W/O SIGNIF RELATED COND,24,MULTIPLE SIGNIFICANT TRAUMA,2,Moderate,Moderate,Medical,"Managed Care, Unspecified",,,,,true,19651.59,6490.59
Southern Tier,Broome,0303001,000058,United Health Services Hospitals Inc. - Wilson Medical Center,50 to 69,,M,Black/African American,Not Span/Hispanic,5,Emergency,Left Against Medical Advice,2019,MUS002,OSTEOMYELITIS,IMG005,MAGNETIC RESONANCE IMAGING (MRI),894,HIV W ONE SIGNIF HIV COND OR W/O SIGNIF RELATED COND,24,MULTIPLE SIGNIFICANT TRAUMA,4,Extreme,Moderate,Medical,Medicaid,Medicaid,,,,true,24702,9820.34
New York City,Queens,7001024,001635,St Johns Episcopal Hospital So Shore,50 to 69,,F,Black/African American,Not Span/Hispanic,2,Emergency,Home or Self Care,2019,INF006,HIV INFECTION,,,894,HIV W ONE SIGNIF HIV COND OR W/O SIGNIF RELATED COND,24,MULTIPLE SIGNIFICANT TRAUMA,2,Moderate,Minor,Medical,Medicaid,,,,,true,19967.72,5273.91
,,,,Redacted for Confidentiality,18 to 29,,F,Multi-racial,Spanish/Hispanic,2,Emergency,Home or Self Care,2019,INF006,HIV INFECTION,,,894,HIV W ONE SIGNIF HIV COND OR W/O SIGNIF RELATED COND,24,MULTIPLE SIGNIFICANT TRAUMA,2,Moderate,Minor,Medical,Medicare,Medicaid,,,,true,30932.84,5321.16
Central NY,Onondaga,3301007,000635,University Hospital SUNY Health Science Center,30 to 49,,F,White,Not Span/Hispanic,2,Emergency,Left Against Medical Advice,2019,INF006,HIV INFECTION,,,894,HIV W ONE SIGNIF HIV COND OR W/O SIGNIF RELATED COND,24,MULTIPLE SIGNIFICANT TRAUMA,2,Moderate,Minor,Medical,Federal/State/Local/VA,,,,,true,12976,3722.3
New York City,Kings,7002002,001324,Mount Sinai Brooklyn,50 to 69,,M,Other Race,Unknown,1,Emergency,Home or Self Care,2019,DIG016,PERITONITIS AND INTRA-ABDOMINAL ABSCESS,GIS007,GI SYSTEM DRAINAGE (EXCLUDING PARACENTESIS),894,HIV W ONE SIGNIF HIV COND OR W/O SIGNIF RELATED COND,24,MULTIPLE SIGNIFICANT TRAUMA,2,Moderate,Minor,Medical,Medicare,Medicaid,Self-Pay,,,false,27517.7,5212.77
New York City,Manhattan,7002002,001439,Mount Sinai Beth Israel,50 to 69,,M,White,Unknown,3,Emergency,Home or Self Care,2019,INF006,HIV INFECTION,,,894,HIV W ONE SIGNIF HIV COND OR W/O SIGNIF RELATED COND,24,MULTIPLE SIGNIFICANT TRAUMA,2,Moderate,Minor,Medical,Private Health Insurance,Self-Pay,,,,true,42836.63,7636.78
New York City,Manhattan,7002054,001458,New York-Presbyterian Hospital - New York Weill Cornell Center,70 or Older,,M,White,Not Span/Hispanic,1,Emergency,Home or Self Care,2019,CIR020,CEREBRAL INFARCTION,,,894,HIV W ONE SIGNIF HIV COND OR W/O SIGNIF RELATED COND,24,MULTIPLE SIGNIFICANT TRAUMA,3,Major,Major,Medical,Medicare,Blue Cross/Blue Shield,Self-Pay,,,true,36500.27,12098.76
New York City,Manhattan,7002002,001439,Mount Sinai Beth Israel,30 to 49,,M,Other Race,Spanish/Hispanic,4,Emergency,Home or Self Care,2019,SKN001,SKIN AND SUBCUTANEOUS TISSUE INFECTIONS,SKB008,SKIN EXCISION AND DEBRIDEMENT,894,HIV W ONE SIGNIF HIV COND OR W/O SIGNIF RELATED COND,24,MULTIPLE SIGNIFICANT TRAUMA,3,Major,Minor,Medical,Medicaid,Medicaid,Self-Pay,,,true,47891.07,9941.87
New York City,Manhattan,7002002,001439,Mount Sinai Beth Israel,50 to 69,,F,Other Race,Unknown,4,Emergency,Home w/ Home Health Services,2019,INF006,HIV INFECTION,MAM011,ELECTROENCEPHALOGRAM (EEG),894,HIV W ONE SIGNIF HIV COND OR W/O SIGNIF RELATED COND,24,MULTIPLE SIGNIFICANT TRAUMA,3,Major,Minor,Medical,Medicaid,Self-Pay,,,,true,51252.32,18676.57
New York City,Bronx,7000006,003058,Montefiore Med Center - Jack D Weiler Hosp of A Einstein College Div,50 to 69,,F,Black/African American,Not Span/Hispanic,2,Emergency,Home or Self Care,2019,INF006,HIV INFECTION,,,894,HIV W ONE SIGNIF HIV COND OR W/O SIGNIF RELATED COND,24,MULTIPLE SIGNIFICANT TRAUMA,2,Moderate,Moderate,Medical,Private Health Insurance,,,,,true,24905.67,4185.33
New York City,Bronx,7000006,001169,Montefiore Medical Center - Henry & Lucy Moses Div,50 to 69,,F,Black/African American,Not Span/Hispanic,4,Emergency,Home w/ Home Health Services,2019,DIG001,INTESTINAL INFECTION,ADM021,"ADMINISTRATION OF THERAPEUTIC SUBSTANCES, NEC",894,HIV W ONE SIGNIF HIV COND OR W/O SIGNIF RELATED COND,24,MULTIPLE SIGNIFICANT TRAUMA,2,Moderate,Moderate,Medical,Medicaid,,,,,true,51573.91,10285.37
New York City,Bronx,7000014,001176,SBH Health System,18 to 29,,F,Black/African American,Not Span/Hispanic,10,Emergency,Home or Self Care,2019,INF006,HIV INFECTION,ADM016,ADMINISTRATION OF ANTI-INFLAMMATORY AGENTS,894,HIV W ONE SIGNIF HIV COND OR W/O SIGNIF RELATED COND,24,MULTIPLE SIGNIFICANT TRAUMA,2,Moderate,Minor,Medical,Medicaid,Medicaid,,,,true,48355.17,15008.64
Finger Lakes,Monroe,2701005,000413,Strong Memorial Hospital,50 to 69,,M,Black/African American,Not Span/Hispanic,3,Emergency,Home or Self Care,2019,SKN001,SKIN AND SUBCUTANEOUS TISSUE INFECTIONS,SKB002,INCISION AND DRAINAGE OF SKIN,894,HIV W ONE SIGNIF HIV COND OR W/O SIGNIF RELATED COND,24,MULTIPLE SIGNIFICANT TRAUMA,1,Minor,Minor,Medical,Medicaid,,,,,true,12671.35,5136.8
New York City,Manhattan,7002054,001464,New York-Presbyterian Hospital - Columbia Presbyterian Center,30 to 49,,M,Other Race,Multi-ethnic,1,Emergency,Left Against Medical Advice,2019,RSP002,PNEUMONIA (EXCEPT THAT CAUSED BY TUBERCULOSIS),,,894,HIV W ONE SIGNIF HIV COND OR W/O SIGNIF RELATED COND,24,MULTIPLE SIGNIFICANT TRAUMA,2,Moderate,Minor,Medical,Medicaid,Medicaid,Self-Pay,,,true,22746.16,4827.28
New York City,Bronx,7000002,001165,Jacobi Medical Center,50 to 69,,F,Other Race,Not Span/Hispanic,2,Emergency,Home w/ Home Health Services,2019,END011,FLUID AND ELECTROLYTE DISORDERS,,,894,HIV W ONE SIGNIF HIV COND OR W/O SIGNIF RELATED COND,24,MULTIPLE SIGNIFICANT TRAUMA,3,Major,Minor,Medical,Medicaid,,,,,true,15801.44,9348.92
New York City,Bronx,7000002,001165,Jacobi Medical Center,18 to 29,,F,Other Race,Not Span/Hispanic,2,Emergency,Home or Self Care,2019,RSP002,PNEUMONIA (EXCEPT THAT CAUSED BY TUBERCULOSIS),ADM015,ADMINISTRATION OF ANTIBIOTICS,894,HIV W ONE SIGNIF HIV COND OR W/O SIGNIF RELATED COND,24,MULTIPLE SIGNIFICANT TRAUMA,2,Moderate,Minor,Medical,Blue Cross/Blue Shield,,,,,true,13196.18,7807.52
New York City,Bronx,7000001,001178,BronxCare Hospital Center,50 to 69,,M,White,Spanish/Hispanic,3,Emergency,Home or Self Care,2019,INF010,SEXUALLY TRANSMITTED INFECTIONS (EXCLUDING HIV AND HEPATITIS),,,894,HIV W ONE SIGNIF HIV COND OR W/O SIGNIF RELATED COND,24,MULTIPLE SIGNIFICANT TRAUMA,3,Major,Moderate,Medical,Medicaid,,,,,true,11802.14,14057.69
New York City,Manhattan,7002054,001458,New York-Presbyterian Hospital - New York Weill Cornell Center,18 to 29,,M,Black/African American,Not Span/Hispanic,7,Emergency,Home or Self Care,2019,INF006,HIV INFECTION,,,894,HIV W ONE SIGNIF HIV COND OR W/O SIGNIF RELATED COND,24,MULTIPLE SIGNIFICANT TRAUMA,2,Moderate,Moderate,Medical,"Managed Care, Unspecified",Medicaid,Self-Pay,,,false,71899.78,16120.09
New York City,Kings,7001035,001318,Wyckoff Heights Medical Center,30 to 49,,M,Other Race,Not Span/Hispanic,2,Emergency,Home or Self Care,2019,SKN001,SKIN AND SUBCUTANEOUS TISSUE INFECTIONS,,,894,HIV W ONE SIGNIF HIV COND OR W/O SIGNIF RELATED COND,24,MULTIPLE SIGNIFICANT TRAUMA,1,Minor,Minor,Medical,Medicaid,Miscellaneous/Other,,,,true,13534.15,5257.65
New York City,Bronx,7000024,001186,North Central Bronx Hospital,30 to 49,,M,Black/African American,Not Span/Hispanic,2,Emergency,Home or Self Care,2019,DIG016,PERITONITIS AND INTRA-ABDOMINAL ABSCESS,GIS003,GI SYSTEM BIOPSY (NON-ENDOSCOPIC),894,HIV W ONE SIGNIF HIV COND OR W/O SIGNIF RELATED COND,24,MULTIPLE SIGNIFICANT TRAUMA,1,Minor,Minor,Medical,Medicaid,Medicaid,,,,true,16302.7,9786.66
New York City,Bronx,7000014,001176,SBH Health System,50 to 69,,M,Black/African American,Not Span/Hispanic,12,Emergency,Skilled Nursing Home,2019,INF006,HIV INFECTION,ADM016,ADMINISTRATION OF ANTI-INFLAMMATORY AGENTS,894,HIV W ONE SIGNIF HIV COND OR W/O SIGNIF RELATED COND,24,MULTIPLE SIGNIFICANT TRAUMA,2,Moderate,Minor,Medical,Medicaid,Medicaid,,,,true,72798.44,20078.91
New York City,Bronx,7000006,001168,Montefiore Medical Center-Wakefield Hospital,18 to 29,,M,Other Race,Spanish/Hispanic,3,Emergency,Home or Self Care,2019,DIG001,INTESTINAL INFECTION,OTR004,ISOLATION PROCEDURES,894,HIV W ONE SIGNIF HIV COND OR W/O SIGNIF RELATED COND,24,MULTIPLE SIGNIFICANT TRAUMA,2,Moderate,Minor,Medical,Medicaid,,,,,true,47633.41,7566.32
Finger Lakes,Monroe,2701005,000413,Strong Memorial Hospital,50 to 69,,M,White,Unknown,1,Elective,Home or Self Care,2019,SYM016,OTHER GENERAL SIGNS AND SYMPTOMS,GNR009,"RETROPERITONEAL PROCEDURES, NEC",894,HIV W ONE SIGNIF HIV COND OR W/O SIGNIF RELATED COND,24,MULTIPLE SIGNIFICANT TRAUMA,1,Minor,Minor,Medical,Medicaid,,,,,false,24920.14,11916.28
New York City,Richmond,7004003,001740,Staten Island University Hosp-North,50 to 69,,M,Black/African American,Not Span/Hispanic,6,Emergency,Home w/ Home Health Services,2019,NVS009,EPILEPSY; CONVULSIONS,CNS002,LUMBAR PUNCTURE,894,HIV W ONE SIGNIF HIV COND OR W/O SIGNIF RELATED COND,24,MULTIPLE SIGNIFICANT TRAUMA,3,Major,Major,Medical,Medicare,Medicaid,,,,true,47067.07,10960.13
New York City,Kings,7001016,001301,Kings County Hospital Center,50 to 69,,M,Black/African American,Not Span/Hispanic,8,Emergency,Home or Self Care,2019,MUS002,OSTEOMYELITIS,MST003,"SUBCUTANEOUS TISSUE, FASCIA, AND MUSCLE BIOPSY",894,HIV W ONE SIGNIF HIV COND OR W/O SIGNIF RELATED COND,24,MULTIPLE SIGNIFICANT TRAUMA,2,Moderate,Minor,Medical,Medicare,Medicare,Medicaid,,,true,42883.71,30462.92
Western NY,Erie,1401005,000210,Erie County Medical Center,30 to 49,,F,Black/African American,Not Span/Hispanic,6,Emergency,Left Against Medical Advice,2019,INF006,HIV INFECTION,,,894,HIV W ONE SIGNIF HIV COND OR W/O SIGNIF RELATED COND,24,MULTIPLE SIGNIFICANT TRAUMA,2,Moderate,Minor,Medical,Medicaid,Medicaid,,,,true,16636.62,10690.46
Finger Lakes,Monroe,2701005,000413,Strong Memorial Hospital,50 to 69,,M,Black/African American,Not Span/Hispanic,2,Emergency,Home or Self Care,2019,DIG001,INTESTINAL INFECTION,,,894,HIV W ONE SIGNIF HIV COND OR W/O SIGNIF RELATED COND,24,MULTIPLE SIGNIFICANT TRAUMA,3,Major,Minor,Medical,Medicare,Medicaid,,,,true,10647.92,4043.33
New York City,Bronx,7000001,001178,BronxCare Hospital Center,70 or Older,,F,Black/African American,Not Span/Hispanic,3,Emergency,Home or Self Care,2019,BLD001,NUTRITIONAL ANEMIA,ADM001,TRANSFUSION OF BLOOD AND BLOOD PRODUCTS,894,HIV W ONE SIGNIF HIV COND OR W/O SIGNIF RELATED COND,24,MULTIPLE SIGNIFICANT TRAUMA,2,Moderate,Moderate,Medical,Medicare,Medicaid,,,,true,14780.66,15557.78
Capital/Adirond,Schenectady,4601001,000829,Ellis Hospital,30 to 49,,M,White,Not Span/Hispanic,3,Emergency,Home or Self Care,2019,DIG022,NONINFECTIOUS GASTROENTERITIS,GIS002,COLONOSCOPY AND PROCTOSCOPY WITH BIOPSY,894,HIV W ONE SIGNIF HIV COND OR W/O SIGNIF RELATED COND,24,MULTIPLE SIGNIFICANT TRAUMA,2,Moderate,Minor,Medical,Medicaid,Medicaid,,,,true,23390.55,6552.82
New York City,Queens,7003003,001629,Jamaica Hospital Medical Center,50 to 69,,M,White,Spanish/Hispanic,3,Urgent,Home or Self Care,2019,INF010,SEXUALLY TRANSMITTED INFECTIONS (EXCLUDING HIV AND HEPATITIS),CAR024,VENOUS AND ARTERIAL CATHETER PLACEMENT,894,HIV W ONE SIGNIF HIV COND OR W/O SIGNIF RELATED COND,24,MULTIPLE SIGNIFICANT TRAUMA,2,Moderate,Minor,Medical,Medicaid,,,,,false,13230,6751.78
New York City,Bronx,7000001,001178,BronxCare Hospital Center,50 to 69,,F,Other Race,Spanish/Hispanic,2,Emergency,Left Against Medical Advice,2019,SKN001,SKIN AND SUBCUTANEOUS TISSUE INFECTIONS,,,894,HIV W ONE SIGNIF HIV COND OR W/O SIGNIF RELATED COND,24,MULTIPLE SIGNIFICANT TRAUMA,2,Moderate,Minor,Medical,Medicaid,Medicaid,,,,true,8077.64,9648.92
New York City,Bronx,7000014,001176,SBH Health System,30 to 49,,M,White,Not Span/Hispanic,1,Emergency,Left Against Medical Advice,2019,SKN001,SKIN AND SUBCUTANEOUS TISSUE INFECTIONS,SKB002,INCISION AND DRAINAGE OF SKIN,894,HIV W ONE SIGNIF HIV COND OR W/O SIGNIF RELATED COND,24,MULTIPLE SIGNIFICANT TRAUMA,1,Minor,Minor,Medical,Medicaid,,,,,true,8925.61,2661.6
Finger Lakes,Monroe,2754001,000471,The Unity Hospital of Rochester,50 to 69,,F,White,Not Span/Hispanic,2,Emergency,Home or Self Care,2019,RSP002,PNEUMONIA (EXCEPT THAT CAUSED BY TUBERCULOSIS),,,894,HIV W ONE SIGNIF HIV COND OR W/O SIGNIF RELATED COND,24,MULTIPLE SIGNIFICANT TRAUMA,2,Moderate,Minor,Medical,Medicare,Medicaid,,,,true,8412.43,5085.64
New York City,Bronx,7000014,001176,SBH Health System,50 to 69,,M,Black/African American,Spanish/Hispanic,3,Emergency,Home or Self Care,2019,DIG022,NONINFECTIOUS GASTROENTERITIS,,,894,HIV W ONE SIGNIF HIV COND OR W/O SIGNIF RELATED COND,24,MULTIPLE SIGNIFICANT TRAUMA,3,Major,Major,Medical,Medicaid,,,,,true,24893.07,7580.12
New York City,Kings,7001002,001286,Brookdale Hospital Medical Center,30 to 49,,M,Black/African American,Unknown,5,Emergency,Left Against Medical Advice,2019,INF006,HIV INFECTION,,,894,HIV W ONE SIGNIF HIV COND OR W/O SIGNIF RELATED COND,24,MULTIPLE SIGNIFICANT TRAUMA,2,Moderate,Minor,Medical,Medicaid,,,,,false,20183.81,10251.92
New York City,Bronx,7000014,001176,SBH Health System,30 to 49,,M,Black/African American,Spanish/Hispanic,7,Emergency,Home or Self Care,2019,INF006,HIV INFECTION,RES001,BRONCHOSCOPY (DIAGNOSTIC),894,HIV W ONE SIGNIF HIV COND OR W/O SIGNIF RELATED COND,24,MULTIPLE SIGNIFICANT TRAUMA,2,Moderate,Minor,Medical,Blue Cross/Blue Shield,Medicaid,,,,true,47983.91,16605.66
New York City,Manhattan,7002054,001464,New York-Presbyterian Hospital - Columbia Presbyterian Center,50 to 69,,F,Multi-racial,Multi-ethnic,5,Emergency,Home or Self Care,2019,INF008,VIRAL INFECTION,CNS002,LUMBAR PUNCTURE,894,HIV W ONE SIGNIF HIV COND OR W/O SIGNIF RELATED COND,24,MULTIPLE SIGNIFICANT TRAUMA,2,Moderate,Moderate,Medical,Medicaid,Medicaid,Self-Pay,,,true,73623.85,16338.27
New York City,Manhattan,7002054,001464,New York-Presbyterian Hospital - Columbia Presbyterian Center,50 to 69,,F,Multi-racial,Multi-ethnic,1,Emergency,Left Against Medical Advice,2019,INF006,HIV INFECTION,,,894,HIV W ONE SIGNIF HIV COND OR W/O SIGNIF RELATED COND,24,MULTIPLE SIGNIFICANT TRAUMA,2,Moderate,Minor,Medical,Medicaid,Medicaid,Self-Pay,,,true,18740.54,4396.79
New York City,Kings,7002053,001304,NYU Langone Hospital-Brooklyn,30 to 49,,F,White,Spanish/Hispanic,3,Emergency,Home or Self Care,2019,DIG001,INTESTINAL INFECTION,,,894,HIV W ONE SIGNIF HIV COND OR W/O SIGNIF RELATED COND,24,MULTIPLE SIGNIFICANT TRAUMA,2,Moderate,Minor,Medical,Medicaid,,,,,true,71691.77,16231.59
New York City,Manhattan,7002054,001464,New York-Presbyterian Hospital - Columbia Presbyterian Center,70 or Older,,M,White,Not Span/Hispanic,5,Emergency,Skilled Nursing Home,2019,MUS001,INFECTIVE ARTHRITIS,CAR024,VENOUS AND ARTERIAL CATHETER PLACEMENT,894,HIV W ONE SIGNIF HIV COND OR W/O SIGNIF RELATED COND,24,MULTIPLE SIGNIFICANT TRAUMA,3,Major,Moderate,Medical,Medicare,Medicaid,Self-Pay,,,true,65757.01,15718.54
New York City,Bronx,7000014,001176,SBH Health System,50 to 69,,F,Black/African American,Spanish/Hispanic,6,Emergency,Home w/ Home Health Services,2019,SKN001,SKIN AND SUBCUTANEOUS TISSUE INFECTIONS,MST003,"SUBCUTANEOUS TISSUE, FASCIA, AND MUSCLE BIOPSY",894,HIV W ONE SIGNIF HIV COND OR W/O SIGNIF RELATED COND,24,MULTIPLE SIGNIFICANT TRAUMA,1,Minor,Minor,Medical,Medicaid,Medicaid,,,,true,31333.61,9762.77
New York City,Queens,7001024,001635,St Johns Episcopal Hospital So Shore,30 to 49,,M,Black/African American,Not Span/Hispanic,5,Emergency,Home or Self Care,2019,INF006,HIV INFECTION,CNS002,LUMBAR PUNCTURE,894,HIV W ONE SIGNIF HIV COND OR W/O SIGNIF RELATED COND,24,MULTIPLE SIGNIFICANT TRAUMA,2,Moderate,Minor,Medical,Medicare,Medicaid,,,,true,47523.77,13244.81
New York City,Bronx,7000001,001178,BronxCare Hospital Center,18 to 29,,M,Black/African American,Not Span/Hispanic,1,Emergency,Left Against Medical Advice,2019,INF006,HIV INFECTION,,,894,HIV W ONE SIGNIF HIV COND OR W/O SIGNIF RELATED COND,24,MULTIPLE SIGNIFICANT TRAUMA,2,Moderate,Minor,Medical,Medicaid,Medicaid,,,,true,6313.09,6576.32