Hospital Service Area,Hospital County,Operating Certificate Number,Permanent Facility Id,Facility Name,Age Group,Zip Code - 3 digits,Gender,Race,Ethnicity,Length of Stay,Type of Admission,Patient Disposition,Discharge Year,CCS Diagnosis Code,CCS Diagnosis Description,CCS Procedure Code,CCS Procedure Description,APR DRG Code,APR DRG Description,APR MDC Code,APR MDC Description,APR Severity of Illness Code,APR Severity of Illness Description,APR Risk of Mortality,APR Medical Surgical Description,Payment Typology 1,Payment Typology 2,Payment Typology 3,Birth Weight,Abortion Edit Indicator,Emergency Department Indicator,Total Charges,Total Costs
New York City,Bronx,7000006,001169,Montefiore Medical Center - Henry & Lucy Moses Div,70 or Older,104,F,White,Not Span/Hispanic,11,Elective,Skilled Nursing Home,2017,011,Cancer of head and neck,175,OT OR THER PRC SKN/BRST,091,Other major head & neck procedures,03,"Ear, Nose, Mouth, Throat and Craniofacial Diseases and Disorders",4,Extreme,Extreme,Surgical,Medicare,Private Health Insurance,,,N,N,179786.39,38009.74
New York City,Manhattan,7002002,001439,Mount Sinai Beth Israel,50 to 69,OOS,M,Other Race,Not Span/Hispanic,1,Elective,Home or Self Care,2017,011,Cancer of head and neck,033,OTHER OR THER PRCS NOSE,091,Other major head & neck procedures,03,"Ear, Nose, Mouth, Throat and Craniofacial Diseases and Disorders",2,Moderate,Moderate,Surgical,Private Health Insurance,Self-Pay,,,N,N,42806.98,11681.15
New York City,Manhattan,7002024,001456,Mount Sinai Hospital,30 to 49,OOS,M,White,Not Span/Hispanic,1,Elective,Home or Self Care,2017,011,Cancer of head and neck,030,TONSIL-/ADENOID-ECTOMY,091,Other major head & neck procedures,03,"Ear, Nose, Mouth, Throat and Craniofacial Diseases and Disorders",2,Moderate,Minor,Surgical,Blue Cross/Blue Shield,Self-Pay,,,N,N,32676.56,14100.74
New York City,Manhattan,7002024,001456,Mount Sinai Hospital,70 or Older,113,F,Other Race,Not Span/Hispanic,2,Elective,Home w/ Home Health Services,2017,011,Cancer of head and neck,033,OTHER OR THER PRCS NOSE,091,Other major head & neck procedures,03,"Ear, Nose, Mouth, Throat and Craniofacial Diseases and Disorders",2,Moderate,Moderate,Surgical,Medicaid,Medicaid,Self-Pay,,N,N,32164.75,12047.96
New York City,Bronx,7000006,001169,Montefiore Medical Center - Henry & Lucy Moses Div,70 or Older,104,F,Other Race,Not Span/Hispanic,8,Elective,Home or Self Care,2017,011,Cancer of head and neck,067,OT THER PRCS; HEM/LYMPH,091,Other major head & neck procedures,03,"Ear, Nose, Mouth, Throat and Craniofacial Diseases and Disorders",2,Moderate,Minor,Surgical,Medicare,,,,N,N,160617.88,35441.54
New York City,Bronx,7000006,001169,Montefiore Medical Center - Henry & Lucy Moses Div,0 to 17,104,F,Other Race,Not Span/Hispanic,1,Elective,Home or Self Care,2017,094,Other ear and sense organ disorders,026,OT THERAPEUTIC EAR PRCS,091,Other major head & neck procedures,03,"Ear, Nose, Mouth, Throat and Craniofacial Diseases and Disorders",2,Moderate,Minor,Surgical,Medicaid,,,,N,N,86284.04,31234.77
New York City,Manhattan,7002024,001456,Mount Sinai Hospital,50 to 69,112,M,White,Not Span/Hispanic,1,Elective,Home or Self Care,2017,011,Cancer of head and neck,033,OTHER OR THER PRCS NOSE,091,Other major head & neck procedures,03,"Ear, Nose, Mouth, Throat and Craniofacial Diseases and Disorders",2,Moderate,Moderate,Surgical,Medicare,Medicaid,Self-Pay,,N,N,32555.90,14561.42
New York City,Manhattan,7002024,001456,Mount Sinai Hospital,30 to 49,104,M,White,Not Span/Hispanic,10,Elective,Home w/ Home Health Services,2017,011,Cancer of head and neck,033,OTHER OR THER PRCS NOSE,091,Other major head & neck procedures,03,"Ear, Nose, Mouth, Throat and Craniofacial Diseases and Disorders",3,Major,Moderate,Surgical,Private Health Insurance,Self-Pay,,,N,N,120619.25,45486.15
New York City,Manhattan,7002024,001456,Mount Sinai Hospital,50 to 69,OOS,F,White,Not Span/Hispanic,1,Elective,Home or Self Care,2017,011,Cancer of head and neck,067,OT THER PRCS; HEM/LYMPH,091,Other major head & neck procedures,03,"Ear, Nose, Mouth, Throat and Craniofacial Diseases and Disorders",2,Moderate,Minor,Surgical,Blue Cross/Blue Shield,Self-Pay,,,N,N,25869.60,10470.28
New York City,Manhattan,7002002,001439,Mount Sinai Beth Israel,70 or Older,OOS,F,Other Race,Not Span/Hispanic,22,Elective,Home w/ Home Health Services,2017,011,Cancer of head and neck,026,OT THERAPEUTIC EAR PRCS,091,Other major head & neck procedures,03,"Ear, Nose, Mouth, Throat and Craniofacial Diseases and Disorders",3,Major,Major,Surgical,Medicare,Self-Pay,,,N,N,237763.43,85622.32
New York City,Manhattan,7002002,001439,Mount Sinai Beth Israel,50 to 69,114,F,Other Race,Not Span/Hispanic,3,Elective,Home or Self Care,2017,011,Cancer of head and neck,033,OTHER OR THER PRCS NOSE,091,Other major head & neck procedures,03,"Ear, Nose, Mouth, Throat and Craniofacial Diseases and Disorders",2,Moderate,Minor,Surgical,Medicare,Medicaid,Self-Pay,,N,N,56695.37,17529.13
New York City,Manhattan,7002024,001456,Mount Sinai Hospital,50 to 69,109,F,White,Not Span/Hispanic,3,Elective,Home or Self Care,2017,011,Cancer of head and neck,033,OTHER OR THER PRCS NOSE,091,Other major head & neck procedures,03,"Ear, Nose, Mouth, Throat and Craniofacial Diseases and Disorders",2,Moderate,Moderate,Surgical,Medicare,Medicare,Self-Pay,,N,N,50227.35,20496.47
New York City,Manhattan,7002054,001464,New York Presbyterian Hospital - Columbia Presbyterian Center,50 to 69,100,M,White,Spanish/Hispanic,19,Elective,Skilled Nursing Home,2017,021,Cancer of bone and connective tissue,142,PARTIAL EXCISION BONE,091,Other major head & neck procedures,03,"Ear, Nose, Mouth, Throat and Craniofacial Diseases and Disorders",3,Major,Major,Surgical,Medicare,Medicaid,Self-Pay,,N,N,325042.50,119711.58
New York City,Manhattan,7002054,001464,New York Presbyterian Hospital - Columbia Presbyterian Center,70 or Older,100,M,Other Race,Not Span/Hispanic,10,Elective,Home w/ Home Health Services,2017,011,Cancer of head and neck,067,OT THER PRCS; HEM/LYMPH,091,Other major head & neck procedures,03,"Ear, Nose, Mouth, Throat and Craniofacial Diseases and Disorders",2,Moderate,Moderate,Surgical,Medicare,Private Health Insurance,Self-Pay,,N,N,156378.57,44842.54
New York City,Manhattan,7002054,001464,New York Presbyterian Hospital - Columbia Presbyterian Center,50 to 69,104,M,Other Race,Not Span/Hispanic,6,Urgent,Home w/ Home Health Services,2017,209,Other acquired deformities,034,TRACHEOSTOMY; TEMP/PERM,091,Other major head & neck procedures,03,"Ear, Nose, Mouth, Throat and Craniofacial Diseases and Disorders",2,Moderate,Minor,Surgical,Medicare,Medicare,Medicaid,,N,N,154484.67,67015.61
New York City,Queens,7003010,001637,New York - Presbyterian/Queens,50 to 69,113,F,White,Not Span/Hispanic,7,Elective,Home w/ Home Health Services,2017,011,Cancer of head and neck,033,OTHER OR THER PRCS NOSE,091,Other major head & neck procedures,03,"Ear, Nose, Mouth, Throat and Craniofacial Diseases and Disorders",2,Moderate,Minor,Surgical,Medicare,Medicare,Self-Pay,,N,N,98664.87,40444.96
New York City,Queens,7003010,001637,New York - Presbyterian/Queens,50 to 69,115,M,Other Race,Spanish/Hispanic,5,Urgent,Home or Self Care,2017,011,Cancer of head and neck,033,OTHER OR THER PRCS NOSE,091,Other major head & neck procedures,03,"Ear, Nose, Mouth, Throat and Craniofacial Diseases and Disorders",2,Moderate,Minor,Surgical,Blue Cross/Blue Shield,Self-Pay,,,N,N,47514.35,18238.66
New York City,Manhattan,7002002,001439,Mount Sinai Beth Israel,70 or Older,112,M,White,Not Span/Hispanic,2,Elective,Home or Self Care,2017,011,Cancer of head and neck,033,OTHER OR THER PRCS NOSE,091,Other major head & neck procedures,03,"Ear, Nose, Mouth, Throat and Craniofacial Diseases and Disorders",2,Moderate,Moderate,Surgical,Medicare,Private Health Insurance,Self-Pay,,N,N,46738.58,13562.69
Western NY,Erie,1401005,000210,Erie County Medical Center,70 or Older,141,M,White,Not Span/Hispanic,4,Elective,Home or Self Care,2017,011,Cancer of head and neck,067,OT THER PRCS; HEM/LYMPH,091,Other major head & neck procedures,03,"Ear, Nose, Mouth, Throat and Craniofacial Diseases and Disorders",2,Moderate,Minor,Surgical,Medicare,Blue Cross/Blue Shield,,,N,N,18344.96,11710.04
New York City,Manhattan,7002002,001439,Mount Sinai Beth Israel,30 to 49,100,F,Other Race,Unknown,7,Elective,Home w/ Home Health Services,2017,011,Cancer of head and neck,031,DX PRCS ON NOSE & MOUTH,091,Other major head & neck procedures,03,"Ear, Nose, Mouth, Throat and Craniofacial Diseases and Disorders",2,Moderate,Moderate,Surgical,Private Health Insurance,Self-Pay,,,N,N,97309.76,34396.34
New York City,Manhattan,7002002,001439,Mount Sinai Beth Israel,50 to 69,111,F,Other Race,Unknown,1,Elective,Home or Self Care,2017,011,Cancer of head and neck,067,OT THER PRCS; HEM/LYMPH,091,Other major head & neck procedures,03,"Ear, Nose, Mouth, Throat and Craniofacial Diseases and Disorders",1,Minor,Minor,Surgical,Medicare,Self-Pay,,,N,N,22202.58,6782.63
New York City,Manhattan,7002024,001456,Mount Sinai Hospital,50 to 69,115,F,Other Race,Not Span/Hispanic,7,Elective,Home w/ Home Health Services,2017,011,Cancer of head and neck,033,OTHER OR THER PRCS NOSE,091,Other major head & neck procedures,03,"Ear, Nose, Mouth, Throat and Craniofacial Diseases and Disorders",3,Major,Moderate,Surgical,Medicare,Medicaid,Self-Pay,,N,N,83607.74,30550.66
New York City,Manhattan,7002024,001456,Mount Sinai Hospital,70 or Older,OOS,M,White,Not Span/Hispanic,1,Elective,Home or Self Care,2017,011,Cancer of head and neck,033,OTHER OR THER PRCS NOSE,091,Other major head & neck procedures,03,"Ear, Nose, Mouth, Throat and Craniofacial Diseases and Disorders",2,Moderate,Minor,Surgical,Medicare,Blue Cross/Blue Shield,Self-Pay,,N,N,24614.80,9977.18
New York City,Richmond,7004003,001740,Staten Island University Hosp-North,50 to 69,103,F,Black/African American,Not Span/Hispanic,3,Elective,Home or Self Care,2017,011,Cancer of head and neck,033,OTHER OR THER PRCS NOSE,091,Other major head & neck procedures,03,"Ear, Nose, Mouth, Throat and Craniofacial Diseases and Disorders",3,Major,Moderate,Surgical,Private Health Insurance,,,,N,N,43550.50,11667.20
Capital/Adirond,Otsego,3824000,000746,Mary Imogene Bassett Hospital,50 to 69,138,M,White,Not Span/Hispanic,14,Elective,Home or Self Care,2017,011,Cancer of head and neck,033,OTHER OR THER PRCS NOSE,091,Other major head & neck procedures,03,"Ear, Nose, Mouth, Throat and Craniofacial Diseases and Disorders",2,Moderate,Moderate,Surgical,Medicaid,Self-Pay,,,N,N,115600.84,70768.33
New York City,Kings,7001037,001320,University Hospital of Brooklyn,50 to 69,112,M,Black/African American,Not Span/Hispanic,16,Emergency,Home or Self Care,2017,011,Cancer of head and neck,142,PARTIAL EXCISION BONE,091,Other major head & neck procedures,03,"Ear, Nose, Mouth, Throat and Craniofacial Diseases and Disorders",4,Extreme,Extreme,Surgical,Medicaid,Medicaid,Self-Pay,,N,Y,247804.00,181018.20
New York City,Manhattan,7002024,001456,Mount Sinai Hospital,30 to 49,100,M,White,Not Span/Hispanic,12,Elective,Home w/ Home Health Services,2017,011,Cancer of head and neck,033,OTHER OR THER PRCS NOSE,091,Other major head & neck procedures,03,"Ear, Nose, Mouth, Throat and Craniofacial Diseases and Disorders",3,Major,Moderate,Surgical,Private Health Insurance,Self-Pay,,,N,N,132583.00,50616.64
New York City,Manhattan,7002024,001456,Mount Sinai Hospital,70 or Older,116,F,White,Not Span/Hispanic,1,Urgent,Home or Self Care,2017,011,Cancer of head and neck,033,OTHER OR THER PRCS NOSE,091,Other major head & neck procedures,03,"Ear, Nose, Mouth, Throat and Craniofacial Diseases and Disorders",2,Moderate,Minor,Surgical,Medicare,Medicaid,Self-Pay,,N,N,21132.43,8525.03
New York City,Manhattan,7002024,001456,Mount Sinai Hospital,50 to 69,100,M,White,Not Span/Hispanic,2,Elective,Home or Self Care,2017,011,Cancer of head and neck,033,OTHER OR THER PRCS NOSE,091,Other major head & neck procedures,03,"Ear, Nose, Mouth, Throat and Craniofacial Diseases and Disorders",2,Moderate,Minor,Surgical,Self-Pay,Self-Pay,,,N,N,35522.14,15162.31
New York City,Manhattan,7002024,001456,Mount Sinai Hospital,70 or Older,105,M,White,Not Span/Hispanic,1,Elective,Home or Self Care,2017,011,Cancer of head and neck,033,OTHER OR THER PRCS NOSE,091,Other major head & neck procedures,03,"Ear, Nose, Mouth, Throat and Craniofacial Diseases and Disorders",2,Moderate,Moderate,Surgical,Medicare,Private Health Insurance,Self-Pay,,N,N,21341.68,8260.23
New York City,Manhattan,7002024,001456,Mount Sinai Hospital,30 to 49,103,M,White,Not Span/Hispanic,11,Elective,Home w/ Home Health Services,2017,011,Cancer of head and neck,033,OTHER OR THER PRCS NOSE,091,Other major head & neck procedures,03,"Ear, Nose, Mouth, Throat and Craniofacial Diseases and Disorders",2,Moderate,Moderate,Surgical,Blue Cross/Blue Shield,Self-Pay,,,N,N,113227.71,43093.19
New York City,Manhattan,7002024,001456,Mount Sinai Hospital,50 to 69,100,M,Black/African American,Not Span/Hispanic,15,Elective,Home or Self Care,2017,011,Cancer of head and neck,033,OTHER OR THER PRCS NOSE,091,Other major head & neck procedures,03,"Ear, Nose, Mouth, Throat and Craniofacial Diseases and Disorders",2,Moderate,Minor,Surgical,Medicaid,Medicaid,Self-Pay,,N,N,134672.61,50969.42
New York City,Manhattan,7002054,001464,New York Presbyterian Hospital - Columbia Presbyterian Center,50 to 69,OOS,M,Other Race,Not Span/Hispanic,8,Elective,Home or Self Care,2017,011,Cancer of head and neck,033,OTHER OR THER PRCS NOSE,091,Other major head & neck procedures,03,"Ear, Nose, Mouth, Throat and Craniofacial Diseases and Disorders",2,Moderate,Moderate,Surgical,Blue Cross/Blue Shield,Self-Pay,,,N,N,135929.19,36615.23
New York City,Manhattan,7002054,001464,New York Presbyterian Hospital - Columbia Presbyterian Center,70 or Older,105,F,Black/African American,Not Span/Hispanic,13,Elective,Home or Self Care,2017,011,Cancer of head and neck,033,OTHER OR THER PRCS NOSE,091,Other major head & neck procedures,03,"Ear, Nose, Mouth, Throat and Craniofacial Diseases and Disorders",2,Moderate,Moderate,Surgical,Medicare,Medicaid,Self-Pay,,N,N,274946.84,104131.55
New York City,Manhattan,7002054,001464,New York Presbyterian Hospital - Columbia Presbyterian Center,50 to 69,104,F,White,Not Span/Hispanic,14,Emergency,Home or Self Care,2017,011,Cancer of head and neck,067,OT THER PRCS; HEM/LYMPH,091,Other major head & neck procedures,03,"Ear, Nose, Mouth, Throat and Craniofacial Diseases and Disorders",2,Moderate,Minor,Surgical,Private Health Insurance,Self-Pay,,,N,Y,292759.61,115720.23
New York City,Manhattan,7002054,001464,New York Presbyterian Hospital - Columbia Presbyterian Center,0 to 17,114,M,Multi-racial,Not Span/Hispanic,1,Urgent,Home or Self Care,2017,094,Other ear and sense organ disorders,026,OT THERAPEUTIC EAR PRCS,091,Other major head & neck procedures,03,"Ear, Nose, Mouth, Throat and Craniofacial Diseases and Disorders",2,Moderate,Minor,Surgical,Blue Cross/Blue Shield,Private Health Insurance,Self-Pay,,N,N,26509.93,8712.17
Western NY,Erie,1401010,000216,Roswell Park Cancer Institute,50 to 69,141,M,White,Not Span/Hispanic,8,Elective,Home w/ Home Health Services,2017,011,Cancer of head and neck,033,OTHER OR THER PRCS NOSE,091,Other major head & neck procedures,03,"Ear, Nose, Mouth, Throat and Craniofacial Diseases and Disorders",2,Moderate,Minor,Surgical,Medicare,Blue Cross/Blue Shield,,,N,N,65478.02,25729.58
New York City,Bronx,7000001,001178,Bronx-Lebanon Hospital Center - Concourse Division,30 to 49,104,F,Other Race,Spanish/Hispanic,3,Elective,Home or Self Care,2017,011,Cancer of head and neck,033,OTHER OR THER PRCS NOSE,091,Other major head & neck procedures,03,"Ear, Nose, Mouth, Throat and Craniofacial Diseases and Disorders",2,Moderate,Moderate,Surgical,Medicaid,Medicaid,,,N,N,22016.25,25129.46
New York City,Manhattan,7002002,001439,Mount Sinai Beth Israel,30 to 49,112,F,Other Race,Not Span/Hispanic,2,Elective,Home or Self Care,2017,011,Cancer of head and neck,067,OT THER PRCS; HEM/LYMPH,091,Other major head & neck procedures,03,"Ear, Nose, Mouth, Throat and Craniofacial Diseases and Disorders",2,Moderate,Minor,Surgical,Private Health Insurance,Self-Pay,,,N,N,44166.92,13189.26
New York City,Manhattan,7002017,001450,Lenox Hill Hospital,50 to 69,105,M,Other Race,Not Span/Hispanic,1,Elective,Home or Self Care,2017,021,Cancer of bone and connective tissue,026,OT THERAPEUTIC EAR PRCS,091,Other major head & neck procedures,03,"Ear, Nose, Mouth, Throat and Craniofacial Diseases and Disorders",2,Moderate,Minor,Surgical,Medicare,Private Health Insurance,,,N,N,49999.01,13492.58
New York City,Manhattan,7002017,001450,Lenox Hill Hospital,50 to 69,100,F,White,Not Span/Hispanic,8,Not Available,Home w/ Home Health Services,2017,011,Cancer of head and neck,067,OT THER PRCS; HEM/LYMPH,091,Other major head & neck procedures,03,"Ear, Nose, Mouth, Throat and Craniofacial Diseases and Disorders",2,Moderate,Moderate,Surgical,Private Health Insurance,,,,N,N,97447.04,18325.56
New York City,Manhattan,7002053,001463,NYU Langone Hospitals,30 to 49,101,F,White,Not Span/Hispanic,5,Elective,Home or Self Care,2017,011,Cancer of head and neck,033,OTHER OR THER PRCS NOSE,091,Other major head & neck procedures,03,"Ear, Nose, Mouth, Throat and Craniofacial Diseases and Disorders",3,Major,Moderate,Surgical,Private Health Insurance,,,,N,N,244036.25,63777.56
New York City,Manhattan,7002020,001453,Memorial Sloan Kettering Memorial Hospital,70 or Older,105,M,White,Not Span/Hispanic,21,Elective,Home w/ Home Health Services,2017,011,Cancer of head and neck,034,TRACHEOSTOMY; TEMP/PERM,091,Other major head & neck procedures,03,"Ear, Nose, Mouth, Throat and Craniofacial Diseases and Disorders",2,Moderate,Moderate,Surgical,Medicare,Private Health Insurance,Medicare,,N,N,254087.16,110997.92
New York City,Manhattan,7002020,001453,Memorial Sloan Kettering Memorial Hospital,30 to 49,117,M,White,Not Span/Hispanic,2,Elective,Home or Self Care,2017,011,Cancer of head and neck,067,OT THER PRCS; HEM/LYMPH,091,Other major head & neck procedures,03,"Ear, Nose, Mouth, Throat and Craniofacial Diseases and Disorders",2,Moderate,Moderate,Surgical,Private Health Insurance,,,,N,N,34610.42,16953.37
New York City,Manhattan,7002020,001453,Memorial Sloan Kettering Memorial Hospital,50 to 69,114,M,Other Race,Not Span/Hispanic,5,Elective,Home or Self Care,2017,011,Cancer of head and neck,033,OTHER OR THER PRCS NOSE,091,Other major head & neck procedures,03,"Ear, Nose, Mouth, Throat and Craniofacial Diseases and Disorders",3,Major,Moderate,Surgical,Blue Cross/Blue Shield,Medicare,,,N,N,75517.97,34415.82
New York City,Manhattan,7002020,001453,Memorial Sloan Kettering Memorial Hospital,30 to 49,117,M,Other Race,Not Span/Hispanic,17,Elective,Home w/ Home Health Services,2017,011,Cancer of head and neck,033,OTHER OR THER PRCS NOSE,091,Other major head & neck procedures,03,"Ear, Nose, Mouth, Throat and Craniofacial Diseases and Disorders",3,Major,Moderate,Surgical,"Managed Care, Unspecified",,,,N,N,223947.10,100892.07
New York City,Manhattan,7002020,001453,Memorial Sloan Kettering Memorial Hospital,50 to 69,112,M,White,Not Span/Hispanic,13,Elective,Home w/ Home Health Services,2017,011,Cancer of head and neck,034,TRACHEOSTOMY; TEMP/PERM,091,Other major head & neck procedures,03,"Ear, Nose, Mouth, Throat and Craniofacial Diseases and Disorders",2,Moderate,Moderate,Surgical,Medicare,Medicaid,Medicare,,N,N,168604.29,75320.36
New York City,Manhattan,7002020,001453,Memorial Sloan Kettering Memorial Hospital,70 or Older,OOS,M,White,Not Span/Hispanic,3,Elective,Home or Self Care,2017,011,Cancer of head and neck,033,OTHER OR THER PRCS NOSE,091,Other major head & neck procedures,03,"Ear, Nose, Mouth, Throat and Craniofacial Diseases and Disorders",3,Major,Major,Surgical,Blue Cross/Blue Shield,,,,N,N,61162.07,28929.34
New York City,Manhattan,7002020,001453,Memorial Sloan Kettering Memorial Hospital,50 to 69,115,F,White,Not Span/Hispanic,16,Elective,Home w/ Home Health Services,2017,011,Cancer of head and neck,033,OTHER OR THER PRCS NOSE,091,Other major head & neck procedures,03,"Ear, Nose, Mouth, Throat and Craniofacial Diseases and Disorders",2,Moderate,Moderate,Surgical,Medicaid,,,,N,N,171805.88,81092.09
New York City,Manhattan,7002020,001453,Memorial Sloan Kettering Memorial Hospital,70 or Older,OOS,M,White,Not Span/Hispanic,4,Elective,Home or Self Care,2017,011,Cancer of head and neck,067,OT THER PRCS; HEM/LYMPH,091,Other major head & neck procedures,03,"Ear, Nose, Mouth, Throat and Craniofacial Diseases and Disorders",2,Moderate,Moderate,Surgical,Medicare,Private Health Insurance,Medicare,,N,N,76926.95,36251.14
New York City,Manhattan,7002020,001453,Memorial Sloan Kettering Memorial Hospital,50 to 69,OOS,M,White,Not Span/Hispanic,4,Elective,Home or Self Care,2017,011,Cancer of head and neck,030,TONSIL-/ADENOID-ECTOMY,091,Other major head & neck procedures,03,"Ear, Nose, Mouth, Throat and Craniofacial Diseases and Disorders",2,Moderate,Moderate,Surgical,Private Health Insurance,,,,N,N,70470.94,32419.33
New York City,Manhattan,7002024,001456,Mount Sinai Hospital,50 to 69,OOS,F,Other Race,Not Span/Hispanic,2,Elective,Home or Self Care,2017,011,Cancer of head and neck,030,TONSIL-/ADENOID-ECTOMY,091,Other major head & neck procedures,03,"Ear, Nose, Mouth, Throat and Craniofacial Diseases and Disorders",2,Moderate,Minor,Surgical,Private Health Insurance,Private Health Insurance,Medicare,,N,N,37053.52,13742.69
New York City,Manhattan,7002024,001456,Mount Sinai Hospital,70 or Older,100,F,White,Not Span/Hispanic,1,Elective,Home or Self Care,2017,011,Cancer of head and neck,033,OTHER OR THER PRCS NOSE,091,Other major head & neck procedures,03,"Ear, Nose, Mouth, Throat and Craniofacial Diseases and Disorders",2,Moderate,Minor,Surgical,Medicare,Medicare,Self-Pay,,N,N,30608.12,12400.70
New York City,Manhattan,7002024,001456,Mount Sinai Hospital,30 to 49,OOS,F,White,Not Span/Hispanic,6,Elective,Home w/ Home Health Services,2017,011,Cancer of head and neck,033,OTHER OR THER PRCS NOSE,091,Other major head & neck procedures,03,"Ear, Nose, Mouth, Throat and Craniofacial Diseases and Disorders",2,Moderate,Minor,Surgical,Private Health Insurance,Self-Pay,,,N,N,72602.86,28303.45
New York City,Manhattan,7002024,001456,Mount Sinai Hospital,50 to 69,109,M,White,Not Span/Hispanic,2,Elective,Home or Self Care,2017,011,Cancer of head and neck,033,OTHER OR THER PRCS NOSE,091,Other major head & neck procedures,03,"Ear, Nose, Mouth, Throat and Craniofacial Diseases and Disorders",2,Moderate,Moderate,Surgical,Medicare,Blue Cross/Blue Shield,Self-Pay,,N,N,45074.88,18551.34
New York City,Manhattan,7002053,001463,NYU Langone Hospitals,30 to 49,112,F,White,Not Span/Hispanic,18,Elective,Home w/ Home Health Services,2017,011,Cancer of head and neck,033,OTHER OR THER PRCS NOSE,091,Other major head & neck procedures,03,"Ear, Nose, Mouth, Throat and Craniofacial Diseases and Disorders",2,Moderate,Minor,Surgical,Private Health Insurance,,,,N,N,505901.83,184278.13
New York City,Manhattan,7002053,001463,NYU Langone Hospitals,50 to 69,100,M,Other Race,Not Span/Hispanic,6,Elective,Home w/ Home Health Services,2017,011,Cancer of head and neck,067,OT THER PRCS; HEM/LYMPH,091,Other major head & neck procedures,03,"Ear, Nose, Mouth, Throat and Craniofacial Diseases and Disorders",2,Moderate,Moderate,Surgical,Private Health Insurance,,,,N,N,183294.35,58117.48
Western NY,Erie,1401005,000210,Erie County Medical Center,70 or Older,140,M,White,Not Span/Hispanic,3,Elective,Home or Self Care,2017,011,Cancer of head and neck,033,OTHER OR THER PRCS NOSE,091,Other major head & neck procedures,03,"Ear, Nose, Mouth, Throat and Craniofacial Diseases and Disorders",2,Moderate,Moderate,Surgical,Medicare,,,,N,N,21729.29,12407.61