Hospital Service Area,Hospital County,Operating Certificate Number,Permanent Facility Id,Facility Name,Age Group,Zip Code - 3 digits,Gender,Race,Ethnicity,Length of Stay,Type of Admission,Patient Disposition,Discharge Year,CCS Diagnosis Code,CCS Diagnosis Description,CCS Procedure Code,CCS Procedure Description,APR DRG Code,APR DRG Description,APR MDC Code,APR MDC Description,APR Severity of Illness Code,APR Severity of Illness Description,APR Risk of Mortality,APR Medical Surgical Description,Payment Typology 1,Payment Typology 2,Payment Typology 3,Birth Weight,Abortion Edit Indicator,Emergency Department Indicator,Total Charges,Total Costs
Western NY,Erie,1401005,000210,Erie County Medical Center,50 to 69,142,F,White,Not Span/Hispanic,9,Elective,Home w/ Home Health Services,2019,NEO002,HEAD AND NECK CANCERS - LIP AND ORAL CAVITY,ENT009,TONGUE EXCISION,091,OTHER MAJOR HEAD & NECK PROCEDURES,03,"DISEASES AND DISORDERS OF THE EAR, NOSE, MOUTH AND THROAT",2,Moderate,Minor,Surgical,Blue Cross/Blue Shield,,,,,false,38898.03,25216.19
Hudson Valley,Westchester,5902001,001045,White Plains Hospital Center,70 or Older,105,F,Other Race,Not Span/Hispanic,2,Elective,Home or Self Care,2019,NEO004,HEAD AND NECK CANCERS - SALIVARY GLAND,ENT010,SALIVARY GLAND EXCISION,091,OTHER MAJOR HEAD & NECK PROCEDURES,03,"DISEASES AND DISORDERS OF THE EAR, NOSE, MOUTH AND THROAT",2,Moderate,Moderate,Surgical,Medicare,Private Health Insurance,,,,false,61532,10914.65
Western NY,Erie,1401005,000210,Erie County Medical Center,50 to 69,142,M,White,Not Span/Hispanic,8,Elective,Home or Self Care,2019,NEO002,HEAD AND NECK CANCERS - LIP AND ORAL CAVITY,ENT009,TONGUE EXCISION,091,OTHER MAJOR HEAD & NECK PROCEDURES,03,"DISEASES AND DISORDERS OF THE EAR, NOSE, MOUTH AND THROAT",2,Moderate,Minor,Surgical,Blue Cross/Blue Shield,,,,,false,38470.3,24663.29
Finger Lakes,Monroe,2701005,000413,Strong Memorial Hospital,50 to 69,130,F,White,Not Span/Hispanic,2,Elective,Home or Self Care,2019,NEO004,HEAD AND NECK CANCERS - SALIVARY GLAND,LYM003,LYMPH NODE DISSECTION,091,OTHER MAJOR HEAD & NECK PROCEDURES,03,"DISEASES AND DISORDERS OF THE EAR, NOSE, MOUTH AND THROAT",1,Minor,Moderate,Surgical,Medicare,Blue Cross/Blue Shield,,,,false,20709.28,10710.29
New York City,Manhattan,7002024,001456,Mount Sinai Hospital,50 to 69,100,M,White,Not Span/Hispanic,3,Elective,Home or Self Care,2019,NEO009,HEAD AND NECK CANCERS - TONSILS,ENT012,"ENT EXCISION (EXCLUDING NASAL PASSAGE, SINUSES, TONGUE, SALIVARY GLANDS, LARYNX)",091,OTHER MAJOR HEAD & NECK PROCEDURES,03,"DISEASES AND DISORDERS OF THE EAR, NOSE, MOUTH AND THROAT",2,Moderate,Moderate,Surgical,Medicare,Private Health Insurance,Self-Pay,,,false,73363.42,25340.95
New York City,Manhattan,7002054,001464,New York-Presbyterian Hospital - Columbia Presbyterian Center,70 or Older,105,M,Other Race,Not Span/Hispanic,10,Urgent,Home w/ Home Health Services,2019,NEO002,HEAD AND NECK CANCERS - LIP AND ORAL CAVITY,RES010,TRACHEOSTOMY,091,OTHER MAJOR HEAD & NECK PROCEDURES,03,"DISEASES AND DISORDERS OF THE EAR, NOSE, MOUTH AND THROAT",4,Extreme,Major,Surgical,Medicare,Medicare,Self-Pay,,,false,234133.03,77562.66
New York City,Manhattan,7002020,001453,Memorial Hospital for Cancer and Allied Diseases,50 to 69,109,M,White,Not Span/Hispanic,3,Elective,Home or Self Care,2019,NEO004,HEAD AND NECK CANCERS - SALIVARY GLAND,ENT010,SALIVARY GLAND EXCISION,091,OTHER MAJOR HEAD & NECK PROCEDURES,03,"DISEASES AND DISORDERS OF THE EAR, NOSE, MOUTH AND THROAT",3,Major,Moderate,Surgical,Blue Cross/Blue Shield,,,,,false,82204.54,33815.6
New York City,Manhattan,7002020,001453,Memorial Hospital for Cancer and Allied Diseases,50 to 69,130,M,White,Not Span/Hispanic,17,Elective,Home or Self Care,2019,NEO002,HEAD AND NECK CANCERS - LIP AND ORAL CAVITY,ENT009,TONGUE EXCISION,091,OTHER MAJOR HEAD & NECK PROCEDURES,03,"DISEASES AND DISORDERS OF THE EAR, NOSE, MOUTH AND THROAT",3,Major,Major,Surgical,Private Health Insurance,,,,,false,271816.56,109323.32
New York City,Manhattan,7002032,001466,Mount Sinai West,70 or Older,OOS,F,White,Not Span/Hispanic,1,Elective,Home w/ Home Health Services,2019,NEO023,BONE CANCER,LYM003,LYMPH NODE DISSECTION,091,OTHER MAJOR HEAD & NECK PROCEDURES,03,"DISEASES AND DISORDERS OF THE EAR, NOSE, MOUTH AND THROAT",2,Moderate,Minor,Surgical,Medicare,Private Health Insurance,Self-Pay,,,false,51872.51,16709.75
New York City,Manhattan,7002053,001463,NYU Langone Hospitals,50 to 69,100,M,White,Not Span/Hispanic,2,Elective,Home or Self Care,2019,NEO002,HEAD AND NECK CANCERS - LIP AND ORAL CAVITY,ENT009,TONGUE EXCISION,091,OTHER MAJOR HEAD & NECK PROCEDURES,03,"DISEASES AND DISORDERS OF THE EAR, NOSE, MOUTH AND THROAT",2,Moderate,Minor,Surgical,Blue Cross/Blue Shield,Medicare,,,,false,91615.46,17534.84
New York City,Manhattan,7002032,001466,Mount Sinai West,70 or Older,100,M,White,Not Span/Hispanic,11,Elective,Skilled Nursing Home,2019,NEO003,HEAD AND NECK CANCERS - THROAT,RES010,TRACHEOSTOMY,091,OTHER MAJOR HEAD & NECK PROCEDURES,03,"DISEASES AND DISORDERS OF THE EAR, NOSE, MOUTH AND THROAT",3,Major,Major,Surgical,Medicare,Medicare,Medicaid,,,false,217286.54,64368.4
New York City,Manhattan,7002032,001466,Mount Sinai West,70 or Older,OOS,F,White,Not Span/Hispanic,5,Elective,Home or Self Care,2019,NEO002,HEAD AND NECK CANCERS - LIP AND ORAL CAVITY,ENT012,"ENT EXCISION (EXCLUDING NASAL PASSAGE, SINUSES, TONGUE, SALIVARY GLANDS, LARYNX)",091,OTHER MAJOR HEAD & NECK PROCEDURES,03,"DISEASES AND DISORDERS OF THE EAR, NOSE, MOUTH AND THROAT",4,Extreme,Extreme,Surgical,Medicare,Private Health Insurance,Self-Pay,,,false,118448.97,36006.78
Finger Lakes,Monroe,2701005,000413,Strong Memorial Hospital,70 or Older,145,F,White,Not Span/Hispanic,8,Elective,Home w/ Home Health Services,2019,NEO002,HEAD AND NECK CANCERS - LIP AND ORAL CAVITY,ENT012,"ENT EXCISION (EXCLUDING NASAL PASSAGE, SINUSES, TONGUE, SALIVARY GLANDS, LARYNX)",091,OTHER MAJOR HEAD & NECK PROCEDURES,03,"DISEASES AND DISORDERS OF THE EAR, NOSE, MOUTH AND THROAT",1,Minor,Moderate,Surgical,Medicare,Blue Cross/Blue Shield,,,,false,63207.27,34216.91
New York City,Bronx,7000006,001169,Montefiore Medical Center - Henry & Lucy Moses Div,50 to 69,104,M,Other Race,Unknown,1,Emergency,Home or Self Care,2019,RSP007,OTHER SPECIFIED AND UNSPECIFIED UPPER RESPIRATORY DISEASE,ENT013,ENT REPAIR,091,OTHER MAJOR HEAD & NECK PROCEDURES,03,"DISEASES AND DISORDERS OF THE EAR, NOSE, MOUTH AND THROAT",2,Moderate,Minor,Surgical,Private Health Insurance,,,,,false,38675.8,8786.01
Finger Lakes,Monroe,2701001,000409,Highland Hospital,50 to 69,148,M,Other Race,Unknown,8,Elective,Home w/ Home Health Services,2019,NEO008,HEAD AND NECK CANCERS - LARYNGEAL,ENT011,LARYNGECTOMY,091,OTHER MAJOR HEAD & NECK PROCEDURES,03,"DISEASES AND DISORDERS OF THE EAR, NOSE, MOUTH AND THROAT",3,Major,Moderate,Surgical,Self-Pay,,,,,false,52490.45,19084.31
New York City,Manhattan,7002054,001464,New York-Presbyterian Hospital - Columbia Presbyterian Center,50 to 69,OOS,F,Other Race,Not Span/Hispanic,13,Elective,Home or Self Care,2019,NEO002,HEAD AND NECK CANCERS - LIP AND ORAL CAVITY,ENT009,TONGUE EXCISION,091,OTHER MAJOR HEAD & NECK PROCEDURES,03,"DISEASES AND DISORDERS OF THE EAR, NOSE, MOUTH AND THROAT",1,Minor,Minor,Surgical,Blue Cross/Blue Shield,Self-Pay,,,,false,359040.92,127055.75
New York City,Manhattan,7002032,001466,Mount Sinai West,50 to 69,OOS,F,White,Not Span/Hispanic,2,Urgent,Home or Self Care,2019,NEO009,HEAD AND NECK CANCERS - TONSILS,LYM003,LYMPH NODE DISSECTION,091,OTHER MAJOR HEAD & NECK PROCEDURES,03,"DISEASES AND DISORDERS OF THE EAR, NOSE, MOUTH AND THROAT",2,Moderate,Moderate,Surgical,Medicare,Private Health Insurance,Self-Pay,,,false,38248.21,10750.26
New York City,Manhattan,7002001,001438,Bellevue Hospital Center,50 to 69,114,M,Other Race,Not Span/Hispanic,2,Elective,Home or Self Care,2019,NEO002,HEAD AND NECK CANCERS - LIP AND ORAL CAVITY,LYM003,LYMPH NODE DISSECTION,091,OTHER MAJOR HEAD & NECK PROCEDURES,03,"DISEASES AND DISORDERS OF THE EAR, NOSE, MOUTH AND THROAT",2,Moderate,Minor,Surgical,Medicaid,Medicaid,,,,false,8733.89,5804.54
New York City,Manhattan,7002032,001466,Mount Sinai West,50 to 69,OOS,F,White,Not Span/Hispanic,1,Elective,Home or Self Care,2019,NEO002,HEAD AND NECK CANCERS - LIP AND ORAL CAVITY,LYM003,LYMPH NODE DISSECTION,091,OTHER MAJOR HEAD & NECK PROCEDURES,03,"DISEASES AND DISORDERS OF THE EAR, NOSE, MOUTH AND THROAT",2,Moderate,Moderate,Surgical,Private Health Insurance,Self-Pay,,,,false,50622.88,15481.46
New York City,Manhattan,7002032,001466,Mount Sinai West,50 to 69,112,M,White,Not Span/Hispanic,1,Elective,Home or Self Care,2019,NEO002,HEAD AND NECK CANCERS - LIP AND ORAL CAVITY,LYM003,LYMPH NODE DISSECTION,091,OTHER MAJOR HEAD & NECK PROCEDURES,03,"DISEASES AND DISORDERS OF THE EAR, NOSE, MOUTH AND THROAT",1,Minor,Moderate,Surgical,Medicare,Medicaid,Self-Pay,,,false,37477.43,11347.8
New York City,Manhattan,7002053,001463,NYU Langone Hospitals,70 or Older,OOS,M,White,Not Span/Hispanic,2,Elective,Home or Self Care,2019,NEO004,HEAD AND NECK CANCERS - SALIVARY GLAND,ENT010,SALIVARY GLAND EXCISION,091,OTHER MAJOR HEAD & NECK PROCEDURES,03,"DISEASES AND DISORDERS OF THE EAR, NOSE, MOUTH AND THROAT",2,Moderate,Major,Surgical,Medicare,Medicare,,,,false,137006.08,24009.82
New York City,Manhattan,7002024,001456,Mount Sinai Hospital,50 to 69,OOS,M,Black/African American,Not Span/Hispanic,3,Elective,Home or Self Care,2019,NEO010,HEAD AND NECK CANCERS - ALL OTHER TYPES,LYM003,LYMPH NODE DISSECTION,091,OTHER MAJOR HEAD & NECK PROCEDURES,03,"DISEASES AND DISORDERS OF THE EAR, NOSE, MOUTH AND THROAT",2,Moderate,Moderate,Surgical,Blue Cross/Blue Shield,Self-Pay,,,,false,80652.27,25763.38
Long Island,Suffolk,5151001,000245,Stony Brook University Hospital,50 to 69,119,F,White,Not Span/Hispanic,1,Elective,Home or Self Care,2019,NEO004,HEAD AND NECK CANCERS - SALIVARY GLAND,LYM003,LYMPH NODE DISSECTION,091,OTHER MAJOR HEAD & NECK PROCEDURES,03,"DISEASES AND DISORDERS OF THE EAR, NOSE, MOUTH AND THROAT",2,Moderate,Moderate,Surgical,Blue Cross/Blue Shield,Blue Cross/Blue Shield,,,,false,46745.96,22310.89
New York City,Kings,7001021,001306,New York - Presbyterian Brooklyn Methodist Hospital,50 to 69,112,M,Black/African American,Spanish/Hispanic,52,Emergency,Home w/ Home Health Services,2019,NEO008,HEAD AND NECK CANCERS - LARYNGEAL,ENT011,LARYNGECTOMY,091,OTHER MAJOR HEAD & NECK PROCEDURES,03,"DISEASES AND DISORDERS OF THE EAR, NOSE, MOUTH AND THROAT",4,Extreme,Major,Surgical,"Managed Care, Unspecified",Medicaid,Self-Pay,,,true,387359.95,120998.3
New York City,Manhattan,7002024,001456,Mount Sinai Hospital,70 or Older,OOS,M,White,Not Span/Hispanic,3,Elective,Home or Self Care,2019,NEO002,HEAD AND NECK CANCERS - LIP AND ORAL CAVITY,ENT009,TONGUE EXCISION,091,OTHER MAJOR HEAD & NECK PROCEDURES,03,"DISEASES AND DISORDERS OF THE EAR, NOSE, MOUTH AND THROAT",2,Moderate,Moderate,Surgical,Medicare,Blue Cross/Blue Shield,Self-Pay,,,false,79532.03,26316.57
New York City,Manhattan,7002001,001438,Bellevue Hospital Center,70 or Older,100,F,White,Not Span/Hispanic,7,Emergency,Home w/ Home Health Services,2019,RSP007,OTHER SPECIFIED AND UNSPECIFIED UPPER RESPIRATORY DISEASE,ENT013,ENT REPAIR,091,OTHER MAJOR HEAD & NECK PROCEDURES,03,"DISEASES AND DISORDERS OF THE EAR, NOSE, MOUTH AND THROAT",3,Major,Major,Surgical,Medicare,Medicare,Medicaid,,,true,38128.36,25340.11
New York City,Bronx,7000006,001169,Montefiore Medical Center - Henry & Lucy Moses Div,0 to 17,104,F,Other Race,Spanish/Hispanic,11,Emergency,Home or Self Care,2019,RSP007,OTHER SPECIFIED AND UNSPECIFIED UPPER RESPIRATORY DISEASE,RES014,"RESPIRATORY SYSTEM PROCEDURES, NEC",091,OTHER MAJOR HEAD & NECK PROCEDURES,03,"DISEASES AND DISORDERS OF THE EAR, NOSE, MOUTH AND THROAT",4,Extreme,Moderate,Surgical,Medicaid,,,,,false,247863.44,50939.3
New York City,Manhattan,7002024,001456,Mount Sinai Hospital,50 to 69,112,F,White,Not Span/Hispanic,5,Elective,Home or Self Care,2019,NEO002,HEAD AND NECK CANCERS - LIP AND ORAL CAVITY,ENT013,ENT REPAIR,091,OTHER MAJOR HEAD & NECK PROCEDURES,03,"DISEASES AND DISORDERS OF THE EAR, NOSE, MOUTH AND THROAT",3,Major,Moderate,Surgical,Private Health Insurance,Self-Pay,,,,false,115278.12,37795.85
Finger Lakes,Monroe,2701001,000409,Highland Hospital,70 or Older,145,M,White,Not Span/Hispanic,5,Elective,Home w/ Home Health Services,2019,NEO002,HEAD AND NECK CANCERS - LIP AND ORAL CAVITY,LYM003,LYMPH NODE DISSECTION,091,OTHER MAJOR HEAD & NECK PROCEDURES,03,"DISEASES AND DISORDERS OF THE EAR, NOSE, MOUTH AND THROAT",3,Major,Major,Surgical,Medicare,Private Health Insurance,,,,false,33999.95,12412.7
New York City,Manhattan,7002032,001466,Mount Sinai West,70 or Older,100,M,White,Not Span/Hispanic,13,Emergency,Home w/ Home Health Services,2019,NEO002,HEAD AND NECK CANCERS - LIP AND ORAL CAVITY,RES010,TRACHEOSTOMY,091,OTHER MAJOR HEAD & NECK PROCEDURES,03,"DISEASES AND DISORDERS OF THE EAR, NOSE, MOUTH AND THROAT",3,Major,Major,Surgical,Medicare,Medicaid,Self-Pay,,,true,311671.4,94349.19
New York City,Kings,7001021,001306,New York - Presbyterian Brooklyn Methodist Hospital,50 to 69,112,M,White,Not Span/Hispanic,2,Emergency,Home or Self Care,2019,NEO008,HEAD AND NECK CANCERS - LARYNGEAL,LYM003,LYMPH NODE DISSECTION,091,OTHER MAJOR HEAD & NECK PROCEDURES,03,"DISEASES AND DISORDERS OF THE EAR, NOSE, MOUTH AND THROAT",3,Major,Moderate,Surgical,"Managed Care, Unspecified",Medicaid,Self-Pay,,,false,33068.36,14213.18
New York City,Manhattan,7002053,001463,NYU Langone Hospitals,50 to 69,100,M,White,Not Span/Hispanic,5,Elective,Home w/ Home Health Services,2019,NEO004,HEAD AND NECK CANCERS - SALIVARY GLAND,ENT010,SALIVARY GLAND EXCISION,091,OTHER MAJOR HEAD & NECK PROCEDURES,03,"DISEASES AND DISORDERS OF THE EAR, NOSE, MOUTH AND THROAT",2,Moderate,Moderate,Surgical,Medicare,,,,,false,225820.21,43656.01
Finger Lakes,Monroe,2701005,000413,Strong Memorial Hospital,50 to 69,144,F,White,Not Span/Hispanic,4,Elective,Home or Self Care,2019,NEO002,HEAD AND NECK CANCERS - LIP AND ORAL CAVITY,ENT009,TONGUE EXCISION,091,OTHER MAJOR HEAD & NECK PROCEDURES,03,"DISEASES AND DISORDERS OF THE EAR, NOSE, MOUTH AND THROAT",2,Moderate,Minor,Surgical,Blue Cross/Blue Shield,,,,,false,31155.81,14031.6
Finger Lakes,Monroe,2701005,000413,Strong Memorial Hospital,70 or Older,146,F,White,Not Span/Hispanic,9,Elective,Home w/ Home Health Services,2019,NEO002,HEAD AND NECK CANCERS - LIP AND ORAL CAVITY,LYM003,LYMPH NODE DISSECTION,091,OTHER MAJOR HEAD & NECK PROCEDURES,03,"DISEASES AND DISORDERS OF THE EAR, NOSE, MOUTH AND THROAT",3,Major,Moderate,Surgical,Medicare,Blue Cross/Blue Shield,,,,false,46328.38,21759.82
New York City,Manhattan,7002032,001466,Mount Sinai West,70 or Older,100,M,White,Not Span/Hispanic,3,Elective,Home or Self Care,2019,NEO004,HEAD AND NECK CANCERS - SALIVARY GLAND,ENT010,SALIVARY GLAND EXCISION,091,OTHER MAJOR HEAD & NECK PROCEDURES,03,"DISEASES AND DISORDERS OF THE EAR, NOSE, MOUTH AND THROAT",2,Moderate,Major,Surgical,Medicare,Medicare,Self-Pay,,,false,71327.31,18988.19
New York City,Bronx,7000006,001169,Montefiore Medical Center - Henry & Lucy Moses Div,0 to 17,104,F,Other Race,Unknown,1,Emergency,Home or Self Care,2019,EAR004,HEARING LOSS,ENT017,"ENT PROCEDURES, NEC",091,OTHER MAJOR HEAD & NECK PROCEDURES,03,"DISEASES AND DISORDERS OF THE EAR, NOSE, MOUTH AND THROAT",2,Moderate,Minor,Surgical,Medicaid,,,,,false,100653.14,36936.47
Finger Lakes,Monroe,2701005,000413,Strong Memorial Hospital,70 or Older,145,F,White,Not Span/Hispanic,5,Emergency,Home w/ Home Health Services,2019,INJ002,"FRACTURE OF THE SPINE AND BACK, INITIAL ENCOUNTER",RES010,TRACHEOSTOMY,091,OTHER MAJOR HEAD & NECK PROCEDURES,03,"DISEASES AND DISORDERS OF THE EAR, NOSE, MOUTH AND THROAT",1,Minor,Minor,Surgical,Medicare,,,,,true,36503.25,17855.03
Finger Lakes,Monroe,2701001,000409,Highland Hospital,50 to 69,146,M,White,Unknown,2,Elective,Home or Self Care,2019,NEO002,HEAD AND NECK CANCERS - LIP AND ORAL CAVITY,ENT009,TONGUE EXCISION,091,OTHER MAJOR HEAD & NECK PROCEDURES,03,"DISEASES AND DISORDERS OF THE EAR, NOSE, MOUTH AND THROAT",1,Minor,Minor,Surgical,Self-Pay,,,,,false,30391.5,9919.95
Western NY,Erie,1401010,000216,Roswell Park Cancer Institute,70 or Older,OOS,F,White,Not Span/Hispanic,2,Elective,Home or Self Care,2019,NEO010,HEAD AND NECK CANCERS - ALL OTHER TYPES,LYM003,LYMPH NODE DISSECTION,091,OTHER MAJOR HEAD & NECK PROCEDURES,03,"DISEASES AND DISORDERS OF THE EAR, NOSE, MOUTH AND THROAT",1,Minor,Moderate,Surgical,Medicare,Private Health Insurance,,,,false,30406.86,11498.44
Finger Lakes,Monroe,2701005,000413,Strong Memorial Hospital,50 to 69,146,M,Black/African American,Not Span/Hispanic,15,Emergency,Home w/ Home Health Services,2019,NEO008,HEAD AND NECK CANCERS - LARYNGEAL,ADM017,ADMINISTRATION OF NUTRITIONAL AND ELECTROLYTIC SUBSTANCES,091,OTHER MAJOR HEAD & NECK PROCEDURES,03,"DISEASES AND DISORDERS OF THE EAR, NOSE, MOUTH AND THROAT",3,Major,Minor,Surgical,Medicaid,,,,,true,71328.44,36932.63
Finger Lakes,Monroe,2701005,000413,Strong Memorial Hospital,50 to 69,145,F,White,Not Span/Hispanic,11,Elective,Home w/ Home Health Services,2019,RSP007,OTHER SPECIFIED AND UNSPECIFIED UPPER RESPIRATORY DISEASE,ENT011,LARYNGECTOMY,091,OTHER MAJOR HEAD & NECK PROCEDURES,03,"DISEASES AND DISORDERS OF THE EAR, NOSE, MOUTH AND THROAT",3,Major,Moderate,Surgical,Medicare,Medicaid,,,,false,71057.37,36400.92
Finger Lakes,Monroe,2701005,000413,Strong Memorial Hospital,70 or Older,148,M,White,Not Span/Hispanic,2,Elective,Home or Self Care,2019,NEO002,HEAD AND NECK CANCERS - LIP AND ORAL CAVITY,LYM003,LYMPH NODE DISSECTION,091,OTHER MAJOR HEAD & NECK PROCEDURES,03,"DISEASES AND DISORDERS OF THE EAR, NOSE, MOUTH AND THROAT",2,Moderate,Minor,Surgical,Medicare,Private Health Insurance,,,,false,16495.53,8996.59
Finger Lakes,Monroe,2701005,000413,Strong Memorial Hospital,50 to 69,144,F,White,Not Span/Hispanic,5,Emergency,Home w/ Home Health Services,2019,INJ026,OTHER SPECIFIED INJURY,ENT013,ENT REPAIR,091,OTHER MAJOR HEAD & NECK PROCEDURES,03,"DISEASES AND DISORDERS OF THE EAR, NOSE, MOUTH AND THROAT",4,Extreme,Major,Surgical,Miscellaneous/Other,Blue Cross/Blue Shield,,,,true,59096.27,18733.96
New York City,Manhattan,7002053,001463,NYU Langone Hospitals,70 or Older,OOS,F,White,Not Span/Hispanic,2,Elective,Home or Self Care,2019,NEO002,HEAD AND NECK CANCERS - LIP AND ORAL CAVITY,ENT009,TONGUE EXCISION,091,OTHER MAJOR HEAD & NECK PROCEDURES,03,"DISEASES AND DISORDERS OF THE EAR, NOSE, MOUTH AND THROAT",2,Moderate,Moderate,Surgical,Medicare,Medicare,,,,false,84396.1,16414.29
Western NY,Erie,1401005,000210,Erie County Medical Center,70 or Older,142,M,White,Not Span/Hispanic,6,Elective,Home or Self Care,2019,NEO009,HEAD AND NECK CANCERS - TONSILS,ENT007,TONSILLECTOMY AND ADENOIDECTOMY,091,OTHER MAJOR HEAD & NECK PROCEDURES,03,"DISEASES AND DISORDERS OF THE EAR, NOSE, MOUTH AND THROAT",3,Major,Moderate,Surgical,Medicare,Medicaid,,,,false,36541.92,23556.12
Western NY,Erie,1401013,000218,Sisters of Charity Hospital,70 or Older,142,M,White,Not Span/Hispanic,7,Elective,Home or Self Care,2019,NEO009,HEAD AND NECK CANCERS - TONSILS,LYM003,LYMPH NODE DISSECTION,091,OTHER MAJOR HEAD & NECK PROCEDURES,03,"DISEASES AND DISORDERS OF THE EAR, NOSE, MOUTH AND THROAT",3,Major,Major,Surgical,Medicare,Medicare,,,,false,37125.9,16520.34
Long Island,Suffolk,5151001,000245,Stony Brook University Hospital,70 or Older,117,M,Multi-racial,Multi-ethnic,25,Urgent,Home w/ Home Health Services,2019,NEO008,HEAD AND NECK CANCERS - LARYNGEAL,ENT011,LARYNGECTOMY,091,OTHER MAJOR HEAD & NECK PROCEDURES,03,"DISEASES AND DISORDERS OF THE EAR, NOSE, MOUTH AND THROAT",3,Major,Moderate,Surgical,Medicare,Medicare,,,,false,285566.26,107942.87
Western NY,Erie,1401010,000216,Roswell Park Cancer Institute,70 or Older,OOS,M,White,Not Span/Hispanic,8,Elective,Home w/ Home Health Services,2019,NEO002,HEAD AND NECK CANCERS - LIP AND ORAL CAVITY,ENT009,TONGUE EXCISION,091,OTHER MAJOR HEAD & NECK PROCEDURES,03,"DISEASES AND DISORDERS OF THE EAR, NOSE, MOUTH AND THROAT",2,Moderate,Moderate,Surgical,Medicare,Medicare,,,,false,112644.45,40110.2
New York City,Manhattan,7002053,001463,NYU Langone Hospitals,70 or Older,100,M,White,Not Span/Hispanic,2,Elective,Home or Self Care,2019,NEO003,HEAD AND NECK CANCERS - THROAT,LYM003,LYMPH NODE DISSECTION,091,OTHER MAJOR HEAD & NECK PROCEDURES,03,"DISEASES AND DISORDERS OF THE EAR, NOSE, MOUTH AND THROAT",2,Moderate,Moderate,Surgical,Medicare,Medicare,,,,false,149390.83,26311.95
New York City,Manhattan,7002054,001464,New York-Presbyterian Hospital - Columbia Presbyterian Center,0 to 17,100,F,Multi-racial,Not Span/Hispanic,1,Urgent,Home or Self Care,2019,MAL007,RESPIRATORY CONGENITAL MALFORMATIONS,ENT013,ENT REPAIR,091,OTHER MAJOR HEAD & NECK PROCEDURES,03,"DISEASES AND DISORDERS OF THE EAR, NOSE, MOUTH AND THROAT",2,Moderate,Minor,Surgical,Private Health Insurance,Self-Pay,,,,false,39848.01,16913.83
Capital/Adirond,Albany,0101000,000001,Albany Medical Center Hospital,70 or Older,123,M,Other Race,Not Span/Hispanic,1,Elective,Home or Self Care,2019,NEO002,HEAD AND NECK CANCERS - LIP AND ORAL CAVITY,ENT009,TONGUE EXCISION,091,OTHER MAJOR HEAD & NECK PROCEDURES,03,"DISEASES AND DISORDERS OF THE EAR, NOSE, MOUTH AND THROAT",2,Moderate,Moderate,Surgical,Medicare,Medicaid,,,,false,15774.8,5235.54
New York City,Kings,7001020,001305,Maimonides Medical Center,70 or Older,112,F,White,Unknown,3,Elective,Skilled Nursing Home,2019,NEO002,HEAD AND NECK CANCERS - LIP AND ORAL CAVITY,ENT009,TONGUE EXCISION,091,OTHER MAJOR HEAD & NECK PROCEDURES,03,"DISEASES AND DISORDERS OF THE EAR, NOSE, MOUTH AND THROAT",3,Major,Moderate,Surgical,Medicare,Blue Cross/Blue Shield,Self-Pay,,,false,60181.03,19340.3
Hudson Valley,Westchester,5957001,001139,Westchester Medical Center,70 or Older,125,F,White,Not Span/Hispanic,50,Elective,Home w/ Home Health Services,2019,RSP007,OTHER SPECIFIED AND UNSPECIFIED UPPER RESPIRATORY DISEASE,ENT011,LARYNGECTOMY,091,OTHER MAJOR HEAD & NECK PROCEDURES,03,"DISEASES AND DISORDERS OF THE EAR, NOSE, MOUTH AND THROAT",4,Extreme,Extreme,Surgical,Medicare,Private Health Insurance,,,,false,1469267.73,262887.95
Hudson Valley,Westchester,5957001,001139,Westchester Medical Center,50 to 69,125,M,White,Not Span/Hispanic,1,Elective,Home or Self Care,2019,NEO009,HEAD AND NECK CANCERS - TONSILS,LYM003,LYMPH NODE DISSECTION,091,OTHER MAJOR HEAD & NECK PROCEDURES,03,"DISEASES AND DISORDERS OF THE EAR, NOSE, MOUTH AND THROAT",2,Moderate,Moderate,Surgical,Blue Cross/Blue Shield,,,,,false,62098.77,12222.91
Hudson Valley,Dutchess,1302001,000181,Vassar Brothers Medical Center,30 to 49,125,M,White,Not Span/Hispanic,2,Elective,Home or Self Care,2019,MAL007,RESPIRATORY CONGENITAL MALFORMATIONS,RES008,"LUNG, PLEURA, OR DIAPHRAGM RESECTION (OPEN AND THORACOSCOPIC)",091,OTHER MAJOR HEAD & NECK PROCEDURES,03,"DISEASES AND DISORDERS OF THE EAR, NOSE, MOUTH AND THROAT",1,Minor,Minor,Surgical,Medicaid,,,,,false,39931.85,15773.53
Hudson Valley,Dutchess,1302001,000181,Vassar Brothers Medical Center,70 or Older,126,M,White,Not Span/Hispanic,5,Elective,Home w/ Home Health Services,2019,NEO002,HEAD AND NECK CANCERS - LIP AND ORAL CAVITY,LYM003,LYMPH NODE DISSECTION,091,OTHER MAJOR HEAD & NECK PROCEDURES,03,"DISEASES AND DISORDERS OF THE EAR, NOSE, MOUTH AND THROAT",2,Moderate,Minor,Surgical,Medicare,,,,,false,66641.26,34606.81
New York City,Manhattan,7002026,001460,New York Eye and Ear Infirmary of Mount Sinai,30 to 49,113,F,Other Race,Unknown,7,Elective,Home or Self Care,2019,NEO002,HEAD AND NECK CANCERS - LIP AND ORAL CAVITY,ENT009,TONGUE EXCISION,091,OTHER MAJOR HEAD & NECK PROCEDURES,03,"DISEASES AND DISORDERS OF THE EAR, NOSE, MOUTH AND THROAT",2,Moderate,Moderate,Surgical,Medicaid,Medicaid,,,,false,111940.93,30142.43