Hospital Service Area,Hospital County,Operating Certificate Number,Permanent Facility Id,Facility Name,Age Group,Zip Code - 3 digits,Gender,Race,Ethnicity,Length of Stay,Type of Admission,Patient Disposition,Discharge Year,CCS Diagnosis Code,CCS Diagnosis Description,CCS Procedure Code,CCS Procedure Description,APR DRG Code,APR DRG Description,APR MDC Code,APR MDC Description,APR Severity of Illness Code,APR Severity of Illness Description,APR Risk of Mortality,APR Medical Surgical Description,Payment Typology 1,Payment Typology 2,Payment Typology 3,Birth Weight,Abortion Edit Indicator,Emergency Department Indicator,Total Charges,Total Costs
Western NY,Erie,1401005,000210,Erie County Medical Center,18 to 29,143,M,Other Race,Not Span/Hispanic,11,Emergency,Inpatient Rehabilitation Facility,2017,233,Intracranial injury,001,INCISION & EXCISION CNS,910,Craniotomy for multiple significant trauma,25,Multiple Significant Trauma,3,Major,Extreme,Surgical,Miscellaneous/Other,Medicaid,,,N,Y,56080.30,28901.37
New York City,Kings,7001021,001306,New York - Presbyterian Brooklyn Methodist Hospital,18 to 29,112,M,Other Race,Not Span/Hispanic,31,Emergency,Home or Self Care,2017,228,Skull and face fractures,001,INCISION & EXCISION CNS,910,Craniotomy for multiple significant trauma,25,Multiple Significant Trauma,4,Extreme,Extreme,Surgical,Medicaid,Self-Pay,,,N,Y,311271.03,114913.52
Southern Tier,Broome,0303001,000058,United Health Services Hospitals Inc. - Wilson Medical Center,70 or Older,137,F,White,Not Span/Hispanic,5,Emergency,Skilled Nursing Home,2017,233,Intracranial injury,009,OTHER OR THER NERV SYS,910,Craniotomy for multiple significant trauma,25,Multiple Significant Trauma,3,Major,Major,Surgical,Medicare,Medicare,,,N,Y,44014.40,21075.06
Capital/Adirond,Albany,0101000,000001,Albany Medical Center Hospital,30 to 49,122,F,Black/African American,Not Span/Hispanic,10,Trauma,Inpatient Rehabilitation Facility,2017,228,Skull and face fractures,009,OTHER OR THER NERV SYS,910,Craniotomy for multiple significant trauma,25,Multiple Significant Trauma,3,Major,Major,Surgical,Medicaid,,,,N,Y,126181.32,37991.19
Long Island,Nassau,2908000,000511,NYU Winthrop Hospital,70 or Older,115,M,White,Unknown,29,Emergency,Inpatient Rehabilitation Facility,2017,233,Intracranial injury,007,OTHER DX NERV SYS PRCS,910,Craniotomy for multiple significant trauma,25,Multiple Significant Trauma,4,Extreme,Major,Surgical,Miscellaneous/Other,Private Health Insurance,,,N,Y,736804.39,136544.52
Long Island,Suffolk,5154001,000925,Good Samaritan Hospital Medical Center,18 to 29,117,M,White,Spanish/Hispanic,9,Emergency,Home or Self Care,2017,233,Intracranial injury,001,INCISION & EXCISION CNS,910,Craniotomy for multiple significant trauma,25,Multiple Significant Trauma,3,Major,Major,Surgical,Miscellaneous/Other,,,,N,Y,129949.00,30243.08
Hudson Valley,Westchester,5957001,001139,Westchester Medical Center,18 to 29,105,M,Other Race,Not Span/Hispanic,1,Emergency,Expired,2017,231,Other fractures,007,OTHER DX NERV SYS PRCS,910,Craniotomy for multiple significant trauma,25,Multiple Significant Trauma,4,Extreme,Extreme,Surgical,Self-Pay,,,,N,Y,114608.04,34713.57
New York City,Richmond,7004003,001740,Staten Island University Hosp-North,70 or Older,103,M,Other Race,Not Span/Hispanic,20,Emergency,Inpatient Rehabilitation Facility,2017,233,Intracranial injury,009,OTHER OR THER NERV SYS,910,Craniotomy for multiple significant trauma,25,Multiple Significant Trauma,4,Extreme,Extreme,Surgical,Medicaid,,,,N,Y,185989.73,50693.18
New York City,Manhattan,7002054,001458,New York Presbyterian Hospital - New York Weill Cornell Center,30 to 49,113,M,White,Not Span/Hispanic,11,Emergency,Home or Self Care,2017,233,Intracranial injury,009,OTHER OR THER NERV SYS,910,Craniotomy for multiple significant trauma,25,Multiple Significant Trauma,3,Major,Major,Surgical,Miscellaneous/Other,Self-Pay,,,N,Y,198893.42,95248.33
New York City,Queens,7003000,001626,Elmhurst Hospital Center,30 to 49,113,M,Other Race,Spanish/Hispanic,7,Emergency,Home or Self Care,2017,233,Intracranial injury,009,OTHER OR THER NERV SYS,910,Craniotomy for multiple significant trauma,25,Multiple Significant Trauma,2,Moderate,Moderate,Surgical,Miscellaneous/Other,,,,N,Y,56587.31,28361.11
New York City,Queens,7003010,001637,New York - Presbyterian/Queens,70 or Older,112,F,Other Race,Not Span/Hispanic,5,Emergency,Home w/ Home Health Services,2017,233,Intracranial injury,009,OTHER OR THER NERV SYS,910,Craniotomy for multiple significant trauma,25,Multiple Significant Trauma,2,Moderate,Major,Surgical,Medicare,Medicare,Medicaid,,N,Y,69455.46,23900.56
Capital/Adirond,Albany,0101000,000001,Albany Medical Center Hospital,0 to 17,121,M,White,Not Span/Hispanic,11,Trauma,Home w/ Home Health Services,2017,233,Intracranial injury,001,INCISION & EXCISION CNS,910,Craniotomy for multiple significant trauma,25,Multiple Significant Trauma,3,Major,Major,Surgical,Miscellaneous/Other,Medicaid,,,N,Y,151059.67,44013.42
Capital/Adirond,Albany,0101000,000001,Albany Medical Center Hospital,0 to 17,121,F,White,Not Span/Hispanic,13,Trauma,Home or Self Care,2017,228,Skull and face fractures,001,INCISION & EXCISION CNS,910,Craniotomy for multiple significant trauma,25,Multiple Significant Trauma,3,Major,Major,Surgical,Miscellaneous/Other,Medicaid,,,N,Y,112081.00,36820.26
New York City,Bronx,7000002,001165,Jacobi Medical Center,18 to 29,104,M,Black/African American,Not Span/Hispanic,25,Emergency,Inpatient Rehabilitation Facility,2017,233,Intracranial injury,054,OT VASC CATH; NOT HEART,910,Craniotomy for multiple significant trauma,25,Multiple Significant Trauma,4,Extreme,Major,Surgical,Miscellaneous/Other,Medicaid,,,N,Y,174479.36,103026.40
Central NY,Onondaga,3301007,000635,University Hospital SUNY Health Science Center,50 to 69,132,M,Multi-racial,Not Span/Hispanic,16,Emergency,Skilled Nursing Home,2017,233,Intracranial injury,001,INCISION & EXCISION CNS,910,Craniotomy for multiple significant trauma,25,Multiple Significant Trauma,4,Extreme,Major,Surgical,Medicaid,,,,N,Y,195869.68,62011.08
New York City,Kings,7001020,001305,Maimonides Medical Center,50 to 69,112,M,Other Race,Not Span/Hispanic,24,Emergency,Inpatient Rehabilitation Facility,2017,233,Intracranial injury,001,INCISION & EXCISION CNS,910,Craniotomy for multiple significant trauma,25,Multiple Significant Trauma,4,Extreme,Extreme,Surgical,Medicare,,Medicaid,,N,Y,328783.00,82796.91
New York City,Queens,7003003,001629,Jamaica Hospital Medical Center,30 to 49,113,M,White,Unknown,55,Emergency,Skilled Nursing Home,2017,236,Open wounds of extremities,001,INCISION & EXCISION CNS,910,Craniotomy for multiple significant trauma,25,Multiple Significant Trauma,3,Major,Major,Surgical,Medicaid,,,,N,Y,427236.73,159205.35
New York City,Manhattan,7002054,001458,New York Presbyterian Hospital - New York Weill Cornell Center,0 to 17,104,M,Other Race,Not Span/Hispanic,32,Emergency,Inpatient Rehabilitation Facility,2017,233,Intracranial injury,216,RESP INTUB/MECH VENTIL,910,Craniotomy for multiple significant trauma,25,Multiple Significant Trauma,4,Extreme,Extreme,Surgical,Miscellaneous/Other,Private Health Insurance,Self-Pay,,N,N,753970.66,396658.39
New York City,Manhattan,7002001,001438,Bellevue Hospital Center,50 to 69,104,M,Other Race,Not Span/Hispanic,15,Emergency,Home or Self Care,2017,228,Skull and face fractures,144,"TRTMNT,FACE FRACT/DISLC",910,Craniotomy for multiple significant trauma,25,Multiple Significant Trauma,2,Moderate,Minor,Surgical,Miscellaneous/Other,Medicare,Blue Cross/Blue Shield,,N,Y,118247.12,76239.59
Capital/Adirond,Albany,0101000,000001,Albany Medical Center Hospital,18 to 29,121,M,Black/African American,Not Span/Hispanic,12,Trauma,Inpatient Rehabilitation Facility,2017,228,Skull and face fractures,227,"OT DX PRC (INTERVW,EVAL",910,Craniotomy for multiple significant trauma,25,Multiple Significant Trauma,4,Extreme,Extreme,Surgical,Miscellaneous/Other,Medicaid,,,N,Y,227890.37,62593.84
Long Island,Nassau,2950001,000527,South Nassau Communities Hospital,18 to 29,,F,Black/African American,Not Span/Hispanic,27,Trauma,Home w/ Home Health Services,2017,233,Intracranial injury,007,OTHER DX NERV SYS PRCS,910,Craniotomy for multiple significant trauma,25,Multiple Significant Trauma,4,Extreme,Major,Surgical,Miscellaneous/Other,Medicaid,Medicaid,,N,Y,328404.55,73073.73
Hudson Valley,Westchester,5957001,001139,Westchester Medical Center,70 or Older,109,F,Other Race,Spanish/Hispanic,1,Emergency,Expired,2017,233,Intracranial injury,216,RESP INTUB/MECH VENTIL,910,Craniotomy for multiple significant trauma,25,Multiple Significant Trauma,4,Extreme,Extreme,Surgical,Miscellaneous/Other,Medicare,Private Health Insurance,,N,Y,146748.24,29378.35
New York City,Bronx,7000002,001165,Jacobi Medical Center,70 or Older,104,F,Other Race,Unknown,7,Emergency,Expired,2017,233,Intracranial injury,216,RESP INTUB/MECH VENTIL,910,Craniotomy for multiple significant trauma,25,Multiple Significant Trauma,4,Extreme,Major,Surgical,Medicare,Medicare,Blue Cross/Blue Shield,,N,Y,71839.62,42419.79
New York City,Queens,7003003,001629,Jamaica Hospital Medical Center,18 to 29,104,M,Black/African American,Not Span/Hispanic,17,Emergency,Inpatient Rehabilitation Facility,2017,233,Intracranial injury,001,INCISION & EXCISION CNS,910,Craniotomy for multiple significant trauma,25,Multiple Significant Trauma,3,Major,Moderate,Surgical,Medicaid,,,,N,Y,94305.94,36052.46
Capital/Adirond,Albany,0101000,000001,Albany Medical Center Hospital,30 to 49,121,M,White,Not Span/Hispanic,5,Trauma,Home w/ Home Health Services,2017,233,Intracranial injury,148,OT FRACTURE/DISLOC PRC,910,Craniotomy for multiple significant trauma,25,Multiple Significant Trauma,3,Major,Extreme,Surgical,Miscellaneous/Other,"Managed Care, Unspecified",,,N,Y,83870.63,23850.42
Long Island,Suffolk,5151001,000245,University Hospital,18 to 29,117,M,Other Race,Not Span/Hispanic,14,Emergency,Inpatient Rehabilitation Facility,2017,233,Intracranial injury,009,OTHER OR THER NERV SYS,910,Craniotomy for multiple significant trauma,25,Multiple Significant Trauma,3,Major,Major,Surgical,Miscellaneous/Other,Blue Cross/Blue Shield,,,N,Y,252811.39,87802.96
New York City,Kings,7001020,001305,Maimonides Medical Center,70 or Older,112,F,Other Race,Spanish/Hispanic,21,Emergency,Skilled Nursing Home,2017,233,Intracranial injury,009,OTHER OR THER NERV SYS,910,Craniotomy for multiple significant trauma,25,Multiple Significant Trauma,4,Extreme,Major,Surgical,Medicare,,Medicaid,,N,Y,303367.00,70114.06
New York City,Queens,7003003,001629,Jamaica Hospital Medical Center,30 to 49,,M,Other Race,Multi-ethnic,8,Emergency,Home or Self Care,2017,233,Intracranial injury,009,OTHER OR THER NERV SYS,910,Craniotomy for multiple significant trauma,25,Multiple Significant Trauma,2,Moderate,Minor,Surgical,Medicaid,,,,N,Y,62879.39,20432.74
Central NY,Oneida,3202002,000598,St Elizabeth Medical Center,30 to 49,135,M,White,Not Span/Hispanic,5,Emergency,Expired,2017,228,Skull and face fractures,009,OTHER OR THER NERV SYS,910,Craniotomy for multiple significant trauma,25,Multiple Significant Trauma,4,Extreme,Extreme,Surgical,Medicare,,,,N,Y,82392.00,35235.52
New York City,Manhattan,7002001,001438,Bellevue Hospital Center,18 to 29,112,M,Other Race,Spanish/Hispanic,5,Emergency,Home or Self Care,2017,233,Intracranial injury,009,OTHER OR THER NERV SYS,910,Craniotomy for multiple significant trauma,25,Multiple Significant Trauma,2,Moderate,Moderate,Surgical,Medicaid,,,,N,Y,49189.98,31715.14
Long Island,Suffolk,5151001,000245,University Hospital,18 to 29,119,M,White,Not Span/Hispanic,10,Emergency,Home or Self Care,2017,228,Skull and face fractures,142,PARTIAL EXCISION BONE,910,Craniotomy for multiple significant trauma,25,Multiple Significant Trauma,4,Extreme,Extreme,Surgical,Miscellaneous/Other,,,,N,N,140025.50,46204.01
Long Island,Suffolk,5151001,000245,University Hospital,18 to 29,117,M,Black/African American,Not Span/Hispanic,1,Emergency,Expired,2017,233,Intracranial injury,231,OTHER THERAPEUTIC PRCS,910,Craniotomy for multiple significant trauma,25,Multiple Significant Trauma,4,Extreme,Extreme,Surgical,Self-Pay,,,,N,Y,138298.19,43590.41
Western NY,Erie,1401005,000210,Erie County Medical Center,18 to 29,142,M,White,Not Span/Hispanic,13,Emergency,Inpatient Rehabilitation Facility,2017,233,Intracranial injury,216,RESP INTUB/MECH VENTIL,910,Craniotomy for multiple significant trauma,25,Multiple Significant Trauma,4,Extreme,Major,Surgical,Medicaid,,,,N,Y,70165.14,38516.21
Western NY,Erie,1401005,000210,Erie County Medical Center,70 or Older,141,M,White,Not Span/Hispanic,13,Emergency,Expired,2017,233,Intracranial injury,222,BLOOD TRANSFUSION,910,Craniotomy for multiple significant trauma,25,Multiple Significant Trauma,4,Extreme,Extreme,Surgical,Medicare,Medicare,,,N,Y,81629.98,43017.22
Western NY,Erie,1401005,000210,Erie County Medical Center,70 or Older,140,F,White,Not Span/Hispanic,4,Emergency,Expired,2017,233,Intracranial injury,054,OT VASC CATH; NOT HEART,910,Craniotomy for multiple significant trauma,25,Multiple Significant Trauma,4,Extreme,Extreme,Surgical,Miscellaneous/Other,Medicare,Medicare,,N,Y,85734.46,39250.47
New York City,Manhattan,7002001,001438,Bellevue Hospital Center,50 to 69,OOS,M,Other Race,Not Span/Hispanic,1,Emergency,Expired,2017,233,Intracranial injury,009,OTHER OR THER NERV SYS,910,Craniotomy for multiple significant trauma,25,Multiple Significant Trauma,4,Extreme,Extreme,Surgical,Private Health Insurance,,,,N,Y,14444.58,9313.11
New York City,Manhattan,7002001,001438,Bellevue Hospital Center,18 to 29,100,M,White,Not Span/Hispanic,6,Emergency,Expired,2017,233,Intracranial injury,216,RESP INTUB/MECH VENTIL,910,Craniotomy for multiple significant trauma,25,Multiple Significant Trauma,4,Extreme,Major,Surgical,Miscellaneous/Other,Blue Cross/Blue Shield,,,N,Y,69962.66,45108.29
New York City,Manhattan,7002001,001438,Bellevue Hospital Center,30 to 49,100,M,Other Race,Not Span/Hispanic,6,Emergency,Expired,2017,233,Intracranial injury,054,OT VASC CATH; NOT HEART,910,Craniotomy for multiple significant trauma,25,Multiple Significant Trauma,4,Extreme,Extreme,Surgical,Miscellaneous/Other,Private Health Insurance,Private Health Insurance,,N,Y,75130.45,48440.21
Capital/Adirond,Albany,0101000,000001,Albany Medical Center Hospital,30 to 49,OOS,F,White,Not Span/Hispanic,9,Trauma,Inpatient Rehabilitation Facility,2017,233,Intracranial injury,007,OTHER DX NERV SYS PRCS,910,Craniotomy for multiple significant trauma,25,Multiple Significant Trauma,3,Major,Major,Surgical,Medicaid,Medicaid,,,N,Y,104515.30,31714.68
Capital/Adirond,Albany,0101000,000001,Albany Medical Center Hospital,18 to 29,128,F,Other Race,Not Span/Hispanic,7,Trauma,Expired,2017,233,Intracranial injury,001,INCISION & EXCISION CNS,910,Craniotomy for multiple significant trauma,25,Multiple Significant Trauma,4,Extreme,Extreme,Surgical,Miscellaneous/Other,Blue Cross/Blue Shield,,,N,Y,142491.46,30227.74
Long Island,Nassau,2908000,000511,NYU Winthrop Hospital,18 to 29,115,M,White,Not Span/Hispanic,18,Emergency,Inpatient Rehabilitation Facility,2017,233,Intracranial injury,007,OTHER DX NERV SYS PRCS,910,Craniotomy for multiple significant trauma,25,Multiple Significant Trauma,4,Extreme,Major,Surgical,Medicaid,,,,N,Y,501917.02,100922.94
Finger Lakes,Monroe,2701005,000413,Strong Memorial Hospital,30 to 49,144,M,White,Not Span/Hispanic,16,Emergency,Expired,2017,233,Intracranial injury,216,RESP INTUB/MECH VENTIL,910,Craniotomy for multiple significant trauma,25,Multiple Significant Trauma,4,Extreme,Extreme,Surgical,Miscellaneous/Other,Blue Cross/Blue Shield,Self-Pay,,N,Y,291101.80,126913.72
Finger Lakes,Monroe,2701005,000413,Strong Memorial Hospital,30 to 49,144,F,White,Not Span/Hispanic,25,Emergency,Skilled Nursing Home,2017,231,Other fractures,054,OT VASC CATH; NOT HEART,910,Craniotomy for multiple significant trauma,25,Multiple Significant Trauma,4,Extreme,Major,Surgical,Miscellaneous/Other,Medicaid,Medicaid,,N,Y,187239.89,94906.78
Central NY,Onondaga,3301007,000635,University Hospital SUNY Health Science Center,30 to 49,138,M,White,Not Span/Hispanic,8,Trauma,Inpatient Rehabilitation Facility,2017,228,Skull and face fractures,161,OT OR THER PRCS ON BONE,910,Craniotomy for multiple significant trauma,25,Multiple Significant Trauma,3,Major,Moderate,Surgical,Medicaid,,,,N,Y,147436.74,45709.57
New York City,Richmond,7004003,001740,Staten Island University Hosp-North,70 or Older,103,F,White,Not Span/Hispanic,19,Trauma,Inpatient Rehabilitation Facility,2017,233,Intracranial injury,001,INCISION & EXCISION CNS,910,Craniotomy for multiple significant trauma,25,Multiple Significant Trauma,3,Major,Major,Surgical,Private Health Insurance,Medicare,,,N,Y,194414.84,53879.98
Hudson Valley,Dutchess,1302001,000181,Vassar Brothers Medical Center,70 or Older,125,M,White,Not Span/Hispanic,5,Emergency,Home w/ Home Health Services,2017,233,Intracranial injury,009,OTHER OR THER NERV SYS,910,Craniotomy for multiple significant trauma,25,Multiple Significant Trauma,3,Major,Major,Surgical,Medicare,Blue Cross/Blue Shield,,,N,Y,54575.45,16267.05
New York City,Bronx,7000014,001176,SBH Health System,30 to 49,104,M,Black/African American,Spanish/Hispanic,3,Trauma,Expired,2017,233,Intracranial injury,001,INCISION & EXCISION CNS,910,Craniotomy for multiple significant trauma,25,Multiple Significant Trauma,4,Extreme,Extreme,Surgical,Medicaid,Miscellaneous/Other,Medicaid,,N,Y,83316.28,34117.91
New York City,Bronx,7000014,001176,SBH Health System,18 to 29,104,M,White,Spanish/Hispanic,16,Trauma,Home or Self Care,2017,233,Intracranial injury,009,OTHER OR THER NERV SYS,910,Craniotomy for multiple significant trauma,25,Multiple Significant Trauma,4,Extreme,Major,Surgical,Miscellaneous/Other,Medicaid,,,N,Y,142161.90,44788.88
New York City,Manhattan,7002001,001438,Bellevue Hospital Center,30 to 49,100,M,Other Race,Not Span/Hispanic,3,Emergency,Home or Self Care,2017,233,Intracranial injury,216,RESP INTUB/MECH VENTIL,910,Craniotomy for multiple significant trauma,25,Multiple Significant Trauma,4,Extreme,Major,Surgical,"Managed Care, Unspecified",Medicaid,,,N,Y,37264.27,24026.06
New York City,Manhattan,7002001,001438,Bellevue Hospital Center,50 to 69,,M,White,Not Span/Hispanic,1,Emergency,Expired,2017,233,Intracranial injury,001,INCISION & EXCISION CNS,910,Craniotomy for multiple significant trauma,25,Multiple Significant Trauma,4,Extreme,Extreme,Surgical,Private Health Insurance,,,,N,Y,28964.10,18674.55
New York City,Queens,7003000,001626,Elmhurst Hospital Center,18 to 29,113,M,Other Race,Spanish/Hispanic,18,Emergency,Psychiatric Hospital or Unit of Hosp,2017,236,Open wounds of extremities,001,INCISION & EXCISION CNS,910,Craniotomy for multiple significant trauma,25,Multiple Significant Trauma,3,Major,Moderate,Surgical,Blue Cross/Blue Shield,,,,N,Y,134672.70,67496.88
Long Island,Nassau,2951001,000541,North Shore University Hospital,50 to 69,115,M,White,Spanish/Hispanic,9,Trauma,Inpatient Rehabilitation Facility,2017,228,Skull and face fractures,144,"TRTMNT,FACE FRACT/DISLC",910,Craniotomy for multiple significant trauma,25,Multiple Significant Trauma,4,Extreme,Extreme,Surgical,Medicaid,Medicaid,,,N,Y,174660.26,34492.01
Long Island,Nassau,2951001,000541,North Shore University Hospital,18 to 29,110,M,Black/African American,Not Span/Hispanic,1,Trauma,Expired,2017,233,Intracranial injury,009,OTHER OR THER NERV SYS,910,Craniotomy for multiple significant trauma,25,Multiple Significant Trauma,4,Extreme,Extreme,Surgical,Blue Cross/Blue Shield,,,,N,Y,77723.73,16988.94
Southern Tier,Broome,0303001,000058,United Health Services Hospitals Inc. - Wilson Medical Center,30 to 49,139,F,White,Not Span/Hispanic,5,Emergency,Expired,2017,233,Intracranial injury,216,RESP INTUB/MECH VENTIL,910,Craniotomy for multiple significant trauma,25,Multiple Significant Trauma,4,Extreme,Extreme,Surgical,Miscellaneous/Other,,,,N,Y,106359.75,34441.19
Hudson Valley,Westchester,5957001,001139,Westchester Medical Center,50 to 69,105,M,White,Not Span/Hispanic,13,Emergency,Expired,2017,233,Intracranial injury,009,OTHER OR THER NERV SYS,910,Craniotomy for multiple significant trauma,25,Multiple Significant Trauma,4,Extreme,Extreme,Surgical,Blue Cross/Blue Shield,Medicare,,,N,Y,661708.85,138079.66
New York City,Queens,7003003,001629,Jamaica Hospital Medical Center,30 to 49,116,M,Black/African American,Not Span/Hispanic,25,Emergency,Home w/ Home Health Services,2017,233,Intracranial injury,216,RESP INTUB/MECH VENTIL,910,Craniotomy for multiple significant trauma,25,Multiple Significant Trauma,3,Major,Minor,Surgical,Medicaid,,,,N,Y,148898.83,55092.20
New York City,Queens,7003003,001629,Jamaica Hospital Medical Center,18 to 29,114,M,Other Race,Not Span/Hispanic,11,Emergency,Expired,2017,233,Intracranial injury,001,INCISION & EXCISION CNS,910,Craniotomy for multiple significant trauma,25,Multiple Significant Trauma,4,Extreme,Extreme,Surgical,Self-Pay,,,,N,Y,121229.00,37975.51
New York City,Queens,7003000,001626,Elmhurst Hospital Center,70 or Older,113,M,Other Race,Spanish/Hispanic,4,Emergency,Expired,2017,234,Crushing injury or internal injury,039,INCISION OF PLEURA,910,Craniotomy for multiple significant trauma,25,Multiple Significant Trauma,4,Extreme,Extreme,Surgical,Miscellaneous/Other,Medicare,Medicaid,,N,Y,59177.91,29659.50
Long Island,Suffolk,5154000,000924,Southside Hospital,18 to 29,117,F,White,Unknown,11,Trauma,Inpatient Rehabilitation Facility,2017,233,Intracranial injury,009,OTHER OR THER NERV SYS,910,Craniotomy for multiple significant trauma,25,Multiple Significant Trauma,2,Moderate,Moderate,Surgical,Private Health Insurance,Medicaid,Medicaid,,N,Y,172388.71,51356.11
Long Island,Suffolk,5154000,000924,Southside Hospital,50 to 69,117,M,Other Race,Not Span/Hispanic,6,Trauma,Expired,2017,233,Intracranial injury,009,OTHER OR THER NERV SYS,910,Craniotomy for multiple significant trauma,25,Multiple Significant Trauma,4,Extreme,Extreme,Surgical,Medicare,Medicare,Medicaid,,N,Y,249973.44,63337.85
Finger Lakes,Monroe,2701005,000413,Strong Memorial Hospital,18 to 29,144,M,White,Not Span/Hispanic,4,Emergency,Home or Self Care,2017,228,Skull and face fractures,148,OT FRACTURE/DISLOC PRC,910,Craniotomy for multiple significant trauma,25,Multiple Significant Trauma,2,Moderate,Minor,Surgical,Miscellaneous/Other,Private Health Insurance,Self-Pay,,N,Y,48305.11,24137.61
Finger Lakes,Monroe,2701005,000413,Strong Memorial Hospital,50 to 69,141,M,White,Not Span/Hispanic,2,Emergency,Expired,2017,233,Intracranial injury,009,OTHER OR THER NERV SYS,910,Craniotomy for multiple significant trauma,25,Multiple Significant Trauma,4,Extreme,Extreme,Surgical,Miscellaneous/Other,Medicare,Medicare,,N,Y,42641.72,18468.66
Hudson Valley,Westchester,5957001,001139,Westchester Medical Center,30 to 49,105,M,White,Not Span/Hispanic,14,Emergency,Expired,2017,233,Intracranial injury,007,OTHER DX NERV SYS PRCS,910,Craniotomy for multiple significant trauma,25,Multiple Significant Trauma,4,Extreme,Extreme,Surgical,Miscellaneous/Other,Medicaid,,,N,Y,447412.94,85196.08
New York City,Bronx,7000001,001178,Bronx-Lebanon Hospital Center - Concourse Division,18 to 29,OOS,M,Other Race,Unknown,1,Emergency,Short-term Hospital,2017,228,Skull and face fractures,009,OTHER OR THER NERV SYS,910,Craniotomy for multiple significant trauma,25,Multiple Significant Trauma,4,Extreme,Major,Surgical,Self-Pay,,,,N,Y,44941.98,47451.97
New York City,Kings,7002053,001304,NYU Langone Hospital-Brooklyn,50 to 69,112,F,White,Not Span/Hispanic,11,Emergency,Short-term Hospital,2017,233,Intracranial injury,001,INCISION & EXCISION CNS,910,Craniotomy for multiple significant trauma,25,Multiple Significant Trauma,4,Extreme,Major,Surgical,Miscellaneous/Other,,,,N,Y,485177.05,251361.21