Hospital Service Area,Hospital County,Operating Certificate Number,Permanent Facility Id,Facility Name,Age Group,Zip Code - 3 digits,Gender,Race,Ethnicity,Length of Stay,Type of Admission,Patient Disposition,Discharge Year,CCS Diagnosis Code,CCS Diagnosis Description,CCS Procedure Code,CCS Procedure Description,APR DRG Code,APR DRG Description,APR MDC Code,APR MDC Description,APR Severity of Illness Code,APR Severity of Illness Description,APR Risk of Mortality,APR Medical Surgical Description,Payment Typology 1,Payment Typology 2,Payment Typology 3,Birth Weight,Abortion Edit Indicator,Emergency Department Indicator,Total Charges,Total Costs
New York City,Kings,7001021,001306,New York - Presbyterian Brooklyn Methodist Hospital,18 to 29,,M,White,Not Span/Hispanic,5,Trauma,Home or Self Care,2020,INJ010,"INTERNAL ORGAN INJURY, INITIAL ENCOUNTER",LYM006,SPLEEN PROCEDURES (EXCLUDING SPLENECTOMY),911,EXTENSIVE ABDOMINAL/THORACIC PROCEDURES FOR MULT SIGNIFICANT TRAUMA,25,HUMAN IMMUNODEFICIENCY VIRUS INFECTIONS,3,Major,Minor,Surgical,Medicaid,Self-Pay,,,,Y,76030.49,25200.07
Western NY,Erie,1401005,000210,Erie County Medical Center,18 to 29,142,M,Black/African American,Not Span/Hispanic,11,Emergency,Home or Self Care,2020,INJ010,"INTERNAL ORGAN INJURY, INITIAL ENCOUNTER",RES005,CHEST TUBE PLACEMENT AND THERAPEUTIC THORACENTESIS,911,EXTENSIVE ABDOMINAL/THORACIC PROCEDURES FOR MULT SIGNIFICANT TRAUMA,25,HUMAN IMMUNODEFICIENCY VIRUS INFECTIONS,4,Extreme,Extreme,Surgical,Medicaid,,,,,Y,94551.3,44107.96
Western NY,Erie,1401005,000210,Erie County Medical Center,18 to 29,140,M,Black/African American,Unknown,8,Emergency,Short-term Hospital,2020,INJ010,"INTERNAL ORGAN INJURY, INITIAL ENCOUNTER",CAR019,SEPTAL REPAIR AND OTHER THERAPEUTIC HEART PROCEDURES,911,EXTENSIVE ABDOMINAL/THORACIC PROCEDURES FOR MULT SIGNIFICANT TRAUMA,25,HUMAN IMMUNODEFICIENCY VIRUS INFECTIONS,3,Major,Major,Surgical,Department of Corrections,,,,,Y,63549.54,29618.56
Western NY,Erie,1401005,000210,Erie County Medical Center,30 to 49,,M,Black/African American,Unknown,5,Emergency,Home w/ Home Health Services,2020,INJ010,"INTERNAL ORGAN INJURY, INITIAL ENCOUNTER",GIS021,GI SYSTEM REPAIR (EXCLUDING ANORECTAL),911,EXTENSIVE ABDOMINAL/THORACIC PROCEDURES FOR MULT SIGNIFICANT TRAUMA,25,HUMAN IMMUNODEFICIENCY VIRUS INFECTIONS,4,Extreme,Minor,Surgical,Medicaid,Medicaid,,,,Y,41305.57,16861.68
Finger Lakes,Monroe,2701005,000413,Strong Memorial Hospital,30 to 49,146,M,Black/African American,Not Span/Hispanic,9,Emergency,Home or Self Care,2020,INJ010,"INTERNAL ORGAN INJURY, INITIAL ENCOUNTER",GIS009,COLECTOMY,911,EXTENSIVE ABDOMINAL/THORACIC PROCEDURES FOR MULT SIGNIFICANT TRAUMA,25,HUMAN IMMUNODEFICIENCY VIRUS INFECTIONS,3,Major,Moderate,Surgical,Medicaid,,,,,Y,72816.69,30203.8
Finger Lakes,Monroe,2701005,000413,Strong Memorial Hospital,50 to 69,148,M,White,Not Span/Hispanic,25,Emergency,Expired,2020,INJ016,"INJURY TO BLOOD VESSELS, INITIAL ENCOUNTER",GIS009,COLECTOMY,911,EXTENSIVE ABDOMINAL/THORACIC PROCEDURES FOR MULT SIGNIFICANT TRAUMA,25,HUMAN IMMUNODEFICIENCY VIRUS INFECTIONS,4,Extreme,Extreme,Surgical,Miscellaneous/Other,Blue Cross/Blue Shield,,,,Y,497483.71,197228.63
Finger Lakes,Monroe,2701005,000413,Strong Memorial Hospital,18 to 29,146,M,Multi-racial,Not Span/Hispanic,20,Emergency,Home w/ Home Health Services,2020,INJ011,"OPEN WOUNDS OF HEAD AND NECK, INITIAL ENCOUNTER",ENT006,ENT DRAINAGE (EXCLUDING MYRINGOTOMY),911,EXTENSIVE ABDOMINAL/THORACIC PROCEDURES FOR MULT SIGNIFICANT TRAUMA,25,HUMAN IMMUNODEFICIENCY VIRUS INFECTIONS,4,Extreme,Major,Surgical,Medicaid,,,,,Y,193176.78,69390.94
Finger Lakes,Monroe,2701005,000413,Strong Memorial Hospital,70 or Older,144,F,White,Not Span/Hispanic,1,Emergency,Expired,2020,INJ010,"INTERNAL ORGAN INJURY, INITIAL ENCOUNTER",LYM005,SPLENECTOMY,911,EXTENSIVE ABDOMINAL/THORACIC PROCEDURES FOR MULT SIGNIFICANT TRAUMA,25,HUMAN IMMUNODEFICIENCY VIRUS INFECTIONS,4,Extreme,Extreme,Surgical,Miscellaneous/Other,Medicare,,,,Y,71643.98,18534.8
New York City,Bronx,7000001,001178,BronxCare Hospital Center,18 to 29,104,M,Black/African American,Spanish/Hispanic,3,Emergency,Home or Self Care,2020,INJ010,"INTERNAL ORGAN INJURY, INITIAL ENCOUNTER",URN007,URINARY TRACT REPAIR,911,EXTENSIVE ABDOMINAL/THORACIC PROCEDURES FOR MULT SIGNIFICANT TRAUMA,25,HUMAN IMMUNODEFICIENCY VIRUS INFECTIONS,2,Moderate,Moderate,Surgical,Medicaid,Medicaid,,,,Y,22193.3,22854.5
Finger Lakes,Monroe,2701005,000413,Strong Memorial Hospital,18 to 29,146,M,Multi-racial,Not Span/Hispanic,3,Emergency,Home or Self Care,2020,INJ010,"INTERNAL ORGAN INJURY, INITIAL ENCOUNTER",CAR010,LIGATION AND EMBOLIZATION OF VESSELS,911,EXTENSIVE ABDOMINAL/THORACIC PROCEDURES FOR MULT SIGNIFICANT TRAUMA,25,HUMAN IMMUNODEFICIENCY VIRUS INFECTIONS,3,Major,Major,Surgical,Self-Pay,,,,,Y,77294.3,25609.9
New York City,Kings,7001021,001306,New York - Presbyterian Brooklyn Methodist Hospital,30 to 49,114,M,Black/African American,Not Span/Hispanic,2,Emergency,Home or Self Care,2020,INJ010,"INTERNAL ORGAN INJURY, INITIAL ENCOUNTER",GIS005,EXPLORATION OF PERITONEAL CAVITY,911,EXTENSIVE ABDOMINAL/THORACIC PROCEDURES FOR MULT SIGNIFICANT TRAUMA,25,HUMAN IMMUNODEFICIENCY VIRUS INFECTIONS,3,Major,Moderate,Surgical,"Managed Care, Unspecified",Medicaid,Miscellaneous/Other,,,Y,60348.63,16912.39
Capital/Adirond,Otsego,3824000,000746,Mary Imogene Bassett Hospital,50 to 69,133,M,White,Not Span/Hispanic,7,Emergency,Inpatient Rehabilitation Facility,2020,INJ003,"FRACTURE OF TORSO, INITIAL ENCOUNTER",URN007,URINARY TRACT REPAIR,911,EXTENSIVE ABDOMINAL/THORACIC PROCEDURES FOR MULT SIGNIFICANT TRAUMA,25,HUMAN IMMUNODEFICIENCY VIRUS INFECTIONS,2,Moderate,Moderate,Surgical,Blue Cross/Blue Shield,,,,,Y,65090.05,31392.07
New York City,Manhattan,7002032,001469,Mount Sinai Morningside,30 to 49,100,M,Other Race,Not Span/Hispanic,8,Emergency,Court/Law Enforcement,2020,INJ010,"INTERNAL ORGAN INJURY, INITIAL ENCOUNTER",URN008,NEPHRECTOMY AND URETERECTOMY,911,EXTENSIVE ABDOMINAL/THORACIC PROCEDURES FOR MULT SIGNIFICANT TRAUMA,25,HUMAN IMMUNODEFICIENCY VIRUS INFECTIONS,3,Major,Extreme,Surgical,Medicaid,Self-Pay,Self-Pay,,,Y,146382.12,34711.98
New York City,Manhattan,7002032,001469,Mount Sinai Morningside,50 to 69,100,M,Other Race,Spanish/Hispanic,7,Emergency,Home or Self Care,2020,INJ012,"OPEN WOUNDS TO LIMBS, INITIAL ENCOUNTER",RES005,CHEST TUBE PLACEMENT AND THERAPEUTIC THORACENTESIS,911,EXTENSIVE ABDOMINAL/THORACIC PROCEDURES FOR MULT SIGNIFICANT TRAUMA,25,HUMAN IMMUNODEFICIENCY VIRUS INFECTIONS,4,Extreme,Moderate,Surgical,Private Health Insurance,Self-Pay,,,,Y,169153.93,39180.33
Capital/Adirond,Albany,0101000,000001,Albany Medical Center Hospital,70 or Older,121,F,White,Not Span/Hispanic,4,Trauma,Home or Self Care,2020,INJ010,"INTERNAL ORGAN INJURY, INITIAL ENCOUNTER",GIS005,EXPLORATION OF PERITONEAL CAVITY,911,EXTENSIVE ABDOMINAL/THORACIC PROCEDURES FOR MULT SIGNIFICANT TRAUMA,25,HUMAN IMMUNODEFICIENCY VIRUS INFECTIONS,2,Moderate,Minor,Surgical,Miscellaneous/Other,Medicare,Blue Cross/Blue Shield,,,Y,82410.48,25649.09
Capital/Adirond,Albany,0101000,000001,Albany Medical Center Hospital,0 to 17,112,M,White,Not Span/Hispanic,4,Trauma,Home or Self Care,2020,INJ010,"INTERNAL ORGAN INJURY, INITIAL ENCOUNTER",CAR010,LIGATION AND EMBOLIZATION OF VESSELS,911,EXTENSIVE ABDOMINAL/THORACIC PROCEDURES FOR MULT SIGNIFICANT TRAUMA,25,HUMAN IMMUNODEFICIENCY VIRUS INFECTIONS,3,Major,Minor,Surgical,Private Health Insurance,,,,,Y,44495.48,15931.49
Capital/Adirond,Albany,0101000,000001,Albany Medical Center Hospital,50 to 69,120,F,Other Race,Not Span/Hispanic,3,Emergency,Home or Self Care,2020,INJ010,"INTERNAL ORGAN INJURY, INITIAL ENCOUNTER",CAR010,LIGATION AND EMBOLIZATION OF VESSELS,911,EXTENSIVE ABDOMINAL/THORACIC PROCEDURES FOR MULT SIGNIFICANT TRAUMA,25,HUMAN IMMUNODEFICIENCY VIRUS INFECTIONS,2,Moderate,Minor,Surgical,"Managed Care, Unspecified",,,,,Y,44778.74,13998.95
Western NY,Erie,1401005,000210,Erie County Medical Center,18 to 29,142,M,Black/African American,Not Span/Hispanic,4,Emergency,Inpatient Rehabilitation Facility,2020,INJ010,"INTERNAL ORGAN INJURY, INITIAL ENCOUNTER",GIS021,GI SYSTEM REPAIR (EXCLUDING ANORECTAL),911,EXTENSIVE ABDOMINAL/THORACIC PROCEDURES FOR MULT SIGNIFICANT TRAUMA,25,HUMAN IMMUNODEFICIENCY VIRUS INFECTIONS,3,Major,Major,Surgical,Medicaid,,,,,Y,39829.16,15694.54
Western NY,Erie,1401005,000210,Erie County Medical Center,30 to 49,142,M,Black/African American,Not Span/Hispanic,16,Emergency,Home or Self Care,2020,INJ010,"INTERNAL ORGAN INJURY, INITIAL ENCOUNTER",CAR010,LIGATION AND EMBOLIZATION OF VESSELS,911,EXTENSIVE ABDOMINAL/THORACIC PROCEDURES FOR MULT SIGNIFICANT TRAUMA,25,HUMAN IMMUNODEFICIENCY VIRUS INFECTIONS,4,Extreme,Major,Surgical,Medicaid,,,,,Y,132447.64,66056.69
Western NY,Erie,1401005,000210,Erie County Medical Center,70 or Older,143,F,White,Not Span/Hispanic,8,Emergency,Skilled Nursing Home,2020,INJ010,"INTERNAL ORGAN INJURY, INITIAL ENCOUNTER",LYM005,SPLENECTOMY,911,EXTENSIVE ABDOMINAL/THORACIC PROCEDURES FOR MULT SIGNIFICANT TRAUMA,25,HUMAN IMMUNODEFICIENCY VIRUS INFECTIONS,3,Major,Moderate,Surgical,Medicare,Blue Cross/Blue Shield,,,,Y,57368.38,25164.07
Long Island,Suffolk,5154000,000924,South Shore University Hospital,18 to 29,117,F,White,Not Span/Hispanic,14,Emergency,Home w/ Home Health Services,2020,INJ005,"FRACTURE OF THE LOWER LIMB (EXCEPT HIP), INITIAL ENCOUNTER",CAR017,PERICARDIAL PROCEDURES,911,EXTENSIVE ABDOMINAL/THORACIC PROCEDURES FOR MULT SIGNIFICANT TRAUMA,25,HUMAN IMMUNODEFICIENCY VIRUS INFECTIONS,4,Extreme,Extreme,Surgical,Miscellaneous/Other,Medicaid,,,,Y,321417.32,76087.25
Long Island,Suffolk,5154000,000924,South Shore University Hospital,50 to 69,117,M,Black/African American,Not Span/Hispanic,13,Emergency,Home or Self Care,2020,INJ013,"OPEN WOUNDS OF TRUNK, INITIAL ENCOUNTER",GIS021,GI SYSTEM REPAIR (EXCLUDING ANORECTAL),911,EXTENSIVE ABDOMINAL/THORACIC PROCEDURES FOR MULT SIGNIFICANT TRAUMA,25,HUMAN IMMUNODEFICIENCY VIRUS INFECTIONS,4,Extreme,Extreme,Surgical,Medicaid,Medicaid,,,,Y,181102.88,39232.65
Long Island,Nassau,2951001,000541,North Shore University Hospital,50 to 69,114,F,White,Not Span/Hispanic,15,Trauma,Inpatient Rehabilitation Facility,2020,INJ005,"FRACTURE OF THE LOWER LIMB (EXCEPT HIP), INITIAL ENCOUNTER",GIS021,GI SYSTEM REPAIR (EXCLUDING ANORECTAL),911,EXTENSIVE ABDOMINAL/THORACIC PROCEDURES FOR MULT SIGNIFICANT TRAUMA,25,HUMAN IMMUNODEFICIENCY VIRUS INFECTIONS,4,Extreme,Major,Surgical,Miscellaneous/Other,Medicare,Medicare,,,Y,391324.92,74856.93
New York City,Kings,7002053,001304,NYU Langone Hospital-Brooklyn,30 to 49,112,F,Other Race,Not Span/Hispanic,11,Emergency,Inpatient Rehabilitation Facility,2020,INJ010,"INTERNAL ORGAN INJURY, INITIAL ENCOUNTER",RES005,CHEST TUBE PLACEMENT AND THERAPEUTIC THORACENTESIS,911,EXTENSIVE ABDOMINAL/THORACIC PROCEDURES FOR MULT SIGNIFICANT TRAUMA,25,HUMAN IMMUNODEFICIENCY VIRUS INFECTIONS,4,Extreme,Major,Surgical,Miscellaneous/Other,,,,,Y,372139.3,64070.85
Finger Lakes,Monroe,2701005,000413,Strong Memorial Hospital,18 to 29,146,M,Black/African American,Not Span/Hispanic,9,Emergency,Home or Self Care,2020,INJ010,"INTERNAL ORGAN INJURY, INITIAL ENCOUNTER",GIS011,SMALL BOWEL RESECTION,911,EXTENSIVE ABDOMINAL/THORACIC PROCEDURES FOR MULT SIGNIFICANT TRAUMA,25,HUMAN IMMUNODEFICIENCY VIRUS INFECTIONS,4,Extreme,Major,Surgical,Medicaid,,,,,Y,78500.15,33896.59
Finger Lakes,Monroe,2701005,000413,Strong Memorial Hospital,70 or Older,145,M,White,Not Span/Hispanic,8,Emergency,Home or Self Care,2020,INJ003,"FRACTURE OF TORSO, INITIAL ENCOUNTER",CAR010,LIGATION AND EMBOLIZATION OF VESSELS,911,EXTENSIVE ABDOMINAL/THORACIC PROCEDURES FOR MULT SIGNIFICANT TRAUMA,25,HUMAN IMMUNODEFICIENCY VIRUS INFECTIONS,3,Major,Major,Surgical,Miscellaneous/Other,Medicare,,,,Y,132241.92,44595.47
Central NY,Onondaga,3301007,000635,University Hospital SUNY Health Science Center,18 to 29,132,M,White,Not Span/Hispanic,8,Trauma,Court/Law Enforcement,2020,INJ013,"OPEN WOUNDS OF TRUNK, INITIAL ENCOUNTER",RES011,DIAPHRAGMATIC HERNIA REPAIR,911,EXTENSIVE ABDOMINAL/THORACIC PROCEDURES FOR MULT SIGNIFICANT TRAUMA,25,HUMAN IMMUNODEFICIENCY VIRUS INFECTIONS,4,Extreme,Extreme,Surgical,Private Health Insurance,,,,,Y,151153,39161.19
Central NY,Onondaga,3301007,000635,University Hospital SUNY Health Science Center,0 to 17,134,F,White,Not Span/Hispanic,12,Emergency,Inpatient Rehabilitation Facility,2020,INJ010,"INTERNAL ORGAN INJURY, INITIAL ENCOUNTER",GIS009,COLECTOMY,911,EXTENSIVE ABDOMINAL/THORACIC PROCEDURES FOR MULT SIGNIFICANT TRAUMA,25,HUMAN IMMUNODEFICIENCY VIRUS INFECTIONS,4,Extreme,Extreme,Surgical,Miscellaneous/Other,,,,,N,221462.6,56734.27
Central NY,Onondaga,3301007,000635,University Hospital SUNY Health Science Center,30 to 49,136,M,White,Not Span/Hispanic,9,Trauma,Home or Self Care,2020,INJ010,"INTERNAL ORGAN INJURY, INITIAL ENCOUNTER",HEP006,CHOLECYSTECTOMY,911,EXTENSIVE ABDOMINAL/THORACIC PROCEDURES FOR MULT SIGNIFICANT TRAUMA,25,HUMAN IMMUNODEFICIENCY VIRUS INFECTIONS,3,Major,Major,Surgical,Medicaid,,,,,Y,178579.21,50123.66
Long Island,Suffolk,5151001,000245,Stony Brook University Hospital,30 to 49,117,M,White,Not Span/Hispanic,84,Emergency,Inpatient Rehabilitation Facility,2020,INJ005,"FRACTURE OF THE LOWER LIMB (EXCEPT HIP), INITIAL ENCOUNTER",GIS011,SMALL BOWEL RESECTION,911,EXTENSIVE ABDOMINAL/THORACIC PROCEDURES FOR MULT SIGNIFICANT TRAUMA,25,HUMAN IMMUNODEFICIENCY VIRUS INFECTIONS,4,Extreme,Extreme,Surgical,Miscellaneous/Other,Private Health Insurance,,,,Y,1360575.32,446523.92
Long Island,Nassau,2908000,000511,NYU Langone Hospital-Long Island,0 to 17,115,F,Other Race,Not Span/Hispanic,4,Emergency,Home or Self Care,2020,INJ010,"INTERNAL ORGAN INJURY, INITIAL ENCOUNTER",CAR010,LIGATION AND EMBOLIZATION OF VESSELS,911,EXTENSIVE ABDOMINAL/THORACIC PROCEDURES FOR MULT SIGNIFICANT TRAUMA,25,HUMAN IMMUNODEFICIENCY VIRUS INFECTIONS,3,Major,Minor,Surgical,Miscellaneous/Other,,,,,Y,134747.21,25617.81
Long Island,Nassau,2908000,000511,NYU Langone Hospital-Long Island,30 to 49,115,M,Black/African American,Unknown,3,Emergency,Home or Self Care,2020,INJ010,"INTERNAL ORGAN INJURY, INITIAL ENCOUNTER",GIS024,OTHER PERITONEAL CAVITY PROCEDURES,911,EXTENSIVE ABDOMINAL/THORACIC PROCEDURES FOR MULT SIGNIFICANT TRAUMA,25,HUMAN IMMUNODEFICIENCY VIRUS INFECTIONS,3,Major,Major,Surgical,Medicaid,,,,,Y,127944.05,24764.36
Hudson Valley,Westchester,5957001,001139,Westchester Medical Center,70 or Older,105,M,White,Not Span/Hispanic,17,Emergency,Expired,2020,INJ010,"INTERNAL ORGAN INJURY, INITIAL ENCOUNTER",LYM005,SPLENECTOMY,911,EXTENSIVE ABDOMINAL/THORACIC PROCEDURES FOR MULT SIGNIFICANT TRAUMA,25,HUMAN IMMUNODEFICIENCY VIRUS INFECTIONS,4,Extreme,Extreme,Surgical,Miscellaneous/Other,,,,,Y,69570,14023.15
Hudson Valley,Westchester,5957001,001139,Westchester Medical Center,30 to 49,105,M,White,Not Span/Hispanic,3,Emergency,Home or Self Care,2020,INJ010,"INTERNAL ORGAN INJURY, INITIAL ENCOUNTER",CAR010,LIGATION AND EMBOLIZATION OF VESSELS,911,EXTENSIVE ABDOMINAL/THORACIC PROCEDURES FOR MULT SIGNIFICANT TRAUMA,25,HUMAN IMMUNODEFICIENCY VIRUS INFECTIONS,4,Extreme,Major,Surgical,Miscellaneous/Other,Blue Cross/Blue Shield,,,,Y,239782.44,37499
Hudson Valley,Westchester,5957001,001139,Westchester Medical Center,50 to 69,105,M,White,Not Span/Hispanic,18,Emergency,Inpatient Rehabilitation Facility,2020,INJ002,"FRACTURE OF THE SPINE AND BACK, INITIAL ENCOUNTER",MST013,SPINE FUSION,911,EXTENSIVE ABDOMINAL/THORACIC PROCEDURES FOR MULT SIGNIFICANT TRAUMA,25,HUMAN IMMUNODEFICIENCY VIRUS INFECTIONS,4,Extreme,Extreme,Surgical,Miscellaneous/Other,Blue Cross/Blue Shield,,,,Y,903840.21,140211.65
Hudson Valley,Westchester,5957001,001139,Westchester Medical Center,70 or Older,105,M,White,Not Span/Hispanic,2,Emergency,Expired,2020,INJ010,"INTERNAL ORGAN INJURY, INITIAL ENCOUNTER",CAR010,LIGATION AND EMBOLIZATION OF VESSELS,911,EXTENSIVE ABDOMINAL/THORACIC PROCEDURES FOR MULT SIGNIFICANT TRAUMA,25,HUMAN IMMUNODEFICIENCY VIRUS INFECTIONS,3,Major,Moderate,Surgical,Medicare,Medicare,,,,Y,192046.56,29711.43
Hudson Valley,Westchester,5957001,001139,Westchester Medical Center,70 or Older,105,F,White,Not Span/Hispanic,15,Emergency,Skilled Nursing Home,2020,INJ010,"INTERNAL ORGAN INJURY, INITIAL ENCOUNTER",CAR010,LIGATION AND EMBOLIZATION OF VESSELS,911,EXTENSIVE ABDOMINAL/THORACIC PROCEDURES FOR MULT SIGNIFICANT TRAUMA,25,HUMAN IMMUNODEFICIENCY VIRUS INFECTIONS,3,Major,Moderate,Surgical,Miscellaneous/Other,Medicare,Medicare,,,Y,573744.58,98662.45
Hudson Valley,Dutchess,5957001,000180,Mid-Hudson Valley Division of Westchester Medical Center,18 to 29,125,M,White,Not Span/Hispanic,9,Emergency,Home w/ Home Health Services,2020,INJ010,"INTERNAL ORGAN INJURY, INITIAL ENCOUNTER",GIS011,SMALL BOWEL RESECTION,911,EXTENSIVE ABDOMINAL/THORACIC PROCEDURES FOR MULT SIGNIFICANT TRAUMA,25,HUMAN IMMUNODEFICIENCY VIRUS INFECTIONS,3,Major,Minor,Surgical,Blue Cross/Blue Shield,,,,,Y,244021.7,43456.37
New York City,Queens,7001024,001635,St Johns Episcopal Hospital So Shore,50 to 69,116,F,Other Race,Not Span/Hispanic,12,Emergency,Home w/ Home Health Services,2020,INJ010,"INTERNAL ORGAN INJURY, INITIAL ENCOUNTER",LYM005,SPLENECTOMY,911,EXTENSIVE ABDOMINAL/THORACIC PROCEDURES FOR MULT SIGNIFICANT TRAUMA,25,HUMAN IMMUNODEFICIENCY VIRUS INFECTIONS,4,Extreme,Major,Surgical,Private Health Insurance,,,,,Y,168939.85,50802.14
Capital/Adirond,Schenectady,4601001,000829,Ellis Hospital,70 or Older,123,F,White,Not Span/Hispanic,14,Emergency,Inpatient Rehabilitation Facility,2020,INJ010,"INTERNAL ORGAN INJURY, INITIAL ENCOUNTER",LYM005,SPLENECTOMY,911,EXTENSIVE ABDOMINAL/THORACIC PROCEDURES FOR MULT SIGNIFICANT TRAUMA,25,HUMAN IMMUNODEFICIENCY VIRUS INFECTIONS,4,Extreme,Extreme,Surgical,Medicare,Medicare,Blue Cross/Blue Shield,,,Y,122797.88,43108.72
New York City,Queens,7003010,001637,New York - Presbyterian/Queens,70 or Older,113,M,Other Race,Not Span/Hispanic,11,Emergency,Skilled Nursing Home,2020,INJ016,"INJURY TO BLOOD VESSELS, INITIAL ENCOUNTER",ESA003,MECHANICAL VENTILATION,911,EXTENSIVE ABDOMINAL/THORACIC PROCEDURES FOR MULT SIGNIFICANT TRAUMA,25,HUMAN IMMUNODEFICIENCY VIRUS INFECTIONS,4,Extreme,Extreme,Surgical,Medicare,Private Health Insurance,Self-Pay,,,Y,297752.48,80695.94
Long Island,Suffolk,5154000,000924,South Shore University Hospital,30 to 49,117,M,White,Spanish/Hispanic,17,Emergency,Inpatient Rehabilitation Facility,2020,INJ010,"INTERNAL ORGAN INJURY, INITIAL ENCOUNTER",LYM005,SPLENECTOMY,911,EXTENSIVE ABDOMINAL/THORACIC PROCEDURES FOR MULT SIGNIFICANT TRAUMA,25,HUMAN IMMUNODEFICIENCY VIRUS INFECTIONS,4,Extreme,Extreme,Surgical,Miscellaneous/Other,,,,,Y,307728.06,68193.24
New York City,Manhattan,7002009,001445,Harlem Hospital Center,18 to 29,100,M,Other Race,Unknown,8,Emergency,Home or Self Care,2020,INJ010,"INTERNAL ORGAN INJURY, INITIAL ENCOUNTER",RES011,DIAPHRAGMATIC HERNIA REPAIR,911,EXTENSIVE ABDOMINAL/THORACIC PROCEDURES FOR MULT SIGNIFICANT TRAUMA,25,HUMAN IMMUNODEFICIENCY VIRUS INFECTIONS,3,Major,Major,Surgical,Private Health Insurance,,,,,Y,77259.74,59275.37
New York City,Manhattan,7002001,001438,Bellevue Hospital Center,30 to 49,100,M,Black/African American,Unknown,12,Emergency,Home w/ Home Health Services,2020,INJ010,"INTERNAL ORGAN INJURY, INITIAL ENCOUNTER",LYM005,SPLENECTOMY,911,EXTENSIVE ABDOMINAL/THORACIC PROCEDURES FOR MULT SIGNIFICANT TRAUMA,25,HUMAN IMMUNODEFICIENCY VIRUS INFECTIONS,4,Extreme,Major,Surgical,Medicaid,,,,,Y,119558.92,68756.42
Finger Lakes,Monroe,2701005,000413,Strong Memorial Hospital,70 or Older,144,F,White,Not Span/Hispanic,14,Emergency,Expired,2020,INJ003,"FRACTURE OF TORSO, INITIAL ENCOUNTER",LYM005,SPLENECTOMY,911,EXTENSIVE ABDOMINAL/THORACIC PROCEDURES FOR MULT SIGNIFICANT TRAUMA,25,HUMAN IMMUNODEFICIENCY VIRUS INFECTIONS,4,Extreme,Extreme,Surgical,Medicare,,,,,Y,227772.78,81861.95
Finger Lakes,Monroe,2701005,000413,Strong Memorial Hospital,50 to 69,146,F,Black/African American,Not Span/Hispanic,5,Emergency,Skilled Nursing Home,2020,INJ003,"FRACTURE OF TORSO, INITIAL ENCOUNTER",MST012,BONE FIXATION (EXCLUDING EXTREMITIES),911,EXTENSIVE ABDOMINAL/THORACIC PROCEDURES FOR MULT SIGNIFICANT TRAUMA,25,HUMAN IMMUNODEFICIENCY VIRUS INFECTIONS,2,Moderate,Minor,Surgical,Miscellaneous/Other,Blue Cross/Blue Shield,,,,Y,87087.87,35010.15
Long Island,Nassau,2951001,000541,North Shore University Hospital,70 or Older,110,F,Other Race,Not Span/Hispanic,1,Trauma,Expired,2020,INJ010,"INTERNAL ORGAN INJURY, INITIAL ENCOUNTER",LYM005,SPLENECTOMY,911,EXTENSIVE ABDOMINAL/THORACIC PROCEDURES FOR MULT SIGNIFICANT TRAUMA,25,HUMAN IMMUNODEFICIENCY VIRUS INFECTIONS,4,Extreme,Extreme,Surgical,Miscellaneous/Other,,,,,Y,136194,31465.01
Capital/Adirond,Albany,0101000,000001,Albany Medical Center Hospital,18 to 29,128,M,White,Not Span/Hispanic,12,Trauma,Skilled Nursing Home,2020,INJ010,"INTERNAL ORGAN INJURY, INITIAL ENCOUNTER",LYM005,SPLENECTOMY,911,EXTENSIVE ABDOMINAL/THORACIC PROCEDURES FOR MULT SIGNIFICANT TRAUMA,25,HUMAN IMMUNODEFICIENCY VIRUS INFECTIONS,4,Extreme,Extreme,Surgical,Miscellaneous/Other,"Managed Care, Unspecified",,,,Y,245865.66,72069.81
New York City,Bronx,7000008,001172,Lincoln Medical & Mental Health Center,18 to 29,125,M,Other Race,Spanish/Hispanic,12,Emergency,Home or Self Care,2020,INJ010,"INTERNAL ORGAN INJURY, INITIAL ENCOUNTER",HEP013,"HEPATOBILIARY AND PANCREATIC PROCEDURES, NEC",911,EXTENSIVE ABDOMINAL/THORACIC PROCEDURES FOR MULT SIGNIFICANT TRAUMA,25,HUMAN IMMUNODEFICIENCY VIRUS INFECTIONS,4,Extreme,Major,Surgical,Private Health Insurance,,,,,Y,103102.39,65895.32
Capital/Adirond,Albany,0101000,000001,Albany Medical Center Hospital,50 to 69,129,M,Other Race,Not Span/Hispanic,12,Trauma,Inpatient Rehabilitation Facility,2020,INJ010,"INTERNAL ORGAN INJURY, INITIAL ENCOUNTER",GIS009,COLECTOMY,911,EXTENSIVE ABDOMINAL/THORACIC PROCEDURES FOR MULT SIGNIFICANT TRAUMA,25,HUMAN IMMUNODEFICIENCY VIRUS INFECTIONS,4,Extreme,Extreme,Surgical,Miscellaneous/Other,Medicare,,,,Y,222369.46,62279.17
Capital/Adirond,Albany,0101000,000001,Albany Medical Center Hospital,50 to 69,128,M,White,Not Span/Hispanic,8,Trauma,Home or Self Care,2020,INJ010,"INTERNAL ORGAN INJURY, INITIAL ENCOUNTER",CAR010,LIGATION AND EMBOLIZATION OF VESSELS,911,EXTENSIVE ABDOMINAL/THORACIC PROCEDURES FOR MULT SIGNIFICANT TRAUMA,25,HUMAN IMMUNODEFICIENCY VIRUS INFECTIONS,3,Major,Moderate,Surgical,"Managed Care, Unspecified",,,,,Y,96461.89,29055.02
New York City,Bronx,7000008,001172,Lincoln Medical & Mental Health Center,30 to 49,112,M,Black/African American,Not Span/Hispanic,18,Emergency,Home or Self Care,2020,INJ010,"INTERNAL ORGAN INJURY, INITIAL ENCOUNTER",RES005,CHEST TUBE PLACEMENT AND THERAPEUTIC THORACENTESIS,911,EXTENSIVE ABDOMINAL/THORACIC PROCEDURES FOR MULT SIGNIFICANT TRAUMA,25,HUMAN IMMUNODEFICIENCY VIRUS INFECTIONS,4,Extreme,Major,Surgical,Medicare,Federal/State/Local/VA,,,,Y,197325.53,126115.68
Western NY,Erie,1401005,000210,Erie County Medical Center,18 to 29,140,F,White,Unknown,1,Urgent,Expired,2020,INJ011,"OPEN WOUNDS OF HEAD AND NECK, INITIAL ENCOUNTER",MST028,"SUBCUTANEOUS TISSUE AND FASCIA PROCEDURES, NEC",911,EXTENSIVE ABDOMINAL/THORACIC PROCEDURES FOR MULT SIGNIFICANT TRAUMA,25,HUMAN IMMUNODEFICIENCY VIRUS INFECTIONS,4,Extreme,Extreme,Surgical,Medicaid,Medicaid,,,,N,14801.6,8515.98
Western NY,Erie,1401005,000210,Erie County Medical Center,18 to 29,141,F,White,Not Span/Hispanic,1,Emergency,Expired,2020,INJ010,"INTERNAL ORGAN INJURY, INITIAL ENCOUNTER",GIS005,EXPLORATION OF PERITONEAL CAVITY,911,EXTENSIVE ABDOMINAL/THORACIC PROCEDURES FOR MULT SIGNIFICANT TRAUMA,25,HUMAN IMMUNODEFICIENCY VIRUS INFECTIONS,3,Major,Major,Surgical,Miscellaneous/Other,Medicaid,,,,Y,76597.84,24547.39