Hospital Service Area,Hospital County,Operating Certificate Number,Permanent Facility Id,Facility Name,Age Group,Zip Code - 3 digits,Gender,Race,Ethnicity,Length of Stay,Type of Admission,Patient Disposition,Discharge Year,CCS Diagnosis Code,CCS Diagnosis Description,CCS Procedure Code,CCS Procedure Description,APR DRG Code,APR DRG Description,APR MDC Code,APR MDC Description,APR Severity of Illness Code,APR Severity of Illness Description,APR Risk of Mortality,APR Medical Surgical Description,Payment Typology 1,Payment Typology 2,Payment Typology 3,Birth Weight,Abortion Edit Indicator,Emergency Department Indicator,Total Charges,Total Costs
New York City,Manhattan,7002001,001438,Bellevue Hospital Center,30 to 49,100,M,Black/African American,Unknown,12,Emergency,Home w/ Home Health Services,2020,INJ010,"INTERNAL ORGAN INJURY, INITIAL ENCOUNTER",LYM005,SPLENECTOMY,911,EXTENSIVE ABDOMINAL/THORACIC PROCEDURES FOR MULT SIGNIFICANT TRAUMA,25,HUMAN IMMUNODEFICIENCY VIRUS INFECTIONS,4,Extreme,Major,Surgical,Medicaid,,,,,Y,119558.92,68756.42
New York City,Manhattan,7002001,001438,Bellevue Hospital Center,70 or Older,100,M,Other Race,Unknown,17,Emergency,Home or Self Care,2020,INJ010,"INTERNAL ORGAN INJURY, INITIAL ENCOUNTER",CAR010,LIGATION AND EMBOLIZATION OF VESSELS,911,EXTENSIVE ABDOMINAL/THORACIC PROCEDURES FOR MULT SIGNIFICANT TRAUMA,25,HUMAN IMMUNODEFICIENCY VIRUS INFECTIONS,3,Major,Major,Surgical,Medicaid,,,,,Y,182632.17,105028.84
New York City,Manhattan,7002001,001438,Bellevue Hospital Center,30 to 49,100,M,Other Race,Not Span/Hispanic,6,Emergency,Home or Self Care,2020,INJ010,"INTERNAL ORGAN INJURY, INITIAL ENCOUNTER",GIS021,GI SYSTEM REPAIR (EXCLUDING ANORECTAL),911,EXTENSIVE ABDOMINAL/THORACIC PROCEDURES FOR MULT SIGNIFICANT TRAUMA,25,HUMAN IMMUNODEFICIENCY VIRUS INFECTIONS,4,Extreme,Major,Surgical,Private Health Insurance,,,,,Y,88301.68,50780.88
New York City,Manhattan,7002001,001438,Bellevue Hospital Center,70 or Older,100,M,Other Race,Not Span/Hispanic,13,Trauma,Home or Self Care,2020,INJ010,"INTERNAL ORGAN INJURY, INITIAL ENCOUNTER",LYM005,SPLENECTOMY,911,EXTENSIVE ABDOMINAL/THORACIC PROCEDURES FOR MULT SIGNIFICANT TRAUMA,25,HUMAN IMMUNODEFICIENCY VIRUS INFECTIONS,4,Extreme,Extreme,Surgical,Medicare,Medicare,,,,Y,147665.23,84919.91
New York City,Manhattan,7002001,001438,Bellevue Hospital Center,30 to 49,100,M,White,Not Span/Hispanic,3,Emergency,Home or Self Care,2020,INJ010,"INTERNAL ORGAN INJURY, INITIAL ENCOUNTER",CAR010,LIGATION AND EMBOLIZATION OF VESSELS,911,EXTENSIVE ABDOMINAL/THORACIC PROCEDURES FOR MULT SIGNIFICANT TRAUMA,25,HUMAN IMMUNODEFICIENCY VIRUS INFECTIONS,2,Moderate,Minor,Surgical,Miscellaneous/Other,,,,,Y,37201.36,21393.91
New York City,Manhattan,7002001,001438,Bellevue Hospital Center,70 or Older,100,F,White,Not Span/Hispanic,4,Urgent,Home w/ Home Health Services,2020,INJ010,"INTERNAL ORGAN INJURY, INITIAL ENCOUNTER",CAR010,LIGATION AND EMBOLIZATION OF VESSELS,911,EXTENSIVE ABDOMINAL/THORACIC PROCEDURES FOR MULT SIGNIFICANT TRAUMA,25,HUMAN IMMUNODEFICIENCY VIRUS INFECTIONS,3,Major,Major,Surgical,Medicare,Private Health Insurance,Medicaid,,,N,58809.4,33820.34
New York City,Manhattan,7002001,001438,Bellevue Hospital Center,18 to 29,104,M,Other Race,Unknown,10,Emergency,Home or Self Care,2020,INJ001,"FRACTURE OF HEAD AND NECK, INITIAL ENCOUNTER",MST012,BONE FIXATION (EXCLUDING EXTREMITIES),911,EXTENSIVE ABDOMINAL/THORACIC PROCEDURES FOR MULT SIGNIFICANT TRAUMA,25,HUMAN IMMUNODEFICIENCY VIRUS INFECTIONS,4,Extreme,Moderate,Surgical,Private Health Insurance,,,,,Y,167564.87,96363.88
New York City,Manhattan,7002001,001438,Bellevue Hospital Center,30 to 49,100,M,Black/African American,Not Span/Hispanic,28,Emergency,Expired,2020,INJ014,"AMPUTATION OF A LIMB, INITIAL ENCOUNTER",GIS005,EXPLORATION OF PERITONEAL CAVITY,911,EXTENSIVE ABDOMINAL/THORACIC PROCEDURES FOR MULT SIGNIFICANT TRAUMA,25,HUMAN IMMUNODEFICIENCY VIRUS INFECTIONS,4,Extreme,Extreme,Surgical,Medicaid,,,,,Y,681148.82,391717.79
New York City,Manhattan,7002001,001438,Bellevue Hospital Center,18 to 29,100,M,Other Race,Spanish/Hispanic,8,Emergency,Home or Self Care,2020,INJ010,"INTERNAL ORGAN INJURY, INITIAL ENCOUNTER",URN007,URINARY TRACT REPAIR,911,EXTENSIVE ABDOMINAL/THORACIC PROCEDURES FOR MULT SIGNIFICANT TRAUMA,25,HUMAN IMMUNODEFICIENCY VIRUS INFECTIONS,4,Extreme,Extreme,Surgical,Private Health Insurance,,,,,Y,106685.64,61353.2
New York City,Manhattan,7002001,001438,Bellevue Hospital Center,50 to 69,100,M,Black/African American,Not Span/Hispanic,7,Emergency,Home or Self Care,2020,INJ013,"OPEN WOUNDS OF TRUNK, INITIAL ENCOUNTER",RES011,DIAPHRAGMATIC HERNIA REPAIR,911,EXTENSIVE ABDOMINAL/THORACIC PROCEDURES FOR MULT SIGNIFICANT TRAUMA,25,HUMAN IMMUNODEFICIENCY VIRUS INFECTIONS,4,Extreme,Major,Surgical,Private Health Insurance,,,,,Y,110414.05,63497.35
New York City,Manhattan,7002001,001438,Bellevue Hospital Center,18 to 29,OOS,M,White,Not Span/Hispanic,18,Emergency,Home w/ Home Health Services,2020,INJ010,"INTERNAL ORGAN INJURY, INITIAL ENCOUNTER",LYM005,SPLENECTOMY,911,EXTENSIVE ABDOMINAL/THORACIC PROCEDURES FOR MULT SIGNIFICANT TRAUMA,25,HUMAN IMMUNODEFICIENCY VIRUS INFECTIONS,4,Extreme,Extreme,Surgical,Private Health Insurance,,,,,Y,297676.99,171189.27
New York City,Manhattan,7002001,001438,Bellevue Hospital Center,30 to 49,104,M,Other Race,Unknown,40,Emergency,Inpatient Rehabilitation Facility,2020,INJ014,"AMPUTATION OF A LIMB, INITIAL ENCOUNTER",MST026,FINGER AND OTHER UPPER EXTREMITY AMPUTATION,911,EXTENSIVE ABDOMINAL/THORACIC PROCEDURES FOR MULT SIGNIFICANT TRAUMA,25,HUMAN IMMUNODEFICIENCY VIRUS INFECTIONS,4,Extreme,Extreme,Surgical,Medicaid,,,,,Y,711449.35,409143.14
