Hospital Service Area,Hospital County,Operating Certificate Number,Permanent Facility Id,Facility Name,Age Group,Zip Code - 3 digits,Gender,Race,Ethnicity,Length of Stay,Type of Admission,Patient Disposition,Discharge Year,CCS Diagnosis Code,CCS Diagnosis Description,CCS Procedure Code,CCS Procedure Description,APR DRG Code,APR DRG Description,APR MDC Code,APR MDC Description,APR Severity of Illness Code,APR Severity of Illness Description,APR Risk of Mortality,APR Medical Surgical Description,Payment Typology 1,Payment Typology 2,Payment Typology 3,Birth Weight,Abortion Edit Indicator,Emergency Department Indicator,Total Charges,Total Costs
Long Island,Nassau,2908000,000511,NYU Langone Hospital-Long Island,0 to 17,115,F,Other Race,Not Span/Hispanic,4,Emergency,Home or Self Care,2020,INJ010,"INTERNAL ORGAN INJURY, INITIAL ENCOUNTER",CAR010,LIGATION AND EMBOLIZATION OF VESSELS,911,EXTENSIVE ABDOMINAL/THORACIC PROCEDURES FOR MULT SIGNIFICANT TRAUMA,25,HUMAN IMMUNODEFICIENCY VIRUS INFECTIONS,3,Major,Minor,Surgical,Miscellaneous/Other,,,,,Y,134747.21,25617.81
Long Island,Nassau,2908000,000511,NYU Langone Hospital-Long Island,30 to 49,115,M,Black/African American,Unknown,3,Emergency,Home or Self Care,2020,INJ010,"INTERNAL ORGAN INJURY, INITIAL ENCOUNTER",GIS024,OTHER PERITONEAL CAVITY PROCEDURES,911,EXTENSIVE ABDOMINAL/THORACIC PROCEDURES FOR MULT SIGNIFICANT TRAUMA,25,HUMAN IMMUNODEFICIENCY VIRUS INFECTIONS,3,Major,Major,Surgical,Medicaid,,,,,Y,127944.05,24764.36
Long Island,Nassau,2908000,000511,NYU Langone Hospital-Long Island,70 or Older,115,M,Other Race,Not Span/Hispanic,36,Emergency,Home w/ Home Health Services,2020,INJ010,"INTERNAL ORGAN INJURY, INITIAL ENCOUNTER",GIS009,COLECTOMY,911,EXTENSIVE ABDOMINAL/THORACIC PROCEDURES FOR MULT SIGNIFICANT TRAUMA,25,HUMAN IMMUNODEFICIENCY VIRUS INFECTIONS,4,Extreme,Extreme,Surgical,Miscellaneous/Other,Medicare,,,,Y,847395.7,203256.53
Long Island,Nassau,2908000,000511,NYU Langone Hospital-Long Island,70 or Older,110,F,White,Not Span/Hispanic,9,Trauma,Skilled Nursing Home,2020,INJ016,"INJURY TO BLOOD VESSELS, INITIAL ENCOUNTER",CAR010,LIGATION AND EMBOLIZATION OF VESSELS,911,EXTENSIVE ABDOMINAL/THORACIC PROCEDURES FOR MULT SIGNIFICANT TRAUMA,25,HUMAN IMMUNODEFICIENCY VIRUS INFECTIONS,3,Major,Major,Surgical,Medicare,Medicare,,,,Y,233523.22,46357.45
Long Island,Nassau,2908000,000511,NYU Langone Hospital-Long Island,18 to 29,115,M,Black/African American,Unknown,8,Trauma,Home or Self Care,2020,INJ010,"INTERNAL ORGAN INJURY, INITIAL ENCOUNTER",HEP004,HEPATOBILIARY RESECTION AND ABLATION,911,EXTENSIVE ABDOMINAL/THORACIC PROCEDURES FOR MULT SIGNIFICANT TRAUMA,25,HUMAN IMMUNODEFICIENCY VIRUS INFECTIONS,3,Major,Major,Surgical,Medicaid,,,,,Y,395861.81,81726.98
Long Island,Nassau,2908000,000511,NYU Langone Hospital-Long Island,18 to 29,110,M,Black/African American,Unknown,19,Trauma,Home w/ Home Health Services,2020,INJ010,"INTERNAL ORGAN INJURY, INITIAL ENCOUNTER",GIS009,COLECTOMY,911,EXTENSIVE ABDOMINAL/THORACIC PROCEDURES FOR MULT SIGNIFICANT TRAUMA,25,HUMAN IMMUNODEFICIENCY VIRUS INFECTIONS,4,Extreme,Major,Surgical,Medicaid,,,,,Y,776061.87,139067.9
Long Island,Nassau,2908000,000511,NYU Langone Hospital-Long Island,18 to 29,117,F,Black/African American,Not Span/Hispanic,4,Trauma,Home or Self Care,2020,INJ010,"INTERNAL ORGAN INJURY, INITIAL ENCOUNTER",GIS005,EXPLORATION OF PERITONEAL CAVITY,911,EXTENSIVE ABDOMINAL/THORACIC PROCEDURES FOR MULT SIGNIFICANT TRAUMA,25,HUMAN IMMUNODEFICIENCY VIRUS INFECTIONS,3,Major,Major,Surgical,Miscellaneous/Other,Blue Cross/Blue Shield,,,,Y,202977.58,36597.07
Long Island,Nassau,2908000,000511,NYU Langone Hospital-Long Island,18 to 29,112,M,Other Race,Spanish/Hispanic,12,Trauma,Home w/ Home Health Services,2020,INJ010,"INTERNAL ORGAN INJURY, INITIAL ENCOUNTER",LYM005,SPLENECTOMY,911,EXTENSIVE ABDOMINAL/THORACIC PROCEDURES FOR MULT SIGNIFICANT TRAUMA,25,HUMAN IMMUNODEFICIENCY VIRUS INFECTIONS,4,Extreme,Extreme,Surgical,Medicaid,,,,,Y,623343.29,140687.42
Long Island,Nassau,2908000,000511,NYU Langone Hospital-Long Island,70 or Older,115,F,White,Not Span/Hispanic,4,Emergency,Expired,2020,INJ003,"FRACTURE OF TORSO, INITIAL ENCOUNTER",GIS005,EXPLORATION OF PERITONEAL CAVITY,911,EXTENSIVE ABDOMINAL/THORACIC PROCEDURES FOR MULT SIGNIFICANT TRAUMA,25,HUMAN IMMUNODEFICIENCY VIRUS INFECTIONS,4,Extreme,Extreme,Surgical,Medicare,Medicare,,,,Y,200966.56,25979.83
Long Island,Nassau,2908000,000511,NYU Langone Hospital-Long Island,18 to 29,115,M,Black/African American,Not Span/Hispanic,5,Trauma,Home or Self Care,2020,INJ010,"INTERNAL ORGAN INJURY, INITIAL ENCOUNTER",RES011,DIAPHRAGMATIC HERNIA REPAIR,911,EXTENSIVE ABDOMINAL/THORACIC PROCEDURES FOR MULT SIGNIFICANT TRAUMA,25,HUMAN IMMUNODEFICIENCY VIRUS INFECTIONS,4,Extreme,Extreme,Surgical,Medicaid,,,,,Y,158341.78,31834.55
Long Island,Nassau,2908000,000511,NYU Langone Hospital-Long Island,50 to 69,110,M,Other Race,Spanish/Hispanic,4,Trauma,Home w/ Home Health Services,2020,INJ010,"INTERNAL ORGAN INJURY, INITIAL ENCOUNTER",RES011,DIAPHRAGMATIC HERNIA REPAIR,911,EXTENSIVE ABDOMINAL/THORACIC PROCEDURES FOR MULT SIGNIFICANT TRAUMA,25,HUMAN IMMUNODEFICIENCY VIRUS INFECTIONS,4,Extreme,Major,Surgical,Medicaid,,,,,Y,199302.07,38831.7
Long Island,Nassau,2908000,000511,NYU Langone Hospital-Long Island,50 to 69,113,M,Other Race,Not Span/Hispanic,5,Trauma,Home w/ Home Health Services,2020,INJ010,"INTERNAL ORGAN INJURY, INITIAL ENCOUNTER",LYM005,SPLENECTOMY,911,EXTENSIVE ABDOMINAL/THORACIC PROCEDURES FOR MULT SIGNIFICANT TRAUMA,25,HUMAN IMMUNODEFICIENCY VIRUS INFECTIONS,4,Extreme,Major,Surgical,Medicaid,,,,,Y,196368.76,40805.62
Long Island,Nassau,2908000,000511,NYU Langone Hospital-Long Island,70 or Older,110,F,White,Not Span/Hispanic,1,Trauma,Expired,2020,INJ008,"TRAUMATIC BRAIN INJURY (TBI); CONCUSSION, INITIAL ENCOUNTER",URN008,NEPHRECTOMY AND URETERECTOMY,911,EXTENSIVE ABDOMINAL/THORACIC PROCEDURES FOR MULT SIGNIFICANT TRAUMA,25,HUMAN IMMUNODEFICIENCY VIRUS INFECTIONS,4,Extreme,Extreme,Surgical,Medicare,,,,,Y,220676.5,25922.3
Long Island,Nassau,2908000,000511,NYU Langone Hospital-Long Island,70 or Older,110,M,White,Not Span/Hispanic,6,Trauma,Home w/ Home Health Services,2020,INJ010,"INTERNAL ORGAN INJURY, INITIAL ENCOUNTER",CAR010,LIGATION AND EMBOLIZATION OF VESSELS,911,EXTENSIVE ABDOMINAL/THORACIC PROCEDURES FOR MULT SIGNIFICANT TRAUMA,25,HUMAN IMMUNODEFICIENCY VIRUS INFECTIONS,3,Major,Major,Surgical,Medicare,,,,,Y,260203.16,51113.76
Long Island,Nassau,2908000,000511,NYU Langone Hospital-Long Island,50 to 69,115,F,White,Not Span/Hispanic,15,Trauma,Home w/ Home Health Services,2020,INJ010,"INTERNAL ORGAN INJURY, INITIAL ENCOUNTER",RES011,DIAPHRAGMATIC HERNIA REPAIR,911,EXTENSIVE ABDOMINAL/THORACIC PROCEDURES FOR MULT SIGNIFICANT TRAUMA,25,HUMAN IMMUNODEFICIENCY VIRUS INFECTIONS,4,Extreme,Major,Surgical,Miscellaneous/Other,,,,,Y,725379.17,142616.05
