Hospital Service Area,Hospital County,Operating Certificate Number,Permanent Facility Id,Facility Name,Age Group,Zip Code - 3 digits,Gender,Race,Ethnicity,Length of Stay,Type of Admission,Patient Disposition,Discharge Year,CCS Diagnosis Code,CCS Diagnosis Description,CCS Procedure Code,CCS Procedure Description,APR DRG Code,APR DRG Description,APR MDC Code,APR MDC Description,APR Severity of Illness Code,APR Severity of Illness Description,APR Risk of Mortality,APR Medical Surgical Description,Payment Typology 1,Payment Typology 2,Payment Typology 3,Birth Weight,Abortion Edit Indicator,Emergency Department Indicator,Total Charges,Total Costs
New York City,Manhattan,7002001,001438,Bellevue Hospital Center,18 to 29,100,F,Other Race,Not Span/Hispanic,15,Emergency,Home or Self Care,2017,231,Other fractures,061,OT OR PRCS VES NOT HEAD,912,Musculoskeletal & other procedures for multiple significant trauma,25,Multiple Significant Trauma,4,Extreme,Major,Surgical,Private Health Insurance,,,,N,Y,104303.66,67249.58
New York City,Manhattan,7002001,001438,Bellevue Hospital Center,70 or Older,100,M,White,Not Span/Hispanic,5,Emergency,Inpatient Rehabilitation Facility,2017,226,Fracture of neck of femur (hip),146,"TRTMNT,FRAC HIP/FEMUR",912,Musculoskeletal & other procedures for multiple significant trauma,25,Multiple Significant Trauma,4,Extreme,Extreme,Surgical,Medicare,Private Health Insurance,,,N,Y,54624.55,35219.07
New York City,Manhattan,7002001,001438,Bellevue Hospital Center,50 to 69,113,M,Other Race,Not Span/Hispanic,9,Emergency,Another Type Not Listed,2017,230,Fracture of lower limb,147,"TRTMNT,FRAC LOWR EXTREM",912,Musculoskeletal & other procedures for multiple significant trauma,25,Multiple Significant Trauma,3,Major,Minor,Surgical,Miscellaneous/Other,,,,N,Y,62748.11,40456.72
New York City,Manhattan,7002001,001438,Bellevue Hospital Center,18 to 29,104,M,Other Race,Spanish/Hispanic,12,Emergency,Psychiatric Hospital or Unit of Hosp,2017,231,Other fractures,148,OT FRACTURE/DISLOC PRC,912,Musculoskeletal & other procedures for multiple significant trauma,25,Multiple Significant Trauma,3,Major,Moderate,Surgical,Self-Pay,,,,N,N,74041.76,47738.28
New York City,Manhattan,7002001,001438,Bellevue Hospital Center,70 or Older,100,M,Other Race,Not Span/Hispanic,7,Emergency,Another Type Not Listed,2017,226,Fracture of neck of femur (hip),146,"TRTMNT,FRAC HIP/FEMUR",912,Musculoskeletal & other procedures for multiple significant trauma,25,Multiple Significant Trauma,3,Major,Major,Surgical,Medicare,,,,N,Y,54315.86,35020.04
New York City,Manhattan,7002001,001438,Bellevue Hospital Center,18 to 29,100,M,Black/African American,Not Span/Hispanic,2,Emergency,Home or Self Care,2017,234,Crushing injury or internal injury,175,OT OR THER PRC SKN/BRST,912,Musculoskeletal & other procedures for multiple significant trauma,25,Multiple Significant Trauma,2,Moderate,Minor,Surgical,Self-Pay,,,,N,Y,20998.03,13538.44
New York City,Manhattan,7002001,001438,Bellevue Hospital Center,30 to 49,104,F,Other Race,Not Span/Hispanic,13,Emergency,Another Type Not Listed,2017,231,Other fractures,148,OT FRACTURE/DISLOC PRC,912,Musculoskeletal & other procedures for multiple significant trauma,25,Multiple Significant Trauma,4,Extreme,Extreme,Surgical,Miscellaneous/Other,Medicaid,,,N,N,116878.25,75357.02
New York City,Manhattan,7002001,001438,Bellevue Hospital Center,30 to 49,113,M,White,Not Span/Hispanic,5,Emergency,Home or Self Care,2017,226,Fracture of neck of femur (hip),146,"TRTMNT,FRAC HIP/FEMUR",912,Musculoskeletal & other procedures for multiple significant trauma,25,Multiple Significant Trauma,2,Moderate,Minor,Surgical,Miscellaneous/Other,,,,N,Y,42720.38,27543.88
New York City,Manhattan,7002001,001438,Bellevue Hospital Center,0 to 17,112,F,White,Not Span/Hispanic,2,Emergency,Home or Self Care,2017,230,Fracture of lower limb,146,"TRTMNT,FRAC HIP/FEMUR",912,Musculoskeletal & other procedures for multiple significant trauma,25,Multiple Significant Trauma,2,Moderate,Moderate,Surgical,Miscellaneous/Other,Medicaid,,,N,Y,27519.39,17743.07
New York City,Manhattan,7002001,001438,Bellevue Hospital Center,30 to 49,100,M,Black/African American,Not Span/Hispanic,8,Emergency,Home or Self Care,2017,229,Fracture of upper limb,145,"TRTMNT,FRAC RADIUS/ULNA",912,Musculoskeletal & other procedures for multiple significant trauma,25,Multiple Significant Trauma,3,Major,Moderate,Surgical,Medicaid,Medicaid,,,N,Y,47656.69,30726.56
New York City,Manhattan,7002001,001438,Bellevue Hospital Center,50 to 69,100,M,Black/African American,Not Span/Hispanic,5,Emergency,Home or Self Care,2017,226,Fracture of neck of femur (hip),153,"HIP REPLACEMENT,TOT/PRT",912,Musculoskeletal & other procedures for multiple significant trauma,25,Multiple Significant Trauma,3,Major,Major,Surgical,Medicare,,,,N,Y,38641.23,24913.86
New York City,Manhattan,7002001,001438,Bellevue Hospital Center,30 to 49,104,M,Other Race,Spanish/Hispanic,16,Emergency,Another Type Not Listed,2017,227,Spinal cord injury,158,SPINAL FUSION,912,Musculoskeletal & other procedures for multiple significant trauma,25,Multiple Significant Trauma,4,Extreme,Major,Surgical,Miscellaneous/Other,,,,N,Y,127497.13,82203.52
New York City,Manhattan,7002001,001438,Bellevue Hospital Center,30 to 49,100,M,Other Race,Spanish/Hispanic,12,Emergency,Psychiatric Hospital or Unit of Hosp,2017,236,Open wounds of extremities,164,OT OR THER PRC MUSC/SKL,912,Musculoskeletal & other procedures for multiple significant trauma,25,Multiple Significant Trauma,4,Extreme,Major,Surgical,Medicaid,,,,N,Y,94635.53,61016.07
New York City,Manhattan,7002001,001438,Bellevue Hospital Center,30 to 49,100,F,White,Not Span/Hispanic,25,Emergency,Home or Self Care,2017,231,Other fractures,158,SPINAL FUSION,912,Musculoskeletal & other procedures for multiple significant trauma,25,Multiple Significant Trauma,4,Extreme,Major,Surgical,Private Health Insurance,,,,N,Y,187971.96,121194.55
New York City,Manhattan,7002001,001438,Bellevue Hospital Center,18 to 29,,M,Other Race,Not Span/Hispanic,12,Emergency,Inpatient Rehabilitation Facility,2017,231,Other fractures,158,SPINAL FUSION,912,Musculoskeletal & other procedures for multiple significant trauma,25,Multiple Significant Trauma,3,Major,Major,Surgical,Blue Cross/Blue Shield,,,,N,Y,114648.46,73919.37
New York City,Manhattan,7002001,001438,Bellevue Hospital Center,50 to 69,112,M,Black/African American,Not Span/Hispanic,8,Emergency,Inpatient Rehabilitation Facility,2017,233,Intracranial injury,147,"TRTMNT,FRAC LOWR EXTREM",912,Musculoskeletal & other procedures for multiple significant trauma,25,Multiple Significant Trauma,4,Extreme,Major,Surgical,Miscellaneous/Other,Private Health Insurance,Private Health Insurance,,N,Y,74549.61,48065.71
New York City,Manhattan,7002001,001438,Bellevue Hospital Center,18 to 29,104,M,Other Race,Not Span/Hispanic,8,Emergency,Home or Self Care,2017,228,Skull and face fractures,158,SPINAL FUSION,912,Musculoskeletal & other procedures for multiple significant trauma,25,Multiple Significant Trauma,3,Major,Moderate,Surgical,Miscellaneous/Other,Medicaid,,,N,Y,66411.94,42818.97
New York City,Manhattan,7002001,001438,Bellevue Hospital Center,50 to 69,100,F,Other Race,Not Span/Hispanic,21,Emergency,Skilled Nursing Home,2017,231,Other fractures,148,OT FRACTURE/DISLOC PRC,912,Musculoskeletal & other procedures for multiple significant trauma,25,Multiple Significant Trauma,3,Major,Moderate,Surgical,Blue Cross/Blue Shield,,,,N,Y,161636.66,104214.91
New York City,Manhattan,7002001,001438,Bellevue Hospital Center,30 to 49,100,F,Other Race,Not Span/Hispanic,4,Emergency,Home or Self Care,2017,234,Crushing injury or internal injury,039,INCISION OF PLEURA,912,Musculoskeletal & other procedures for multiple significant trauma,25,Multiple Significant Trauma,4,Extreme,Major,Surgical,Private Health Insurance,,,,N,Y,29583.44,19073.86
New York City,Manhattan,7002001,001438,Bellevue Hospital Center,70 or Older,100,M,Other Race,Not Span/Hispanic,11,Emergency,Another Type Not Listed,2017,233,Intracranial injury,171,SUTURE SKIN/SUBCUT TISS,912,Musculoskeletal & other procedures for multiple significant trauma,25,Multiple Significant Trauma,3,Major,Moderate,Surgical,Miscellaneous/Other,Medicare,Medicaid,,N,Y,77173.13,49757.22
New York City,Manhattan,7002001,001438,Bellevue Hospital Center,70 or Older,100,M,White,Not Span/Hispanic,1,Emergency,Expired,2017,233,Intracranial injury,216,RESP INTUB/MECH VENTIL,912,Musculoskeletal & other procedures for multiple significant trauma,25,Multiple Significant Trauma,3,Major,Major,Surgical,Miscellaneous/Other,,,,N,Y,24018.25,15485.72
New York City,Manhattan,7002001,001438,Bellevue Hospital Center,50 to 69,100,M,White,Not Span/Hispanic,6,Emergency,Home or Self Care,2017,230,Fracture of lower limb,147,"TRTMNT,FRAC LOWR EXTREM",912,Musculoskeletal & other procedures for multiple significant trauma,25,Multiple Significant Trauma,2,Moderate,Minor,Surgical,Miscellaneous/Other,Medicare,Medicaid,,N,Y,47459.64,30599.51
New York City,Manhattan,7002001,001438,Bellevue Hospital Center,30 to 49,112,M,White,Not Span/Hispanic,10,Emergency,Home or Self Care,2017,231,Other fractures,148,OT FRACTURE/DISLOC PRC,912,Musculoskeletal & other procedures for multiple significant trauma,25,Multiple Significant Trauma,2,Moderate,Minor,Surgical,Miscellaneous/Other,,,,N,Y,87513.98,56424.46
New York City,Manhattan,7002001,001438,Bellevue Hospital Center,30 to 49,OOS,M,Other Race,Not Span/Hispanic,11,Emergency,Home or Self Care,2017,233,Intracranial injury,148,OT FRACTURE/DISLOC PRC,912,Musculoskeletal & other procedures for multiple significant trauma,25,Multiple Significant Trauma,3,Major,Moderate,Surgical,Medicare,,,,N,Y,86974.85,56076.86
New York City,Manhattan,7002001,001438,Bellevue Hospital Center,30 to 49,112,M,Other Race,Spanish/Hispanic,4,Emergency,Home or Self Care,2017,229,Fracture of upper limb,145,"TRTMNT,FRAC RADIUS/ULNA",912,Musculoskeletal & other procedures for multiple significant trauma,25,Multiple Significant Trauma,4,Extreme,Major,Surgical,Medicaid,Medicaid,,,N,Y,40516.68,26123.05
New York City,Manhattan,7002001,001438,Bellevue Hospital Center,70 or Older,100,F,White,Not Span/Hispanic,4,Emergency,Expired,2017,236,Open wounds of extremities,157,AMPUTATE LOWER EXTRMITY,912,Musculoskeletal & other procedures for multiple significant trauma,25,Multiple Significant Trauma,4,Extreme,Extreme,Surgical,Miscellaneous/Other,Medicare,Blue Cross/Blue Shield,,N,Y,55258.26,35627.65
New York City,Manhattan,7002001,001438,Bellevue Hospital Center,30 to 49,104,M,Other Race,Spanish/Hispanic,9,Emergency,Another Type Not Listed,2017,231,Other fractures,148,OT FRACTURE/DISLOC PRC,912,Musculoskeletal & other procedures for multiple significant trauma,25,Multiple Significant Trauma,3,Major,Major,Surgical,Miscellaneous/Other,Medicaid,,,N,N,71894.75,46354.00
New York City,Manhattan,7002001,001438,Bellevue Hospital Center,30 to 49,109,M,White,Not Span/Hispanic,2,Emergency,Home or Self Care,2017,230,Fracture of lower limb,175,OT OR THER PRC SKN/BRST,912,Musculoskeletal & other procedures for multiple significant trauma,25,Multiple Significant Trauma,2,Moderate,Minor,Surgical,Miscellaneous/Other,,,,N,Y,22655.50,14607.09
New York City,Manhattan,7002001,001438,Bellevue Hospital Center,30 to 49,OOS,M,Black/African American,Not Span/Hispanic,13,Emergency,Home or Self Care,2017,228,Skull and face fractures,144,"TRTMNT,FACE FRACT/DISLC",912,Musculoskeletal & other procedures for multiple significant trauma,25,Multiple Significant Trauma,3,Major,Moderate,Surgical,Private Health Insurance,,,,N,Y,88489.73,57053.58
New York City,Manhattan,7002001,001438,Bellevue Hospital Center,50 to 69,113,M,Black/African American,Not Span/Hispanic,8,Emergency,Home or Self Care,2017,230,Fracture of lower limb,147,"TRTMNT,FRAC LOWR EXTREM",912,Musculoskeletal & other procedures for multiple significant trauma,25,Multiple Significant Trauma,2,Moderate,Minor,Surgical,Miscellaneous/Other,Miscellaneous/Other,Medicaid,,N,Y,61873.75,39892.98
New York City,Manhattan,7002001,001438,Bellevue Hospital Center,30 to 49,104,M,Other Race,Not Span/Hispanic,14,Emergency,Skilled Nursing Home,2017,231,Other fractures,148,OT FRACTURE/DISLOC PRC,912,Musculoskeletal & other procedures for multiple significant trauma,25,Multiple Significant Trauma,3,Major,Major,Surgical,Miscellaneous/Other,Private Health Insurance,,,N,Y,108829.21,70167.42
New York City,Manhattan,7002001,001438,Bellevue Hospital Center,50 to 69,100,M,Black/African American,Not Span/Hispanic,5,Emergency,Inpatient Rehabilitation Facility,2017,231,Other fractures,142,PARTIAL EXCISION BONE,912,Musculoskeletal & other procedures for multiple significant trauma,25,Multiple Significant Trauma,2,Moderate,Minor,Surgical,Medicare,Medicaid,,,N,Y,41426.21,26709.47
New York City,Manhattan,7002001,001438,Bellevue Hospital Center,30 to 49,112,M,Other Race,Not Span/Hispanic,1,Emergency,Expired,2017,228,Skull and face fractures,177,COMP AXIAL TOMOGR (CT),912,Musculoskeletal & other procedures for multiple significant trauma,25,Multiple Significant Trauma,3,Major,Moderate,Surgical,Miscellaneous/Other,,,,N,Y,24600.85,15861.35
New York City,Manhattan,7002001,001438,Bellevue Hospital Center,70 or Older,112,M,Other Race,Not Span/Hispanic,18,Emergency,Skilled Nursing Home,2017,230,Fracture of lower limb,147,"TRTMNT,FRAC LOWR EXTREM",912,Musculoskeletal & other procedures for multiple significant trauma,25,Multiple Significant Trauma,3,Major,Minor,Surgical,Miscellaneous/Other,Medicare,,,N,Y,106873.73,68906.62
New York City,Manhattan,7002001,001438,Bellevue Hospital Center,30 to 49,OOS,M,White,Not Span/Hispanic,26,Emergency,Home w/ Home Health Services,2017,230,Fracture of lower limb,174,OT NON-OR THER PRC SKIN,912,Musculoskeletal & other procedures for multiple significant trauma,25,Multiple Significant Trauma,4,Extreme,Major,Surgical,Miscellaneous/Other,Private Health Insurance,Medicaid,,N,Y,167739.62,108149.78
New York City,Manhattan,7002001,001438,Bellevue Hospital Center,18 to 29,112,F,White,Not Span/Hispanic,17,Emergency,Inpatient Rehabilitation Facility,2017,236,Open wounds of extremities,157,AMPUTATE LOWER EXTRMITY,912,Musculoskeletal & other procedures for multiple significant trauma,25,Multiple Significant Trauma,3,Major,Major,Surgical,Blue Cross/Blue Shield,,,,N,Y,113136.31,72944.41
New York City,Manhattan,7002001,001438,Bellevue Hospital Center,30 to 49,100,M,Other Race,Spanish/Hispanic,19,Elective,Home or Self Care,2017,225,Joint disorders and dislocations; trauma-related,148,OT FRACTURE/DISLOC PRC,912,Musculoskeletal & other procedures for multiple significant trauma,25,Multiple Significant Trauma,2,Moderate,Minor,Surgical,Medicaid,Medicaid,,,N,Y,105113.79,67771.91
New York City,Manhattan,7002001,001438,Bellevue Hospital Center,18 to 29,OOS,M,White,Not Span/Hispanic,20,Emergency,Another Type Not Listed,2017,231,Other fractures,158,SPINAL FUSION,912,Musculoskeletal & other procedures for multiple significant trauma,25,Multiple Significant Trauma,3,Major,Minor,Surgical,Private Health Insurance,,,,N,Y,177770.25,114617.01
New York City,Manhattan,7002001,001438,Bellevue Hospital Center,50 to 69,113,M,Other Race,Not Span/Hispanic,1,Emergency,Home or Self Care,2017,229,Fracture of upper limb,145,"TRTMNT,FRAC RADIUS/ULNA",912,Musculoskeletal & other procedures for multiple significant trauma,25,Multiple Significant Trauma,3,Major,Minor,Surgical,Private Health Insurance,,,,N,N,13751.94,8866.54
New York City,Manhattan,7002001,001438,Bellevue Hospital Center,18 to 29,104,M,Other Race,Not Span/Hispanic,32,Elective,Inpatient Rehabilitation Facility,2017,233,Intracranial injury,175,OT OR THER PRC SKN/BRST,912,Musculoskeletal & other procedures for multiple significant trauma,25,Multiple Significant Trauma,4,Extreme,Major,Surgical,Medicaid,,,,N,Y,209999.77,135396.93
New York City,Manhattan,7002001,001438,Bellevue Hospital Center,50 to 69,114,M,Other Race,Not Span/Hispanic,19,Emergency,Skilled Nursing Home,2017,231,Other fractures,216,RESP INTUB/MECH VENTIL,912,Musculoskeletal & other procedures for multiple significant trauma,25,Multiple Significant Trauma,4,Extreme,Extreme,Surgical,Medicare,,,,N,Y,132478.04,85414.95
New York City,Manhattan,7002001,001438,Bellevue Hospital Center,30 to 49,112,M,Other Race,Not Span/Hispanic,1,Emergency,Expired,2017,228,Skull and face fractures,177,COMP AXIAL TOMOGR (CT),912,Musculoskeletal & other procedures for multiple significant trauma,25,Multiple Significant Trauma,3,Major,Moderate,Surgical,Miscellaneous/Other,,,,N,Y,24600.85,15861.35
New York City,Manhattan,7002001,001438,Bellevue Hospital Center,0 to 17,,F,Other Race,Not Span/Hispanic,1,Emergency,Short-term Hospital,2017,233,Intracranial injury,216,RESP INTUB/MECH VENTIL,912,Musculoskeletal & other procedures for multiple significant trauma,25,Multiple Significant Trauma,4,Extreme,Major,Surgical,Private Health Insurance,Medicaid,,,N,Y,18711.39,12064.13
New York City,Manhattan,7002001,001438,Bellevue Hospital Center,50 to 69,113,M,White,Not Span/Hispanic,9,Emergency,Inpatient Rehabilitation Facility,2017,234,Crushing injury or internal injury,146,"TRTMNT,FRAC HIP/FEMUR",912,Musculoskeletal & other procedures for multiple significant trauma,25,Multiple Significant Trauma,4,Extreme,Extreme,Surgical,Miscellaneous/Other,Medicaid,,,N,N,77342.04,49866.13
