Hospital Service Area,Hospital County,Operating Certificate Number,Permanent Facility Id,Facility Name,Age Group,Zip Code - 3 digits,Gender,Race,Ethnicity,Length of Stay,Type of Admission,Patient Disposition,Discharge Year,CCS Diagnosis Code,CCS Diagnosis Description,CCS Procedure Code,CCS Procedure Description,APR DRG Code,APR DRG Description,APR MDC Code,APR MDC Description,APR Severity of Illness Code,APR Severity of Illness Description,APR Risk of Mortality,APR Medical Surgical Description,Payment Typology 1,Payment Typology 2,Payment Typology 3,Birth Weight,Abortion Edit Indicator,Emergency Department Indicator,Total Charges,Total Costs
New York City,Manhattan,7002032,001469,Mount Sinai Morningside,30 to 49,100,M,Black/African American,Not Span/Hispanic,16,Emergency,Skilled Nursing Home,2020,INJ009,"SPINAL CORD INJURY (SCI), INITIAL ENCOUNTER",MST013,SPINE FUSION,912,MUSCULOSKELETAL & OTHER PROCEDURES FOR MULTIPLE SIGNIFICANT TRAUMA,25,HUMAN IMMUNODEFICIENCY VIRUS INFECTIONS,4,Extreme,Major,Surgical,Medicaid,Medicaid,Self-Pay,,,Y,322634.57,80966.44
New York City,Manhattan,7002032,001469,Mount Sinai Morningside,50 to 69,100,F,Black/African American,Not Span/Hispanic,25,Emergency,Skilled Nursing Home,2020,INJ005,"FRACTURE OF THE LOWER LIMB (EXCEPT HIP), INITIAL ENCOUNTER",MST011,FIXATION OF LEG AND FOOT BONES,912,MUSCULOSKELETAL & OTHER PROCEDURES FOR MULTIPLE SIGNIFICANT TRAUMA,25,HUMAN IMMUNODEFICIENCY VIRUS INFECTIONS,3,Major,Moderate,Surgical,Miscellaneous/Other,Medicaid,Self-Pay,,,Y,333514.93,76548.66
New York City,Manhattan,7002032,001466,Mount Sinai West,70 or Older,100,F,White,Not Span/Hispanic,3,Emergency,Home w/ Home Health Services,2020,INJ006,"FRACTURE OF THE NECK OF THE FEMUR (HIP), INITIAL ENCOUNTER",MST010,FEMUR FIXATION,912,MUSCULOSKELETAL & OTHER PROCEDURES FOR MULTIPLE SIGNIFICANT TRAUMA,25,HUMAN IMMUNODEFICIENCY VIRUS INFECTIONS,2,Moderate,Minor,Surgical,Medicare,Private Health Insurance,Self-Pay,,,Y,59768.31,14035.35
Hudson Valley,Westchester,5904001,001072,Montefiore New Rochelle Hospital,70 or Older,108,F,White,Multi-ethnic,7,Emergency,Skilled Nursing Home,2020,INJ006,"FRACTURE OF THE NECK OF THE FEMUR (HIP), INITIAL ENCOUNTER",MST010,FEMUR FIXATION,912,MUSCULOSKELETAL & OTHER PROCEDURES FOR MULTIPLE SIGNIFICANT TRAUMA,25,HUMAN IMMUNODEFICIENCY VIRUS INFECTIONS,3,Major,Extreme,Surgical,Medicare,Medicare,Private Health Insurance,,,Y,91810.29,45850.17
Hudson Valley,Westchester,5904001,001072,Montefiore New Rochelle Hospital,70 or Older,108,F,White,Unknown,8,Emergency,Skilled Nursing Home,2020,INJ006,"FRACTURE OF THE NECK OF THE FEMUR (HIP), INITIAL ENCOUNTER",MST010,FEMUR FIXATION,912,MUSCULOSKELETAL & OTHER PROCEDURES FOR MULTIPLE SIGNIFICANT TRAUMA,25,HUMAN IMMUNODEFICIENCY VIRUS INFECTIONS,3,Major,Minor,Surgical,Medicare,Medicare,Blue Cross/Blue Shield,,,Y,93701.91,29276.12
New York City,Queens,7003010,001637,New York - Presbyterian/Queens,50 to 69,113,M,White,Not Span/Hispanic,10,Urgent,Skilled Nursing Home,2020,INJ003,"FRACTURE OF TORSO, INITIAL ENCOUNTER",MST012,BONE FIXATION (EXCLUDING EXTREMITIES),912,MUSCULOSKELETAL & OTHER PROCEDURES FOR MULTIPLE SIGNIFICANT TRAUMA,25,HUMAN IMMUNODEFICIENCY VIRUS INFECTIONS,3,Major,Major,Surgical,"Managed Care, Unspecified",Medicaid,Self-Pay,,,Y,272667,78867.38
New York City,Queens,7003010,001637,New York - Presbyterian/Queens,70 or Older,113,M,Other Race,Not Span/Hispanic,8,Emergency,Skilled Nursing Home,2020,INJ002,"FRACTURE OF THE SPINE AND BACK, INITIAL ENCOUNTER",MST013,SPINE FUSION,912,MUSCULOSKELETAL & OTHER PROCEDURES FOR MULTIPLE SIGNIFICANT TRAUMA,25,HUMAN IMMUNODEFICIENCY VIRUS INFECTIONS,2,Moderate,Minor,Surgical,Medicare,Medicare,Medicaid,,,Y,92240.85,25161.86
New York City,Queens,7003010,001637,New York - Presbyterian/Queens,70 or Older,113,F,Multi-racial,Not Span/Hispanic,9,Trauma,Skilled Nursing Home,2020,INJ006,"FRACTURE OF THE NECK OF THE FEMUR (HIP), INITIAL ENCOUNTER",MST010,FEMUR FIXATION,912,MUSCULOSKELETAL & OTHER PROCEDURES FOR MULTIPLE SIGNIFICANT TRAUMA,25,HUMAN IMMUNODEFICIENCY VIRUS INFECTIONS,3,Major,Major,Surgical,Medicare,Medicare,Medicaid,,,Y,112978.05,26685.21
New York City,Manhattan,7002054,001458,New York-Presbyterian Hospital - New York Weill Cornell Center,70 or Older,100,F,White,Not Span/Hispanic,6,Emergency,Skilled Nursing Home,2020,INJ006,"FRACTURE OF THE NECK OF THE FEMUR (HIP), INITIAL ENCOUNTER",MST010,FEMUR FIXATION,912,MUSCULOSKELETAL & OTHER PROCEDURES FOR MULTIPLE SIGNIFICANT TRAUMA,25,HUMAN IMMUNODEFICIENCY VIRUS INFECTIONS,2,Moderate,Minor,Surgical,Medicare,Private Health Insurance,Self-Pay,,,Y,171252.17,52748.49
New York City,Manhattan,7002054,001458,New York-Presbyterian Hospital - New York Weill Cornell Center,70 or Older,100,M,White,Not Span/Hispanic,9,Emergency,Skilled Nursing Home,2020,INJ003,"FRACTURE OF TORSO, INITIAL ENCOUNTER",MST012,BONE FIXATION (EXCLUDING EXTREMITIES),912,MUSCULOSKELETAL & OTHER PROCEDURES FOR MULTIPLE SIGNIFICANT TRAUMA,25,HUMAN IMMUNODEFICIENCY VIRUS INFECTIONS,3,Major,Major,Surgical,Medicare,Self-Pay,,,,Y,178164.46,45481.54
New York City,Kings,7001021,001306,New York - Presbyterian Brooklyn Methodist Hospital,30 to 49,112,M,Black/African American,Not Span/Hispanic,4,Emergency,Home or Self Care,2020,INJ013,"OPEN WOUNDS OF TRUNK, INITIAL ENCOUNTER",RES005,CHEST TUBE PLACEMENT AND THERAPEUTIC THORACENTESIS,912,MUSCULOSKELETAL & OTHER PROCEDURES FOR MULTIPLE SIGNIFICANT TRAUMA,25,HUMAN IMMUNODEFICIENCY VIRUS INFECTIONS,4,Extreme,Major,Surgical,"Managed Care, Unspecified",Medicaid,Self-Pay,,,Y,90979.61,20089.37
Long Island,Nassau,2950002,000528,Nassau University Medical Center,50 to 69,117,M,White,Not Span/Hispanic,4,Trauma,Inpatient Rehabilitation Facility,2020,INJ003,"FRACTURE OF TORSO, INITIAL ENCOUNTER",MST012,BONE FIXATION (EXCLUDING EXTREMITIES),912,MUSCULOSKELETAL & OTHER PROCEDURES FOR MULTIPLE SIGNIFICANT TRAUMA,25,HUMAN IMMUNODEFICIENCY VIRUS INFECTIONS,3,Major,Minor,Surgical,Miscellaneous/Other,Blue Cross/Blue Shield,Self-Pay,,,N,64481.84,26342.96
Western NY,Erie,1401005,000210,Erie County Medical Center,50 to 69,142,M,White,Not Span/Hispanic,12,Emergency,Skilled Nursing Home,2020,INJ009,"SPINAL CORD INJURY (SCI), INITIAL ENCOUNTER",MST013,SPINE FUSION,912,MUSCULOSKELETAL & OTHER PROCEDURES FOR MULTIPLE SIGNIFICANT TRAUMA,25,HUMAN IMMUNODEFICIENCY VIRUS INFECTIONS,3,Major,Minor,Surgical,Medicare,Medicare,,,,Y,65646.72,32456.62
New York City,Kings,7002002,001324,Mount Sinai Brooklyn,70 or Older,112,F,White,Not Span/Hispanic,8,Emergency,Skilled Nursing Home,2020,INJ006,"FRACTURE OF THE NECK OF THE FEMUR (HIP), INITIAL ENCOUNTER",MST010,FEMUR FIXATION,912,MUSCULOSKELETAL & OTHER PROCEDURES FOR MULTIPLE SIGNIFICANT TRAUMA,25,HUMAN IMMUNODEFICIENCY VIRUS INFECTIONS,2,Moderate,Minor,Surgical,Miscellaneous/Other,Medicare,Self-Pay,,,Y,110501.87,16422.15
Western NY,Erie,1401005,000210,Erie County Medical Center,70 or Older,147,F,White,Not Span/Hispanic,5,Emergency,Skilled Nursing Home,2020,INJ002,"FRACTURE OF THE SPINE AND BACK, INITIAL ENCOUNTER",MST013,SPINE FUSION,912,MUSCULOSKELETAL & OTHER PROCEDURES FOR MULTIPLE SIGNIFICANT TRAUMA,25,HUMAN IMMUNODEFICIENCY VIRUS INFECTIONS,3,Major,Moderate,Surgical,Miscellaneous/Other,Medicare,Private Health Insurance,,,Y,54813.65,22004.72
Western NY,Erie,1401005,000210,Erie County Medical Center,50 to 69,142,M,White,Not Span/Hispanic,6,Emergency,Federal Health Care Facility,2020,INJ005,"FRACTURE OF THE LOWER LIMB (EXCEPT HIP), INITIAL ENCOUNTER",MST010,FEMUR FIXATION,912,MUSCULOSKELETAL & OTHER PROCEDURES FOR MULTIPLE SIGNIFICANT TRAUMA,25,HUMAN IMMUNODEFICIENCY VIRUS INFECTIONS,3,Major,Minor,Surgical,Self-Pay,,,,,Y,57539.56,22966.2
Western NY,Erie,1401005,000210,Erie County Medical Center,30 to 49,140,F,White,Not Span/Hispanic,9,Emergency,Home or Self Care,2020,INJ005,"FRACTURE OF THE LOWER LIMB (EXCEPT HIP), INITIAL ENCOUNTER",MST011,FIXATION OF LEG AND FOOT BONES,912,MUSCULOSKELETAL & OTHER PROCEDURES FOR MULTIPLE SIGNIFICANT TRAUMA,25,HUMAN IMMUNODEFICIENCY VIRUS INFECTIONS,3,Major,Minor,Surgical,Self-Pay,,,,,Y,61907.2,33113.43
Western NY,Erie,1401005,000210,Erie County Medical Center,70 or Older,143,M,White,Not Span/Hispanic,32,Emergency,Skilled Nursing Home,2020,INJ002,"FRACTURE OF THE SPINE AND BACK, INITIAL ENCOUNTER",MST013,SPINE FUSION,912,MUSCULOSKELETAL & OTHER PROCEDURES FOR MULTIPLE SIGNIFICANT TRAUMA,25,HUMAN IMMUNODEFICIENCY VIRUS INFECTIONS,4,Extreme,Extreme,Surgical,Medicare,Medicare,,,,Y,242542.89,131590.33
Western NY,Erie,1401005,000210,Erie County Medical Center,50 to 69,141,F,White,Not Span/Hispanic,19,Emergency,Inpatient Rehabilitation Facility,2020,INJ008,"TRAUMATIC BRAIN INJURY (TBI); CONCUSSION, INITIAL ENCOUNTER",MST012,BONE FIXATION (EXCLUDING EXTREMITIES),912,MUSCULOSKELETAL & OTHER PROCEDURES FOR MULTIPLE SIGNIFICANT TRAUMA,25,HUMAN IMMUNODEFICIENCY VIRUS INFECTIONS,4,Extreme,Major,Surgical,Miscellaneous/Other,Medicare,,,,Y,205730.86,95581.03
Western NY,Erie,1401005,000210,Erie County Medical Center,30 to 49,140,F,White,Not Span/Hispanic,24,Emergency,Skilled Nursing Home,2020,INJ005,"FRACTURE OF THE LOWER LIMB (EXCEPT HIP), INITIAL ENCOUNTER",MST011,FIXATION OF LEG AND FOOT BONES,912,MUSCULOSKELETAL & OTHER PROCEDURES FOR MULTIPLE SIGNIFICANT TRAUMA,25,HUMAN IMMUNODEFICIENCY VIRUS INFECTIONS,3,Major,Moderate,Surgical,Miscellaneous/Other,Blue Cross/Blue Shield,,,,Y,100572.55,60177.15
Western NY,Erie,1401005,000210,Erie County Medical Center,50 to 69,142,M,White,Not Span/Hispanic,9,Emergency,Home or Self Care,2020,INJ003,"FRACTURE OF TORSO, INITIAL ENCOUNTER",MST012,BONE FIXATION (EXCLUDING EXTREMITIES),912,MUSCULOSKELETAL & OTHER PROCEDURES FOR MULTIPLE SIGNIFICANT TRAUMA,25,HUMAN IMMUNODEFICIENCY VIRUS INFECTIONS,2,Moderate,Minor,Surgical,Blue Cross/Blue Shield,,,,,Y,85589.75,43586.94
Western NY,Erie,1401005,000210,Erie County Medical Center,30 to 49,143,M,White,Not Span/Hispanic,14,Emergency,Skilled Nursing Home,2020,INJ005,"FRACTURE OF THE LOWER LIMB (EXCEPT HIP), INITIAL ENCOUNTER",MST011,FIXATION OF LEG AND FOOT BONES,912,MUSCULOSKELETAL & OTHER PROCEDURES FOR MULTIPLE SIGNIFICANT TRAUMA,25,HUMAN IMMUNODEFICIENCY VIRUS INFECTIONS,2,Moderate,Moderate,Surgical,Miscellaneous/Other,Private Health Insurance,,,,Y,75171.68,38264.37
Western NY,Erie,1401005,000210,Erie County Medical Center,70 or Older,142,F,White,Not Span/Hispanic,10,Emergency,Inpatient Rehabilitation Facility,2020,INJ009,"SPINAL CORD INJURY (SCI), INITIAL ENCOUNTER",MST016,VERTEBRAL DISCECTOMY,912,MUSCULOSKELETAL & OTHER PROCEDURES FOR MULTIPLE SIGNIFICANT TRAUMA,25,HUMAN IMMUNODEFICIENCY VIRUS INFECTIONS,3,Major,Major,Surgical,Self-Pay,Medicare,,,,Y,98356.5,45022.96
Western NY,Erie,1401005,000210,Erie County Medical Center,50 to 69,142,M,White,Not Span/Hispanic,13,Emergency,Inpatient Rehabilitation Facility,2020,INJ008,"TRAUMATIC BRAIN INJURY (TBI); CONCUSSION, INITIAL ENCOUNTER",SKB006,SKIN LACERATION REPAIR (EXCLUDING PERINEUM),912,MUSCULOSKELETAL & OTHER PROCEDURES FOR MULTIPLE SIGNIFICANT TRAUMA,25,HUMAN IMMUNODEFICIENCY VIRUS INFECTIONS,3,Major,Minor,Surgical,Miscellaneous/Other,Medicaid,,,,Y,88541.33,41429.29
Western NY,Erie,1401005,000210,Erie County Medical Center,30 to 49,147,M,White,Not Span/Hispanic,2,Emergency,Home w/ Home Health Services,2020,INJ005,"FRACTURE OF THE LOWER LIMB (EXCEPT HIP), INITIAL ENCOUNTER",MST011,FIXATION OF LEG AND FOOT BONES,912,MUSCULOSKELETAL & OTHER PROCEDURES FOR MULTIPLE SIGNIFICANT TRAUMA,25,HUMAN IMMUNODEFICIENCY VIRUS INFECTIONS,3,Major,Moderate,Surgical,Miscellaneous/Other,Private Health Insurance,,,,Y,30390.1,12307.79
New York City,Manhattan,7002032,001466,Mount Sinai West,70 or Older,100,F,Other Race,Not Span/Hispanic,7,Emergency,Skilled Nursing Home,2020,INJ006,"FRACTURE OF THE NECK OF THE FEMUR (HIP), INITIAL ENCOUNTER",MST007,HIP ARTHROPLASTY,912,MUSCULOSKELETAL & OTHER PROCEDURES FOR MULTIPLE SIGNIFICANT TRAUMA,25,HUMAN IMMUNODEFICIENCY VIRUS INFECTIONS,2,Moderate,Minor,Surgical,Medicare,Medicare,Self-Pay,,,Y,104169.73,24107.09
Capital/Adirond,Otsego,3824000,000746,Mary Imogene Bassett Hospital,50 to 69,120,M,White,Not Span/Hispanic,3,Trauma,Home w/ Home Health Services,2020,INJ005,"FRACTURE OF THE LOWER LIMB (EXCEPT HIP), INITIAL ENCOUNTER",GIS011,SMALL BOWEL RESECTION,912,MUSCULOSKELETAL & OTHER PROCEDURES FOR MULTIPLE SIGNIFICANT TRAUMA,25,HUMAN IMMUNODEFICIENCY VIRUS INFECTIONS,3,Major,Minor,Surgical,Miscellaneous/Other,,,,,N,66778.04,30397.56
New York City,Kings,7002053,001304,NYU Langone Hospital-Brooklyn,18 to 29,OOS,M,Other Race,Not Span/Hispanic,5,Emergency,Home or Self Care,2020,INJ003,"FRACTURE OF TORSO, INITIAL ENCOUNTER",MST012,BONE FIXATION (EXCLUDING EXTREMITIES),912,MUSCULOSKELETAL & OTHER PROCEDURES FOR MULTIPLE SIGNIFICANT TRAUMA,25,HUMAN IMMUNODEFICIENCY VIRUS INFECTIONS,3,Major,Moderate,Surgical,Miscellaneous/Other,,,,,Y,174591.11,33505.72
Finger Lakes,Monroe,2701005,000413,Strong Memorial Hospital,18 to 29,OOS,F,Other Race,Unknown,13,Emergency,Inpatient Rehabilitation Facility,2020,INJ004,"FRACTURE OF THE UPPER LIMB, INITIAL ENCOUNTER",MST009,FIXATION OF UPPER EXTREMITY BONES,912,MUSCULOSKELETAL & OTHER PROCEDURES FOR MULTIPLE SIGNIFICANT TRAUMA,25,HUMAN IMMUNODEFICIENCY VIRUS INFECTIONS,3,Major,Minor,Surgical,Miscellaneous/Other,Private Health Insurance,,,,Y,93087.19,39705.77
Finger Lakes,Monroe,2701005,000413,Strong Memorial Hospital,50 to 69,148,F,White,Not Span/Hispanic,12,Emergency,Inpatient Rehabilitation Facility,2020,INJ002,"FRACTURE OF THE SPINE AND BACK, INITIAL ENCOUNTER",MST013,SPINE FUSION,912,MUSCULOSKELETAL & OTHER PROCEDURES FOR MULTIPLE SIGNIFICANT TRAUMA,25,HUMAN IMMUNODEFICIENCY VIRUS INFECTIONS,3,Major,Extreme,Surgical,Blue Cross/Blue Shield,,,,,Y,154333.7,63587.32
Finger Lakes,Monroe,2701005,000413,Strong Memorial Hospital,18 to 29,146,F,Black/African American,Not Span/Hispanic,17,Emergency,Skilled Nursing Home,2020,INJ003,"FRACTURE OF TORSO, INITIAL ENCOUNTER",MST011,FIXATION OF LEG AND FOOT BONES,912,MUSCULOSKELETAL & OTHER PROCEDURES FOR MULTIPLE SIGNIFICANT TRAUMA,25,HUMAN IMMUNODEFICIENCY VIRUS INFECTIONS,3,Major,Minor,Surgical,Miscellaneous/Other,Medicaid,,,,Y,92042.69,42270.01
Finger Lakes,Monroe,2701005,000413,Strong Memorial Hospital,50 to 69,146,M,Black/African American,Not Span/Hispanic,52,Emergency,Skilled Nursing Home,2020,INJ007,"DISLOCATIONS, INITIAL ENCOUNTER",MST012,BONE FIXATION (EXCLUDING EXTREMITIES),912,MUSCULOSKELETAL & OTHER PROCEDURES FOR MULTIPLE SIGNIFICANT TRAUMA,25,HUMAN IMMUNODEFICIENCY VIRUS INFECTIONS,4,Extreme,Extreme,Surgical,Miscellaneous/Other,Medicaid,,,,Y,439590.63,187334.24
Finger Lakes,Wayne,5820000,001028,Newark-Wayne Community Hospital,70 or Older,144,F,White,Not Span/Hispanic,9,Emergency,Skilled Nursing Home,2020,INJ006,"FRACTURE OF THE NECK OF THE FEMUR (HIP), INITIAL ENCOUNTER",MST010,FEMUR FIXATION,912,MUSCULOSKELETAL & OTHER PROCEDURES FOR MULTIPLE SIGNIFICANT TRAUMA,25,HUMAN IMMUNODEFICIENCY VIRUS INFECTIONS,3,Major,Moderate,Surgical,Medicare,,,,,Y,41978.27,16482.12
Finger Lakes,Monroe,2701005,000413,Strong Memorial Hospital,70 or Older,144,M,White,Not Span/Hispanic,13,Emergency,Inpatient Rehabilitation Facility,2020,INJ003,"FRACTURE OF TORSO, INITIAL ENCOUNTER",MST012,BONE FIXATION (EXCLUDING EXTREMITIES),912,MUSCULOSKELETAL & OTHER PROCEDURES FOR MULTIPLE SIGNIFICANT TRAUMA,25,HUMAN IMMUNODEFICIENCY VIRUS INFECTIONS,3,Major,Moderate,Surgical,Medicare,,,,,Y,106248,38985.88
Finger Lakes,Monroe,2701005,000413,Strong Memorial Hospital,50 to 69,145,F,White,Not Span/Hispanic,2,Emergency,Home w/ Home Health Services,2020,INJ005,"FRACTURE OF THE LOWER LIMB (EXCEPT HIP), INITIAL ENCOUNTER",MST011,FIXATION OF LEG AND FOOT BONES,912,MUSCULOSKELETAL & OTHER PROCEDURES FOR MULTIPLE SIGNIFICANT TRAUMA,25,HUMAN IMMUNODEFICIENCY VIRUS INFECTIONS,3,Major,Moderate,Surgical,Miscellaneous/Other,Medicare,,,,Y,39133.44,15379.49
Finger Lakes,Monroe,2701001,000409,Highland Hospital,70 or Older,146,F,White,Not Span/Hispanic,3,Emergency,Skilled Nursing Home,2020,INJ006,"FRACTURE OF THE NECK OF THE FEMUR (HIP), INITIAL ENCOUNTER",MST007,HIP ARTHROPLASTY,912,MUSCULOSKELETAL & OTHER PROCEDURES FOR MULTIPLE SIGNIFICANT TRAUMA,25,HUMAN IMMUNODEFICIENCY VIRUS INFECTIONS,2,Moderate,Moderate,Surgical,Medicare,,,,,Y,27450.98,9478.9
Finger Lakes,Monroe,2701001,000409,Highland Hospital,70 or Older,145,F,White,Not Span/Hispanic,7,Emergency,Skilled Nursing Home,2020,INJ006,"FRACTURE OF THE NECK OF THE FEMUR (HIP), INITIAL ENCOUNTER",MST007,HIP ARTHROPLASTY,912,MUSCULOSKELETAL & OTHER PROCEDURES FOR MULTIPLE SIGNIFICANT TRAUMA,25,HUMAN IMMUNODEFICIENCY VIRUS INFECTIONS,2,Moderate,Moderate,Surgical,Medicare,Blue Cross/Blue Shield,,,,Y,36298.06,12985.1
Finger Lakes,Monroe,2701005,000413,Strong Memorial Hospital,30 to 49,146,F,White,Spanish/Hispanic,15,Emergency,Home w/ Home Health Services,2020,INJ003,"FRACTURE OF TORSO, INITIAL ENCOUNTER",MST019,"MUSCLE, TENDON, BURSA, AND LIGAMENT EXCISION",912,MUSCULOSKELETAL & OTHER PROCEDURES FOR MULTIPLE SIGNIFICANT TRAUMA,25,HUMAN IMMUNODEFICIENCY VIRUS INFECTIONS,2,Moderate,Minor,Surgical,Miscellaneous/Other,Medicaid,,,,Y,82456.07,37944.14
Finger Lakes,Monroe,2701005,000413,Strong Memorial Hospital,18 to 29,146,M,White,Spanish/Hispanic,7,Emergency,Home or Self Care,2020,INJ006,"FRACTURE OF THE NECK OF THE FEMUR (HIP), INITIAL ENCOUNTER",RES005,CHEST TUBE PLACEMENT AND THERAPEUTIC THORACENTESIS,912,MUSCULOSKELETAL & OTHER PROCEDURES FOR MULTIPLE SIGNIFICANT TRAUMA,25,HUMAN IMMUNODEFICIENCY VIRUS INFECTIONS,3,Major,Moderate,Surgical,Miscellaneous/Other,Medicaid,,,,Y,59926.91,25078.09
Finger Lakes,Monroe,2701005,000413,Strong Memorial Hospital,50 to 69,145,M,White,Not Span/Hispanic,24,Emergency,Inpatient Rehabilitation Facility,2020,INJ005,"FRACTURE OF THE LOWER LIMB (EXCEPT HIP), INITIAL ENCOUNTER",ESA004,NON-INVASIVE VENTILATION,912,MUSCULOSKELETAL & OTHER PROCEDURES FOR MULTIPLE SIGNIFICANT TRAUMA,25,HUMAN IMMUNODEFICIENCY VIRUS INFECTIONS,4,Extreme,Extreme,Surgical,Medicare,Medicaid,,,,Y,174549.99,70017.09
Finger Lakes,Monroe,2701005,000413,Strong Memorial Hospital,70 or Older,146,F,White,Not Span/Hispanic,8,Emergency,Home w/ Home Health Services,2020,INJ004,"FRACTURE OF THE UPPER LIMB, INITIAL ENCOUNTER",MST009,FIXATION OF UPPER EXTREMITY BONES,912,MUSCULOSKELETAL & OTHER PROCEDURES FOR MULTIPLE SIGNIFICANT TRAUMA,25,HUMAN IMMUNODEFICIENCY VIRUS INFECTIONS,3,Major,Major,Surgical,Medicare,,,,,Y,55583.42,24329.34
Capital/Adirond,Albany,0101000,000001,Albany Medical Center Hospital,50 to 69,OOS,F,Other Race,Unknown,20,Trauma,Home or Self Care,2020,INJ003,"FRACTURE OF TORSO, INITIAL ENCOUNTER",MST012,BONE FIXATION (EXCLUDING EXTREMITIES),912,MUSCULOSKELETAL & OTHER PROCEDURES FOR MULTIPLE SIGNIFICANT TRAUMA,25,HUMAN IMMUNODEFICIENCY VIRUS INFECTIONS,3,Major,Major,Surgical,Miscellaneous/Other,Medicaid,,,,Y,138111.36,46565.38
Capital/Adirond,Albany,0101000,000001,Albany Medical Center Hospital,50 to 69,129,M,White,Not Span/Hispanic,15,Trauma,Home or Self Care,2020,INJ003,"FRACTURE OF TORSO, INITIAL ENCOUNTER",MST012,BONE FIXATION (EXCLUDING EXTREMITIES),912,MUSCULOSKELETAL & OTHER PROCEDURES FOR MULTIPLE SIGNIFICANT TRAUMA,25,HUMAN IMMUNODEFICIENCY VIRUS INFECTIONS,3,Major,Minor,Surgical,Miscellaneous/Other,Private Health Insurance,,,,Y,109096.01,31653.82
Capital/Adirond,Albany,0101000,000001,Albany Medical Center Hospital,18 to 29,123,M,White,Not Span/Hispanic,6,Trauma,Home or Self Care,2020,INJ005,"FRACTURE OF THE LOWER LIMB (EXCEPT HIP), INITIAL ENCOUNTER",MST010,FEMUR FIXATION,912,MUSCULOSKELETAL & OTHER PROCEDURES FOR MULTIPLE SIGNIFICANT TRAUMA,25,HUMAN IMMUNODEFICIENCY VIRUS INFECTIONS,2,Moderate,Minor,Surgical,Blue Cross/Blue Shield,,,,,Y,79643.6,22404.23
Capital/Adirond,Albany,0101000,000001,Albany Medical Center Hospital,50 to 69,120,F,White,Not Span/Hispanic,12,Emergency,Inpatient Rehabilitation Facility,2020,INJ007,"DISLOCATIONS, INITIAL ENCOUNTER",MST013,SPINE FUSION,912,MUSCULOSKELETAL & OTHER PROCEDURES FOR MULTIPLE SIGNIFICANT TRAUMA,25,HUMAN IMMUNODEFICIENCY VIRUS INFECTIONS,3,Major,Moderate,Surgical,Medicare,Blue Cross/Blue Shield,,,,Y,147582.57,43566.92
Capital/Adirond,Albany,0101000,000001,Albany Medical Center Hospital,70 or Older,124,M,Other Race,Spanish/Hispanic,16,Trauma,Skilled Nursing Home,2020,INJ010,"INTERNAL ORGAN INJURY, INITIAL ENCOUNTER",GNR005,CONTROL OF BLEEDING (NON-ENDOSCOPIC),912,MUSCULOSKELETAL & OTHER PROCEDURES FOR MULTIPLE SIGNIFICANT TRAUMA,25,HUMAN IMMUNODEFICIENCY VIRUS INFECTIONS,4,Extreme,Extreme,Surgical,Miscellaneous/Other,"Managed Care, Unspecified",,,,Y,202051.64,61663.08
Finger Lakes,Monroe,2754001,000471,The Unity Hospital of Rochester,70 or Older,144,F,White,Not Span/Hispanic,13,Emergency,Hospice - Medical Facility,2020,INJ006,"FRACTURE OF THE NECK OF THE FEMUR (HIP), INITIAL ENCOUNTER",MST010,FEMUR FIXATION,912,MUSCULOSKELETAL & OTHER PROCEDURES FOR MULTIPLE SIGNIFICANT TRAUMA,25,HUMAN IMMUNODEFICIENCY VIRUS INFECTIONS,2,Moderate,Moderate,Surgical,Medicare,,,,,Y,37354.4,23236.47
New York City,Manhattan,7002032,001469,Mount Sinai Morningside,50 to 69,100,M,Other Race,Not Span/Hispanic,22,Emergency,Expired,2020,INJ008,"TRAUMATIC BRAIN INJURY (TBI); CONCUSSION, INITIAL ENCOUNTER",CAR024,VENOUS AND ARTERIAL CATHETER PLACEMENT,912,MUSCULOSKELETAL & OTHER PROCEDURES FOR MULTIPLE SIGNIFICANT TRAUMA,25,HUMAN IMMUNODEFICIENCY VIRUS INFECTIONS,4,Extreme,Extreme,Surgical,Medicaid,Medicaid,Self-Pay,,,Y,388459.23,89139.1
New York City,Kings,7002053,001304,NYU Langone Hospital-Brooklyn,50 to 69,112,M,White,Not Span/Hispanic,15,Emergency,Home w/ Home Health Services,2020,INJ002,"FRACTURE OF THE SPINE AND BACK, INITIAL ENCOUNTER",MST013,SPINE FUSION,912,MUSCULOSKELETAL & OTHER PROCEDURES FOR MULTIPLE SIGNIFICANT TRAUMA,25,HUMAN IMMUNODEFICIENCY VIRUS INFECTIONS,4,Extreme,Major,Surgical,Miscellaneous/Other,Medicaid,,,,Y,632014.51,126928.65
Hudson Valley,Dutchess,5957001,000180,Mid-Hudson Valley Division of Westchester Medical Center,30 to 49,126,M,Other Race,Not Span/Hispanic,7,Emergency,Home w/ Home Health Services,2020,INJ005,"FRACTURE OF THE LOWER LIMB (EXCEPT HIP), INITIAL ENCOUNTER",MST010,FEMUR FIXATION,912,MUSCULOSKELETAL & OTHER PROCEDURES FOR MULTIPLE SIGNIFICANT TRAUMA,25,HUMAN IMMUNODEFICIENCY VIRUS INFECTIONS,2,Moderate,Minor,Surgical,Miscellaneous/Other,Medicare,,,,Y,194642.45,33640.69
Hudson Valley,Dutchess,5957001,000180,Mid-Hudson Valley Division of Westchester Medical Center,50 to 69,125,M,White,Not Span/Hispanic,7,Emergency,Home or Self Care,2020,INJ002,"FRACTURE OF THE SPINE AND BACK, INITIAL ENCOUNTER",MST012,BONE FIXATION (EXCLUDING EXTREMITIES),912,MUSCULOSKELETAL & OTHER PROCEDURES FOR MULTIPLE SIGNIFICANT TRAUMA,25,HUMAN IMMUNODEFICIENCY VIRUS INFECTIONS,3,Major,Minor,Surgical,Miscellaneous/Other,,,,,Y,293433.79,48922.11
Western NY,Erie,1401014,003067,Millard Fillmore Suburban Hospital,70 or Older,140,F,White,Not Span/Hispanic,8,Emergency,Skilled Nursing Home,2020,INJ006,"FRACTURE OF THE NECK OF THE FEMUR (HIP), INITIAL ENCOUNTER",MST010,FEMUR FIXATION,912,MUSCULOSKELETAL & OTHER PROCEDURES FOR MULTIPLE SIGNIFICANT TRAUMA,25,HUMAN IMMUNODEFICIENCY VIRUS INFECTIONS,2,Moderate,Moderate,Surgical,Medicare,Self-Pay,,,,Y,39860.42,16778.52
New York City,Queens,7003010,001637,New York - Presbyterian/Queens,70 or Older,113,F,Other Race,Not Span/Hispanic,5,Emergency,Skilled Nursing Home,2020,INJ006,"FRACTURE OF THE NECK OF THE FEMUR (HIP), INITIAL ENCOUNTER",MST010,FEMUR FIXATION,912,MUSCULOSKELETAL & OTHER PROCEDURES FOR MULTIPLE SIGNIFICANT TRAUMA,25,HUMAN IMMUNODEFICIENCY VIRUS INFECTIONS,2,Moderate,Moderate,Surgical,Medicare,Medicaid,Self-Pay,,,Y,64917.06,17548.23