Hospital Service Area,Hospital County,Operating Certificate Number,Permanent Facility Id,Facility Name,Age Group,Zip Code - 3 digits,Gender,Race,Ethnicity,Length of Stay,Type of Admission,Patient Disposition,Discharge Year,CCS Diagnosis Code,CCS Diagnosis Description,CCS Procedure Code,CCS Procedure Description,APR DRG Code,APR DRG Description,APR MDC Code,APR MDC Description,APR Severity of Illness Code,APR Severity of Illness Description,APR Risk of Mortality,APR Medical Surgical Description,Payment Typology 1,Payment Typology 2,Payment Typology 3,Birth Weight,Abortion Edit Indicator,Emergency Department Indicator,Total Charges,Total Costs
Long Island,Suffolk,5123000,000885,Long Island Community Hospital,70 or Older,117,F,White,Not Span/Hispanic,6,Emergency,Home w/ Home Health Services,2020,INJ008,"TRAUMATIC BRAIN INJURY (TBI); CONCUSSION, INITIAL ENCOUNTER",MST010,FEMUR FIXATION,912,MUSCULOSKELETAL & OTHER PROCEDURES FOR MULTIPLE SIGNIFICANT TRAUMA,25,HUMAN IMMUNODEFICIENCY VIRUS INFECTIONS,3,Major,Minor,Surgical,Medicare,Medicare,Private Health Insurance,,,Y,160132.3,22495.2
Long Island,Suffolk,5123000,000885,Long Island Community Hospital,70 or Older,119,F,White,Not Span/Hispanic,6,Emergency,Skilled Nursing Home,2020,INJ006,"FRACTURE OF THE NECK OF THE FEMUR (HIP), INITIAL ENCOUNTER",MST010,FEMUR FIXATION,912,MUSCULOSKELETAL & OTHER PROCEDURES FOR MULTIPLE SIGNIFICANT TRAUMA,25,HUMAN IMMUNODEFICIENCY VIRUS INFECTIONS,3,Major,Moderate,Surgical,Medicare,Medicare,Blue Cross/Blue Shield,,,Y,148207.54,21484
Long Island,Suffolk,5123000,000885,Long Island Community Hospital,50 to 69,117,F,White,Not Span/Hispanic,7,Emergency,Home or Self Care,2020,INJ006,"FRACTURE OF THE NECK OF THE FEMUR (HIP), INITIAL ENCOUNTER",MST010,FEMUR FIXATION,912,MUSCULOSKELETAL & OTHER PROCEDURES FOR MULTIPLE SIGNIFICANT TRAUMA,25,HUMAN IMMUNODEFICIENCY VIRUS INFECTIONS,2,Moderate,Minor,Surgical,Medicare,Medicare,,,,Y,151492.05,23250.67
Long Island,Suffolk,5123000,000885,Long Island Community Hospital,70 or Older,117,F,Other Race,Not Span/Hispanic,2,Emergency,Skilled Nursing Home,2020,INJ006,"FRACTURE OF THE NECK OF THE FEMUR (HIP), INITIAL ENCOUNTER",MST010,FEMUR FIXATION,912,MUSCULOSKELETAL & OTHER PROCEDURES FOR MULTIPLE SIGNIFICANT TRAUMA,25,HUMAN IMMUNODEFICIENCY VIRUS INFECTIONS,3,Major,Minor,Surgical,Medicare,Medicare,Blue Cross/Blue Shield,,,Y,84463.54,9998.42
Long Island,Suffolk,5123000,000885,Long Island Community Hospital,70 or Older,117,F,White,Not Span/Hispanic,3,Emergency,Expired,2020,INJ003,"FRACTURE OF TORSO, INITIAL ENCOUNTER",CAR010,LIGATION AND EMBOLIZATION OF VESSELS,912,MUSCULOSKELETAL & OTHER PROCEDURES FOR MULTIPLE SIGNIFICANT TRAUMA,25,HUMAN IMMUNODEFICIENCY VIRUS INFECTIONS,4,Extreme,Extreme,Surgical,Medicare,Medicare,Blue Cross/Blue Shield,,,Y,136975.77,16146.72
Long Island,Suffolk,5123000,000885,Long Island Community Hospital,70 or Older,117,F,White,Not Span/Hispanic,8,Emergency,Skilled Nursing Home,2020,INJ006,"FRACTURE OF THE NECK OF THE FEMUR (HIP), INITIAL ENCOUNTER",MST010,FEMUR FIXATION,912,MUSCULOSKELETAL & OTHER PROCEDURES FOR MULTIPLE SIGNIFICANT TRAUMA,25,HUMAN IMMUNODEFICIENCY VIRUS INFECTIONS,4,Extreme,Extreme,Surgical,Medicare,,,,,Y,160312.33,26266.77
Long Island,Suffolk,5123000,000885,Long Island Community Hospital,70 or Older,117,F,White,Not Span/Hispanic,11,Emergency,Skilled Nursing Home,2020,INJ004,"FRACTURE OF THE UPPER LIMB, INITIAL ENCOUNTER",ADM001,TRANSFUSION OF BLOOD AND BLOOD PRODUCTS,912,MUSCULOSKELETAL & OTHER PROCEDURES FOR MULTIPLE SIGNIFICANT TRAUMA,25,HUMAN IMMUNODEFICIENCY VIRUS INFECTIONS,3,Major,Moderate,Surgical,Private Health Insurance,Private Health Insurance,Medicare,,,Y,220060.01,32537.43
Long Island,Suffolk,5123000,000885,Long Island Community Hospital,70 or Older,119,F,White,Not Span/Hispanic,4,Emergency,Skilled Nursing Home,2020,INJ006,"FRACTURE OF THE NECK OF THE FEMUR (HIP), INITIAL ENCOUNTER",MST010,FEMUR FIXATION,912,MUSCULOSKELETAL & OTHER PROCEDURES FOR MULTIPLE SIGNIFICANT TRAUMA,25,HUMAN IMMUNODEFICIENCY VIRUS INFECTIONS,2,Moderate,Moderate,Surgical,Medicare,Medicare,Blue Cross/Blue Shield,,,Y,108775.5,15933.17
Long Island,Suffolk,5123000,000885,Long Island Community Hospital,30 to 49,119,M,White,Not Span/Hispanic,6,Emergency,Skilled Nursing Home,2020,INJ005,"FRACTURE OF THE LOWER LIMB (EXCEPT HIP), INITIAL ENCOUNTER",MST011,FIXATION OF LEG AND FOOT BONES,912,MUSCULOSKELETAL & OTHER PROCEDURES FOR MULTIPLE SIGNIFICANT TRAUMA,25,HUMAN IMMUNODEFICIENCY VIRUS INFECTIONS,3,Major,Minor,Surgical,Medicare,Medicare,Medicaid,,,Y,168138.62,24803.4
Long Island,Suffolk,5123000,000885,Long Island Community Hospital,70 or Older,117,F,White,Not Span/Hispanic,6,Emergency,Skilled Nursing Home,2020,INJ006,"FRACTURE OF THE NECK OF THE FEMUR (HIP), INITIAL ENCOUNTER",MST007,HIP ARTHROPLASTY,912,MUSCULOSKELETAL & OTHER PROCEDURES FOR MULTIPLE SIGNIFICANT TRAUMA,25,HUMAN IMMUNODEFICIENCY VIRUS INFECTIONS,2,Moderate,Moderate,Surgical,Medicare,Medicare,Private Health Insurance,,,Y,110525.46,17384.39
