Hospital Service Area,Hospital County,Operating Certificate Number,Permanent Facility Id,Facility Name,Age Group,Zip Code - 3 digits,Gender,Race,Ethnicity,Length of Stay,Type of Admission,Patient Disposition,Discharge Year,CCS Diagnosis Code,CCS Diagnosis Description,CCS Procedure Code,CCS Procedure Description,APR DRG Code,APR DRG Description,APR MDC Code,APR MDC Description,APR Severity of Illness Code,APR Severity of Illness Description,APR Risk of Mortality,APR Medical Surgical Description,Payment Typology 1,Payment Typology 2,Payment Typology 3,Birth Weight,Abortion Edit Indicator,Emergency Department Indicator,Total Charges,Total Costs
New York City,Manhattan,7002001,001438,Bellevue Hospital Center,70 or Older,113,M,White,Not Span/Hispanic,16,Emergency,Expired,2019,INJ008,"TRAUMATIC BRAIN INJURY (TBI); CONCUSSION, INITIAL ENCOUNTER",IMG007,COMPUTERIZED TOMOGRAPHY (CT) WITHOUT CONTRAST,930,MULTIPLE SIGNIFICANT TRAUMA W/O O.R. PROCEDURE,25,HUMAN IMMUNODEFICIENCY VIRUS INFECTIONS,4,Extreme,Extreme,Medical,Medicare,Medicare,,,,true,144495.09,96031.44
New York City,Manhattan,7002001,001438,Bellevue Hospital Center,18 to 29,104,M,Other Race,Not Span/Hispanic,1,Emergency,Home or Self Care,2019,INJ008,"TRAUMATIC BRAIN INJURY (TBI); CONCUSSION, INITIAL ENCOUNTER",SKB006,SKIN LACERATION REPAIR (EXCLUDING PERINEUM),930,MULTIPLE SIGNIFICANT TRAUMA W/O O.R. PROCEDURE,25,HUMAN IMMUNODEFICIENCY VIRUS INFECTIONS,3,Major,Minor,Medical,Self-Pay,,,,,true,24226.6,16101
Long Island,Suffolk,5151001,000245,Stony Brook University Hospital,18 to 29,117,M,White,Unknown,4,Emergency,Home or Self Care,2019,INJ010,"INTERNAL ORGAN INJURY, INITIAL ENCOUNTER",,,930,MULTIPLE SIGNIFICANT TRAUMA W/O O.R. PROCEDURE,25,HUMAN IMMUNODEFICIENCY VIRUS INFECTIONS,3,Major,Minor,Medical,Medicaid,Medicaid,,,,true,71454.19,18059.66
Western NY,Erie,1401005,000210,Erie County Medical Center,50 to 69,142,F,White,Not Span/Hispanic,7,Emergency,Skilled Nursing Home,2019,INJ002,"FRACTURE OF THE SPINE AND BACK, INITIAL ENCOUNTER",,,930,MULTIPLE SIGNIFICANT TRAUMA W/O O.R. PROCEDURE,25,HUMAN IMMUNODEFICIENCY VIRUS INFECTIONS,3,Major,Major,Medical,Medicare,Medicaid,Medicare,,,true,25067.34,11955.83
New York City,Kings,7002053,001304,NYU Langone Hospital-Brooklyn,30 to 49,103,M,Other Race,Not Span/Hispanic,5,Emergency,Home or Self Care,2019,INJ010,"INTERNAL ORGAN INJURY, INITIAL ENCOUNTER",,,930,MULTIPLE SIGNIFICANT TRAUMA W/O O.R. PROCEDURE,25,HUMAN IMMUNODEFICIENCY VIRUS INFECTIONS,3,Major,Major,Medical,Miscellaneous/Other,,,,,true,104039.99,33000.37
Southern Tier,Broome,0303001,000058,United Health Services Hospitals Inc. - Wilson Medical Center,50 to 69,138,M,Other Race,Not Span/Hispanic,6,Emergency,Skilled Nursing Home,2019,INJ002,"FRACTURE OF THE SPINE AND BACK, INITIAL ENCOUNTER",IMG005,MAGNETIC RESONANCE IMAGING (MRI),930,MULTIPLE SIGNIFICANT TRAUMA W/O O.R. PROCEDURE,25,HUMAN IMMUNODEFICIENCY VIRUS INFECTIONS,4,Extreme,Major,Medical,Medicare,Medicare,,,,true,33722.1,13377.37
Southern Tier,Broome,0303001,000058,United Health Services Hospitals Inc. - Wilson Medical Center,50 to 69,138,M,White,Not Span/Hispanic,9,Emergency,Expired,2019,INJ008,"TRAUMATIC BRAIN INJURY (TBI); CONCUSSION, INITIAL ENCOUNTER",ESA005,CARDIAC CHEST COMPRESSION,930,MULTIPLE SIGNIFICANT TRAUMA W/O O.R. PROCEDURE,25,HUMAN IMMUNODEFICIENCY VIRUS INFECTIONS,4,Extreme,Extreme,Medical,Medicare,Medicare,,,,true,69188.5,18710.48
Hudson Valley,Dutchess,5957001,000180,Mid-Hudson Valley Division of Westchester Medical Center,18 to 29,125,M,White,Not Span/Hispanic,3,Emergency,Home w/ Home Health Services,2019,INJ008,"TRAUMATIC BRAIN INJURY (TBI); CONCUSSION, INITIAL ENCOUNTER",PLC001,IMMOBILIZATION BY SPLINT OR OTHER EXTERNAL DEVICE,930,MULTIPLE SIGNIFICANT TRAUMA W/O O.R. PROCEDURE,25,HUMAN IMMUNODEFICIENCY VIRUS INFECTIONS,2,Moderate,Minor,Medical,Miscellaneous/Other,Medicaid,,,,true,109128.64,17207.56
New York City,Bronx,7000002,001165,Jacobi Medical Center,30 to 49,,M,Other Race,Not Span/Hispanic,10,Emergency,Skilled Nursing Home,2019,INJ002,"FRACTURE OF THE SPINE AND BACK, INITIAL ENCOUNTER",PLC001,IMMOBILIZATION BY SPLINT OR OTHER EXTERNAL DEVICE,930,MULTIPLE SIGNIFICANT TRAUMA W/O O.R. PROCEDURE,25,HUMAN IMMUNODEFICIENCY VIRUS INFECTIONS,3,Major,Moderate,Medical,Miscellaneous/Other,Blue Cross/Blue Shield,,,,false,64950.51,38427.97
Capital/Adirond,Albany,0101000,000001,Albany Medical Center Hospital,70 or Older,125,M,White,Not Span/Hispanic,4,Emergency,Skilled Nursing Home,2019,INJ008,"TRAUMATIC BRAIN INJURY (TBI); CONCUSSION, INITIAL ENCOUNTER",,,930,MULTIPLE SIGNIFICANT TRAUMA W/O O.R. PROCEDURE,25,HUMAN IMMUNODEFICIENCY VIRUS INFECTIONS,2,Moderate,Moderate,Medical,Medicare,Private Health Insurance,,,,true,22306.37,6751.42
Western NY,Erie,1401005,000210,Erie County Medical Center,70 or Older,140,F,White,Not Span/Hispanic,6,Emergency,Home w/ Home Health Services,2019,INJ008,"TRAUMATIC BRAIN INJURY (TBI); CONCUSSION, INITIAL ENCOUNTER",,,930,MULTIPLE SIGNIFICANT TRAUMA W/O O.R. PROCEDURE,25,HUMAN IMMUNODEFICIENCY VIRUS INFECTIONS,3,Major,Major,Medical,Medicare,Medicare,,,,true,37832.77,16734.16
Western NY,Erie,1401005,000210,Erie County Medical Center,70 or Older,142,M,White,Not Span/Hispanic,7,Emergency,Inpatient Rehabilitation Facility,2019,INJ008,"TRAUMATIC BRAIN INJURY (TBI); CONCUSSION, INITIAL ENCOUNTER",SKB006,SKIN LACERATION REPAIR (EXCLUDING PERINEUM),930,MULTIPLE SIGNIFICANT TRAUMA W/O O.R. PROCEDURE,25,HUMAN IMMUNODEFICIENCY VIRUS INFECTIONS,3,Major,Minor,Medical,Medicare,,,,,true,41410.19,23119.89
Western NY,Erie,1401005,000210,Erie County Medical Center,18 to 29,141,M,White,Not Span/Hispanic,2,Emergency,Home or Self Care,2019,INJ001,"FRACTURE OF HEAD AND NECK, INITIAL ENCOUNTER",MST012,BONE FIXATION (EXCLUDING EXTREMITIES),930,MULTIPLE SIGNIFICANT TRAUMA W/O O.R. PROCEDURE,25,HUMAN IMMUNODEFICIENCY VIRUS INFECTIONS,3,Major,Moderate,Medical,Private Health Insurance,,,,,true,29154.63,9636.27
New York City,Kings,7002053,001304,NYU Langone Hospital-Brooklyn,70 or Older,112,F,White,Not Span/Hispanic,4,Emergency,Inpatient Rehabilitation Facility,2019,INJ010,"INTERNAL ORGAN INJURY, INITIAL ENCOUNTER",URN003,URETER AND OTHER URINARY TRACT DILATION,930,MULTIPLE SIGNIFICANT TRAUMA W/O O.R. PROCEDURE,25,HUMAN IMMUNODEFICIENCY VIRUS INFECTIONS,3,Major,Moderate,Medical,Medicare,Medicare,,,,true,121108.69,28897.02
New York City,Manhattan,7002054,003975,New York Presbyterian Hospital - Allen Hospital,70 or Older,100,F,White,Not Span/Hispanic,7,Emergency,Medicare Cert Long Term Care Hospital,2019,INJ006,"FRACTURE OF THE NECK OF THE FEMUR (HIP), INITIAL ENCOUNTER",ADM001,TRANSFUSION OF BLOOD AND BLOOD PRODUCTS,930,MULTIPLE SIGNIFICANT TRAUMA W/O O.R. PROCEDURE,25,HUMAN IMMUNODEFICIENCY VIRUS INFECTIONS,4,Extreme,Extreme,Medical,Medicare,Self-Pay,,,,true,100910.43,22701.07
Finger Lakes,Monroe,2701001,000409,Highland Hospital,70 or Older,144,M,White,Not Span/Hispanic,5,Emergency,Skilled Nursing Home,2019,INJ003,"FRACTURE OF TORSO, INITIAL ENCOUNTER",,,930,MULTIPLE SIGNIFICANT TRAUMA W/O O.R. PROCEDURE,25,HUMAN IMMUNODEFICIENCY VIRUS INFECTIONS,2,Moderate,Moderate,Medical,Self-Pay,,,,,true,13425.21,4552.22
New York City,Manhattan,7002054,001464,New York-Presbyterian Hospital - Columbia Presbyterian Center,0 to 17,104,M,Black/African American,Spanish/Hispanic,4,Emergency,Home or Self Care,2019,INJ010,"INTERNAL ORGAN INJURY, INITIAL ENCOUNTER",,,930,MULTIPLE SIGNIFICANT TRAUMA W/O O.R. PROCEDURE,25,HUMAN IMMUNODEFICIENCY VIRUS INFECTIONS,3,Major,Moderate,Medical,Private Health Insurance,Self-Pay,,,,true,98151.4,40000.97
New York City,Kings,7001002,001286,Brookdale Hospital Medical Center,70 or Older,112,M,Other Race,Spanish/Hispanic,6,Emergency,Short-term Hospital,2019,INJ006,"FRACTURE OF THE NECK OF THE FEMUR (HIP), INITIAL ENCOUNTER",MAM005,MEASUREMENT DURING CARDIAC CATHETERIZATION,930,MULTIPLE SIGNIFICANT TRAUMA W/O O.R. PROCEDURE,25,HUMAN IMMUNODEFICIENCY VIRUS INFECTIONS,3,Major,Major,Medical,Medicare,Medicaid,,,,true,38009.79,19241.96
Hudson Valley,Westchester,5957001,001139,Westchester Medical Center,18 to 29,126,M,White,Not Span/Hispanic,7,Urgent,Expired,2019,INJ008,"TRAUMATIC BRAIN INJURY (TBI); CONCUSSION, INITIAL ENCOUNTER",ESA003,MECHANICAL VENTILATION,930,MULTIPLE SIGNIFICANT TRAUMA W/O O.R. PROCEDURE,25,HUMAN IMMUNODEFICIENCY VIRUS INFECTIONS,4,Extreme,Extreme,Medical,Medicaid,Self-Pay,,,,false,338083.15,61195.95
Hudson Valley,Westchester,5957001,001139,Westchester Medical Center,50 to 69,124,M,White,Not Span/Hispanic,4,Emergency,Skilled Nursing Home,2019,INJ003,"FRACTURE OF TORSO, INITIAL ENCOUNTER",,,930,MULTIPLE SIGNIFICANT TRAUMA W/O O.R. PROCEDURE,25,HUMAN IMMUNODEFICIENCY VIRUS INFECTIONS,2,Moderate,Moderate,Medical,Medicare,Medicaid,,,,true,84483.31,13355.18
Hudson Valley,Dutchess,5957001,000180,Mid-Hudson Valley Division of Westchester Medical Center,30 to 49,125,M,White,Not Span/Hispanic,1,Emergency,Home or Self Care,2019,INJ008,"TRAUMATIC BRAIN INJURY (TBI); CONCUSSION, INITIAL ENCOUNTER",,,930,MULTIPLE SIGNIFICANT TRAUMA W/O O.R. PROCEDURE,25,HUMAN IMMUNODEFICIENCY VIRUS INFECTIONS,2,Moderate,Moderate,Medical,Miscellaneous/Other,Private Health Insurance,,,,true,69272.26,9053.58
Hudson Valley,Westchester,5957001,001139,Westchester Medical Center,50 to 69,107,M,Other Race,Spanish/Hispanic,13,Emergency,Home or Self Care,2019,INJ001,"FRACTURE OF HEAD AND NECK, INITIAL ENCOUNTER",ESA003,MECHANICAL VENTILATION,930,MULTIPLE SIGNIFICANT TRAUMA W/O O.R. PROCEDURE,25,HUMAN IMMUNODEFICIENCY VIRUS INFECTIONS,3,Major,Major,Medical,Medicaid,Medicaid,,,,true,444256.21,70797.94
New York City,Manhattan,7002054,001464,New York-Presbyterian Hospital - Columbia Presbyterian Center,0 to 17,104,M,Multi-racial,Not Span/Hispanic,10,Emergency,Inpatient Rehabilitation Facility,2019,INJ003,"FRACTURE OF TORSO, INITIAL ENCOUNTER",URN006,BLADDER CATHETERIZATION AND DRAINAGE,930,MULTIPLE SIGNIFICANT TRAUMA W/O O.R. PROCEDURE,25,HUMAN IMMUNODEFICIENCY VIRUS INFECTIONS,2,Moderate,Minor,Medical,Medicaid,Medicaid,Self-Pay,,,true,156053.66,43539.22
New York City,Manhattan,7002032,001469,Mount Sinai Morningside,30 to 49,100,M,Black/African American,Not Span/Hispanic,2,Emergency,Home or Self Care,2019,INJ010,"INTERNAL ORGAN INJURY, INITIAL ENCOUNTER",IMG007,COMPUTERIZED TOMOGRAPHY (CT) WITHOUT CONTRAST,930,MULTIPLE SIGNIFICANT TRAUMA W/O O.R. PROCEDURE,25,HUMAN IMMUNODEFICIENCY VIRUS INFECTIONS,1,Minor,Minor,Medical,Private Health Insurance,Medicaid,Self-Pay,,,true,35203.88,9327.89
Long Island,Suffolk,5153000,000913,Huntington Hospital,70 or Older,117,M,White,Not Span/Hispanic,3,Emergency,Skilled Nursing Home,2019,INJ002,"FRACTURE OF THE SPINE AND BACK, INITIAL ENCOUNTER",MAM011,ELECTROENCEPHALOGRAM (EEG),930,MULTIPLE SIGNIFICANT TRAUMA W/O O.R. PROCEDURE,25,HUMAN IMMUNODEFICIENCY VIRUS INFECTIONS,3,Major,Major,Medical,Medicare,,,,,true,38705.32,9672.75
New York City,Richmond,7004003,001740,Staten Island University Hosp-North,70 or Older,103,F,White,Not Span/Hispanic,4,Emergency,Skilled Nursing Home,2019,INJ003,"FRACTURE OF TORSO, INITIAL ENCOUNTER",,,930,MULTIPLE SIGNIFICANT TRAUMA W/O O.R. PROCEDURE,25,HUMAN IMMUNODEFICIENCY VIRUS INFECTIONS,3,Major,Major,Medical,Medicare,Private Health Insurance,,,,true,45244.78,10612.23
Long Island,Nassau,2952006,000551,St. Joseph Hospital,70 or Older,117,F,Other Race,Not Span/Hispanic,2,Emergency,Home or Self Care,2019,INJ008,"TRAUMATIC BRAIN INJURY (TBI); CONCUSSION, INITIAL ENCOUNTER",,,930,MULTIPLE SIGNIFICANT TRAUMA W/O O.R. PROCEDURE,25,HUMAN IMMUNODEFICIENCY VIRUS INFECTIONS,2,Moderate,Minor,Medical,Medicare,Blue Cross/Blue Shield,,,,true,27860.68,4135.79
Long Island,Nassau,2953000,000563,St. Francis Hospital & Heart Center,30 to 49,114,M,Black/African American,Not Span/Hispanic,3,Urgent,Home or Self Care,2019,INJ009,"SPINAL CORD INJURY (SCI), INITIAL ENCOUNTER",IMG005,MAGNETIC RESONANCE IMAGING (MRI),930,MULTIPLE SIGNIFICANT TRAUMA W/O O.R. PROCEDURE,25,HUMAN IMMUNODEFICIENCY VIRUS INFECTIONS,3,Major,Moderate,Medical,Blue Cross/Blue Shield,,,,,false,51632,9626.39
Finger Lakes,Monroe,2701005,000413,Strong Memorial Hospital,18 to 29,144,M,White,Not Span/Hispanic,5,Emergency,Home or Self Care,2019,INJ010,"INTERNAL ORGAN INJURY, INITIAL ENCOUNTER",RES005,CHEST TUBE PLACEMENT AND THERAPEUTIC THORACENTESIS,930,MULTIPLE SIGNIFICANT TRAUMA W/O O.R. PROCEDURE,25,HUMAN IMMUNODEFICIENCY VIRUS INFECTIONS,1,Minor,Minor,Medical,Miscellaneous/Other,Medicaid,,,,true,20335.28,7638.76
Long Island,Suffolk,5154000,000924,South Shore University Hospital,70 or Older,117,M,White,Not Span/Hispanic,10,Emergency,Expired,2019,INJ003,"FRACTURE OF TORSO, INITIAL ENCOUNTER",ADM001,TRANSFUSION OF BLOOD AND BLOOD PRODUCTS,930,MULTIPLE SIGNIFICANT TRAUMA W/O O.R. PROCEDURE,25,HUMAN IMMUNODEFICIENCY VIRUS INFECTIONS,4,Extreme,Major,Medical,Medicare,Medicare,,,,true,106701.36,24361.14
Capital/Adirond,Albany,0101000,000001,Albany Medical Center Hospital,70 or Older,121,F,White,Not Span/Hispanic,4,Trauma,Home w/ Home Health Services,2019,INJ002,"FRACTURE OF THE SPINE AND BACK, INITIAL ENCOUNTER",,,930,MULTIPLE SIGNIFICANT TRAUMA W/O O.R. PROCEDURE,25,HUMAN IMMUNODEFICIENCY VIRUS INFECTIONS,3,Major,Major,Medical,Miscellaneous/Other,Blue Cross/Blue Shield,,,,true,68928.64,12239.26
New York City,Bronx,7000002,001165,Jacobi Medical Center,70 or Older,104,F,White,Not Span/Hispanic,6,Emergency,Skilled Nursing Home,2019,INJ002,"FRACTURE OF THE SPINE AND BACK, INITIAL ENCOUNTER",PLC001,IMMOBILIZATION BY SPLINT OR OTHER EXTERNAL DEVICE,930,MULTIPLE SIGNIFICANT TRAUMA W/O O.R. PROCEDURE,25,HUMAN IMMUNODEFICIENCY VIRUS INFECTIONS,3,Major,Moderate,Medical,Medicare,Medicare,,,,true,45641.75,27003.94
Southern Tier,Broome,0303001,000058,United Health Services Hospitals Inc. - Wilson Medical Center,70 or Older,138,M,White,Not Span/Hispanic,1,Emergency,Home or Self Care,2019,INJ008,"TRAUMATIC BRAIN INJURY (TBI); CONCUSSION, INITIAL ENCOUNTER",,,930,MULTIPLE SIGNIFICANT TRAUMA W/O O.R. PROCEDURE,25,HUMAN IMMUNODEFICIENCY VIRUS INFECTIONS,2,Moderate,Minor,Medical,Medicare,Medicare,Blue Cross/Blue Shield,,,true,15094.6,2267.8
Hudson Valley,Westchester,5957001,001139,Westchester Medical Center,0 to 17,126,M,Black/African American,Not Span/Hispanic,9,Emergency,Home or Self Care,2019,INJ008,"TRAUMATIC BRAIN INJURY (TBI); CONCUSSION, INITIAL ENCOUNTER",,,930,MULTIPLE SIGNIFICANT TRAUMA W/O O.R. PROCEDURE,25,HUMAN IMMUNODEFICIENCY VIRUS INFECTIONS,2,Moderate,Minor,Medical,Medicaid,Medicaid,,,,true,250665.72,44665.99
Capital/Adirond,Albany,0101000,000001,Albany Medical Center Hospital,30 to 49,122,F,Black/African American,Not Span/Hispanic,3,Trauma,Home or Self Care,2019,INJ010,"INTERNAL ORGAN INJURY, INITIAL ENCOUNTER",,,930,MULTIPLE SIGNIFICANT TRAUMA W/O O.R. PROCEDURE,25,HUMAN IMMUNODEFICIENCY VIRUS INFECTIONS,2,Moderate,Minor,Medical,"Managed Care, Unspecified",,,,,true,33121.99,6822.21
New York City,Bronx,7000002,001165,Jacobi Medical Center,50 to 69,104,M,Other Race,Not Span/Hispanic,6,Emergency,Home or Self Care,2019,INJ010,"INTERNAL ORGAN INJURY, INITIAL ENCOUNTER",,,930,MULTIPLE SIGNIFICANT TRAUMA W/O O.R. PROCEDURE,25,HUMAN IMMUNODEFICIENCY VIRUS INFECTIONS,2,Moderate,Minor,Medical,Medicare,Medicare,Medicaid,,,true,34661.58,20507.52
New York City,Bronx,7000002,001165,Jacobi Medical Center,18 to 29,108,M,Other Race,Spanish/Hispanic,1,Emergency,Home or Self Care,2019,INJ001,"FRACTURE OF HEAD AND NECK, INITIAL ENCOUNTER",PLC001,IMMOBILIZATION BY SPLINT OR OTHER EXTERNAL DEVICE,930,MULTIPLE SIGNIFICANT TRAUMA W/O O.R. PROCEDURE,25,HUMAN IMMUNODEFICIENCY VIRUS INFECTIONS,3,Major,Minor,Medical,Miscellaneous/Other,,,,,true,13804.52,8167.44
Long Island,Nassau,2908000,000511,NYU Langone Hospital-Long Island,70 or Older,110,M,White,Not Span/Hispanic,3,Trauma,Skilled Nursing Home,2019,INJ003,"FRACTURE OF TORSO, INITIAL ENCOUNTER",,,930,MULTIPLE SIGNIFICANT TRAUMA W/O O.R. PROCEDURE,25,HUMAN IMMUNODEFICIENCY VIRUS INFECTIONS,2,Moderate,Minor,Medical,Medicare,Medicare,Private Health Insurance,,,true,91915.82,11105.63
Long Island,Nassau,2908000,000511,NYU Langone Hospital-Long Island,70 or Older,110,F,White,Not Span/Hispanic,3,Trauma,Skilled Nursing Home,2019,INJ001,"FRACTURE OF HEAD AND NECK, INITIAL ENCOUNTER",SKB006,SKIN LACERATION REPAIR (EXCLUDING PERINEUM),930,MULTIPLE SIGNIFICANT TRAUMA W/O O.R. PROCEDURE,25,HUMAN IMMUNODEFICIENCY VIRUS INFECTIONS,2,Moderate,Minor,Medical,Private Health Insurance,Medicare,Medicare,,,true,80355.52,11757.86
New York City,Queens,7003010,001637,New York - Presbyterian/Queens,50 to 69,113,M,White,Not Span/Hispanic,5,Emergency,Skilled Nursing Home,2019,INJ008,"TRAUMATIC BRAIN INJURY (TBI); CONCUSSION, INITIAL ENCOUNTER",CAR024,VENOUS AND ARTERIAL CATHETER PLACEMENT,930,MULTIPLE SIGNIFICANT TRAUMA W/O O.R. PROCEDURE,25,HUMAN IMMUNODEFICIENCY VIRUS INFECTIONS,3,Major,Moderate,Medical,"Managed Care, Unspecified",Medicaid,Self-Pay,,,true,45484.36,11474.29
New York City,Queens,7003010,001637,New York - Presbyterian/Queens,18 to 29,113,M,Other Race,Not Span/Hispanic,2,Emergency,Home or Self Care,2019,INJ010,"INTERNAL ORGAN INJURY, INITIAL ENCOUNTER",IMG007,COMPUTERIZED TOMOGRAPHY (CT) WITHOUT CONTRAST,930,MULTIPLE SIGNIFICANT TRAUMA W/O O.R. PROCEDURE,25,HUMAN IMMUNODEFICIENCY VIRUS INFECTIONS,2,Moderate,Minor,Medical,Miscellaneous/Other,Self-Pay,,,,true,27303.3,5113.69
New York City,Bronx,7000006,003058,Montefiore Med Center - Jack D Weiler Hosp of A Einstein College Div,70 or Older,104,F,Black/African American,Not Span/Hispanic,8,Emergency,Expired,2019,INJ006,"FRACTURE OF THE NECK OF THE FEMUR (HIP), INITIAL ENCOUNTER",ADM015,ADMINISTRATION OF ANTIBIOTICS,930,MULTIPLE SIGNIFICANT TRAUMA W/O O.R. PROCEDURE,25,HUMAN IMMUNODEFICIENCY VIRUS INFECTIONS,4,Extreme,Extreme,Medical,Medicare,,,,,true,172432.09,26808.2
New York City,Manhattan,7002021,001454,Metropolitan Hospital Center,70 or Older,111,F,Other Race,Spanish/Hispanic,6,Emergency,Home or Self Care,2019,INJ006,"FRACTURE OF THE NECK OF THE FEMUR (HIP), INITIAL ENCOUNTER",ADM021,"ADMINISTRATION OF THERAPEUTIC SUBSTANCES, NEC",930,MULTIPLE SIGNIFICANT TRAUMA W/O O.R. PROCEDURE,25,HUMAN IMMUNODEFICIENCY VIRUS INFECTIONS,2,Moderate,Moderate,Medical,Self-Pay,,,,,true,33577.66,27129.07
Long Island,Suffolk,5155000,000938,Peconic Bay Medical Center,70 or Older,119,M,White,Not Span/Hispanic,4,Emergency,Skilled Nursing Home,2019,INJ010,"INTERNAL ORGAN INJURY, INITIAL ENCOUNTER",,,930,MULTIPLE SIGNIFICANT TRAUMA W/O O.R. PROCEDURE,25,HUMAN IMMUNODEFICIENCY VIRUS INFECTIONS,3,Major,Major,Medical,Medicare,Private Health Insurance,,,,true,43409.92,7765.25
Central NY,Onondaga,3301007,000635,University Hospital SUNY Health Science Center,0 to 17,135,F,White,Not Span/Hispanic,2,Emergency,Home or Self Care,2019,INJ003,"FRACTURE OF TORSO, INITIAL ENCOUNTER",,,930,MULTIPLE SIGNIFICANT TRAUMA W/O O.R. PROCEDURE,25,HUMAN IMMUNODEFICIENCY VIRUS INFECTIONS,2,Moderate,Minor,Medical,Miscellaneous/Other,,,,,true,16793.08,5048.26
Central NY,Onondaga,3301007,000635,University Hospital SUNY Health Science Center,0 to 17,135,M,White,Not Span/Hispanic,2,Emergency,Home or Self Care,2019,INJ010,"INTERNAL ORGAN INJURY, INITIAL ENCOUNTER",,,930,MULTIPLE SIGNIFICANT TRAUMA W/O O.R. PROCEDURE,25,HUMAN IMMUNODEFICIENCY VIRUS INFECTIONS,2,Moderate,Minor,Medical,Miscellaneous/Other,,,,,true,24732.55,7184.03
Central NY,Onondaga,3301007,000635,University Hospital SUNY Health Science Center,50 to 69,131,M,White,Not Span/Hispanic,1,Trauma,Home or Self Care,2019,INJ003,"FRACTURE OF TORSO, INITIAL ENCOUNTER",,,930,MULTIPLE SIGNIFICANT TRAUMA W/O O.R. PROCEDURE,25,HUMAN IMMUNODEFICIENCY VIRUS INFECTIONS,2,Moderate,Minor,Medical,Private Health Insurance,,,,,true,10569.7,2674.78
Capital/Adirond,Albany,0101000,000001,Albany Medical Center Hospital,18 to 29,121,M,White,Not Span/Hispanic,10,Emergency,Home or Self Care,2019,INJ008,"TRAUMATIC BRAIN INJURY (TBI); CONCUSSION, INITIAL ENCOUNTER",ADM001,TRANSFUSION OF BLOOD AND BLOOD PRODUCTS,930,MULTIPLE SIGNIFICANT TRAUMA W/O O.R. PROCEDURE,25,HUMAN IMMUNODEFICIENCY VIRUS INFECTIONS,4,Extreme,Extreme,Medical,Blue Cross/Blue Shield,,,,,true,93273.26,24612.99
Capital/Adirond,Albany,0101000,000001,Albany Medical Center Hospital,70 or Older,123,F,Other Race,Unknown,14,Trauma,Skilled Nursing Home,2019,INJ010,"INTERNAL ORGAN INJURY, INITIAL ENCOUNTER",RES005,CHEST TUBE PLACEMENT AND THERAPEUTIC THORACENTESIS,930,MULTIPLE SIGNIFICANT TRAUMA W/O O.R. PROCEDURE,25,HUMAN IMMUNODEFICIENCY VIRUS INFECTIONS,2,Moderate,Major,Medical,Medicare,Blue Cross/Blue Shield,,,,true,92268.85,31031.47
Capital/Adirond,Albany,0101000,000001,Albany Medical Center Hospital,50 to 69,OOS,M,White,Not Span/Hispanic,2,Emergency,Home or Self Care,2019,INJ003,"FRACTURE OF TORSO, INITIAL ENCOUNTER",,,930,MULTIPLE SIGNIFICANT TRAUMA W/O O.R. PROCEDURE,25,HUMAN IMMUNODEFICIENCY VIRUS INFECTIONS,1,Minor,Minor,Medical,Blue Cross/Blue Shield,,,,,true,17411.49,3709.95
New York City,Bronx,7000014,001176,SBH Health System,18 to 29,104,M,Black/African American,Not Span/Hispanic,5,Trauma,Expired,2019,INJ008,"TRAUMATIC BRAIN INJURY (TBI); CONCUSSION, INITIAL ENCOUNTER",ESA003,MECHANICAL VENTILATION,930,MULTIPLE SIGNIFICANT TRAUMA W/O O.R. PROCEDURE,25,HUMAN IMMUNODEFICIENCY VIRUS INFECTIONS,4,Extreme,Extreme,Medical,Private Health Insurance,Blue Cross/Blue Shield,Private Health Insurance,,,true,65440.46,17746.17
Southern Tier,Broome,0303001,000058,United Health Services Hospitals Inc. - Wilson Medical Center,70 or Older,OOS,M,White,Not Span/Hispanic,8,Urgent,Expired,2019,INJ009,"SPINAL CORD INJURY (SCI), INITIAL ENCOUNTER",IMG006,COMPUTERIZED TOMOGRAPHY (CT) WITH CONTRAST,930,MULTIPLE SIGNIFICANT TRAUMA W/O O.R. PROCEDURE,25,HUMAN IMMUNODEFICIENCY VIRUS INFECTIONS,4,Extreme,Extreme,Medical,Medicare,Medicare,Private Health Insurance,,,false,32032.9,11471.28
New York City,Manhattan,7002001,001438,Bellevue Hospital Center,50 to 69,100,F,Black/African American,Not Span/Hispanic,17,Emergency,Inpatient Rehabilitation Facility,2019,INJ008,"TRAUMATIC BRAIN INJURY (TBI); CONCUSSION, INITIAL ENCOUNTER",IMG007,COMPUTERIZED TOMOGRAPHY (CT) WITHOUT CONTRAST,930,MULTIPLE SIGNIFICANT TRAUMA W/O O.R. PROCEDURE,25,HUMAN IMMUNODEFICIENCY VIRUS INFECTIONS,3,Major,Major,Medical,Miscellaneous/Other,Medicare,Medicaid,,,true,122384.62,81336.82
Long Island,Nassau,2951001,000541,North Shore University Hospital,70 or Older,110,F,White,Not Span/Hispanic,4,Emergency,Skilled Nursing Home,2019,INJ008,"TRAUMATIC BRAIN INJURY (TBI); CONCUSSION, INITIAL ENCOUNTER",,,930,MULTIPLE SIGNIFICANT TRAUMA W/O O.R. PROCEDURE,25,HUMAN IMMUNODEFICIENCY VIRUS INFECTIONS,2,Moderate,Moderate,Medical,Medicare,Medicaid,,,,true,74138.28,10550.94
Central NY,Onondaga,3301007,000635,University Hospital SUNY Health Science Center,30 to 49,130,M,White,Not Span/Hispanic,2,Trauma,Home or Self Care,2019,INJ010,"INTERNAL ORGAN INJURY, INITIAL ENCOUNTER",ESA004,NON-INVASIVE VENTILATION,930,MULTIPLE SIGNIFICANT TRAUMA W/O O.R. PROCEDURE,25,HUMAN IMMUNODEFICIENCY VIRUS INFECTIONS,3,Major,Moderate,Medical,Private Health Insurance,,,,,true,53829.24,9753.95
Long Island,Nassau,2951001,000541,North Shore University Hospital,70 or Older,115,F,White,Not Span/Hispanic,6,Emergency,Skilled Nursing Home,2019,INJ008,"TRAUMATIC BRAIN INJURY (TBI); CONCUSSION, INITIAL ENCOUNTER",,,930,MULTIPLE SIGNIFICANT TRAUMA W/O O.R. PROCEDURE,25,HUMAN IMMUNODEFICIENCY VIRUS INFECTIONS,3,Major,Major,Medical,Medicare,Medicare,,,,true,63772.72,10568.54
Long Island,Suffolk,5123000,000885,Long Island Community Hospital,50 to 69,117,F,White,Not Span/Hispanic,1,Emergency,Home or Self Care,2019,INJ008,"TRAUMATIC BRAIN INJURY (TBI); CONCUSSION, INITIAL ENCOUNTER",SKB006,SKIN LACERATION REPAIR (EXCLUDING PERINEUM),930,MULTIPLE SIGNIFICANT TRAUMA W/O O.R. PROCEDURE,25,HUMAN IMMUNODEFICIENCY VIRUS INFECTIONS,2,Moderate,Moderate,Medical,Private Health Insurance,Medicaid,,,,true,51199.46,3329.16