Hospital Service Area,Hospital County,Operating Certificate Number,Permanent Facility Id,Facility Name,Age Group,Zip Code - 3 digits,Gender,Race,Ethnicity,Length of Stay,Type of Admission,Patient Disposition,Discharge Year,CCS Diagnosis Code,CCS Diagnosis Description,CCS Procedure Code,CCS Procedure Description,APR DRG Code,APR DRG Description,APR MDC Code,APR MDC Description,APR Severity of Illness Code,APR Severity of Illness Description,APR Risk of Mortality,APR Medical Surgical Description,Payment Typology 1,Payment Typology 2,Payment Typology 3,Birth Weight,Abortion Edit Indicator,Emergency Department Indicator,Total Charges,Total Costs
Long Island,Suffolk,5123000,000885,Long Island Community Hospital,50 to 69,117,F,White,Not Span/Hispanic,1,Emergency,Home or Self Care,2019,INJ008,"TRAUMATIC BRAIN INJURY (TBI); CONCUSSION, INITIAL ENCOUNTER",SKB006,SKIN LACERATION REPAIR (EXCLUDING PERINEUM),930,MULTIPLE SIGNIFICANT TRAUMA W/O O.R. PROCEDURE,25,HUMAN IMMUNODEFICIENCY VIRUS INFECTIONS,2,Moderate,Moderate,Medical,Private Health Insurance,Medicaid,,,,true,51199.46,3329.16
Long Island,Suffolk,5123000,000885,Long Island Community Hospital,70 or Older,117,F,Other Race,Not Span/Hispanic,4,Emergency,Skilled Nursing Home,2019,INJ003,"FRACTURE OF TORSO, INITIAL ENCOUNTER",ADM001,TRANSFUSION OF BLOOD AND BLOOD PRODUCTS,930,MULTIPLE SIGNIFICANT TRAUMA W/O O.R. PROCEDURE,25,HUMAN IMMUNODEFICIENCY VIRUS INFECTIONS,3,Major,Major,Medical,Medicare,Medicaid,,,,true,50240.27,7695.26
Long Island,Suffolk,5123000,000885,Long Island Community Hospital,70 or Older,119,M,White,Not Span/Hispanic,10,Emergency,Skilled Nursing Home,2019,INJ004,"FRACTURE OF THE UPPER LIMB, INITIAL ENCOUNTER",,,930,MULTIPLE SIGNIFICANT TRAUMA W/O O.R. PROCEDURE,25,HUMAN IMMUNODEFICIENCY VIRUS INFECTIONS,3,Major,Moderate,Medical,Medicare,Medicaid,,,,true,100101.91,15731.94
Long Island,Suffolk,5123000,000885,Long Island Community Hospital,30 to 49,119,F,White,Not Span/Hispanic,3,Emergency,Home or Self Care,2019,INJ008,"TRAUMATIC BRAIN INJURY (TBI); CONCUSSION, INITIAL ENCOUNTER",CAR024,VENOUS AND ARTERIAL CATHETER PLACEMENT,930,MULTIPLE SIGNIFICANT TRAUMA W/O O.R. PROCEDURE,25,HUMAN IMMUNODEFICIENCY VIRUS INFECTIONS,2,Moderate,Minor,Medical,Private Health Insurance,Medicaid,,,,true,65042.71,6578.42
Long Island,Suffolk,5123000,000885,Long Island Community Hospital,70 or Older,119,M,Other Race,Not Span/Hispanic,3,Emergency,Skilled Nursing Home,2019,INJ003,"FRACTURE OF TORSO, INITIAL ENCOUNTER",,,930,MULTIPLE SIGNIFICANT TRAUMA W/O O.R. PROCEDURE,25,HUMAN IMMUNODEFICIENCY VIRUS INFECTIONS,2,Moderate,Minor,Medical,Medicare,Medicare,,,,true,58996.23,5561.44
Long Island,Suffolk,5123000,000885,Long Island Community Hospital,70 or Older,117,F,Other Race,Not Span/Hispanic,3,Emergency,Home w/ Home Health Services,2019,INJ010,"INTERNAL ORGAN INJURY, INITIAL ENCOUNTER",IMG004,FLUOROSCOPY OF NON-CIRCULATORY ORGANS,930,MULTIPLE SIGNIFICANT TRAUMA W/O O.R. PROCEDURE,25,HUMAN IMMUNODEFICIENCY VIRUS INFECTIONS,3,Major,Major,Medical,Private Health Insurance,Medicare,,,,true,71067.69,9794.75
Long Island,Suffolk,5123000,000885,Long Island Community Hospital,30 to 49,119,M,White,Not Span/Hispanic,1,Emergency,Short-term Hospital,2019,INJ005,"FRACTURE OF THE LOWER LIMB (EXCEPT HIP), INITIAL ENCOUNTER",PLC001,IMMOBILIZATION BY SPLINT OR OTHER EXTERNAL DEVICE,930,MULTIPLE SIGNIFICANT TRAUMA W/O O.R. PROCEDURE,25,HUMAN IMMUNODEFICIENCY VIRUS INFECTIONS,2,Moderate,Minor,Medical,Medicaid,,,,,true,33652.48,2439.31
Long Island,Suffolk,5123000,000885,Long Island Community Hospital,70 or Older,117,M,Other Race,Not Span/Hispanic,6,Emergency,Skilled Nursing Home,2019,INJ003,"FRACTURE OF TORSO, INITIAL ENCOUNTER",,,930,MULTIPLE SIGNIFICANT TRAUMA W/O O.R. PROCEDURE,25,HUMAN IMMUNODEFICIENCY VIRUS INFECTIONS,3,Major,Major,Medical,Medicare,,,,,true,85522.8,10888.48
Long Island,Suffolk,5123000,000885,Long Island Community Hospital,18 to 29,,F,Other Race,Not Span/Hispanic,4,Emergency,Home or Self Care,2019,INJ003,"FRACTURE OF TORSO, INITIAL ENCOUNTER",PLC001,IMMOBILIZATION BY SPLINT OR OTHER EXTERNAL DEVICE,930,MULTIPLE SIGNIFICANT TRAUMA W/O O.R. PROCEDURE,25,HUMAN IMMUNODEFICIENCY VIRUS INFECTIONS,2,Moderate,Minor,Medical,Private Health Insurance,Private Health Insurance,,,,true,97317.24,12439.9
Long Island,Suffolk,5123000,000885,Long Island Community Hospital,70 or Older,119,M,White,Not Span/Hispanic,8,Emergency,Skilled Nursing Home,2019,INJ008,"TRAUMATIC BRAIN INJURY (TBI); CONCUSSION, INITIAL ENCOUNTER",ESA001,HEMODIALYSIS,930,MULTIPLE SIGNIFICANT TRAUMA W/O O.R. PROCEDURE,25,HUMAN IMMUNODEFICIENCY VIRUS INFECTIONS,3,Major,Moderate,Medical,Medicare,Medicare,Private Health Insurance,,,true,184837.98,26574.52
Long Island,Suffolk,5123000,000885,Long Island Community Hospital,50 to 69,119,M,Black/African American,Not Span/Hispanic,5,Emergency,Skilled Nursing Home,2019,INJ003,"FRACTURE OF TORSO, INITIAL ENCOUNTER",MST015,CLOSED REDUCTION OF BONES AND JOINTS,930,MULTIPLE SIGNIFICANT TRAUMA W/O O.R. PROCEDURE,25,HUMAN IMMUNODEFICIENCY VIRUS INFECTIONS,3,Major,Minor,Medical,Private Health Insurance,Medicaid,,,,true,78806.61,9813.33
Long Island,Suffolk,5123000,000885,Long Island Community Hospital,70 or Older,117,M,White,Not Span/Hispanic,2,Emergency,Home w/ Home Health Services,2019,INJ003,"FRACTURE OF TORSO, INITIAL ENCOUNTER",,,930,MULTIPLE SIGNIFICANT TRAUMA W/O O.R. PROCEDURE,25,HUMAN IMMUNODEFICIENCY VIRUS INFECTIONS,2,Moderate,Moderate,Medical,Medicare,Medicare,,,,true,49570.03,4639.13
Long Island,Suffolk,5123000,000885,Long Island Community Hospital,30 to 49,117,M,Black/African American,Not Span/Hispanic,5,Emergency,Home or Self Care,2019,INJ010,"INTERNAL ORGAN INJURY, INITIAL ENCOUNTER",RES005,CHEST TUBE PLACEMENT AND THERAPEUTIC THORACENTESIS,930,MULTIPLE SIGNIFICANT TRAUMA W/O O.R. PROCEDURE,25,HUMAN IMMUNODEFICIENCY VIRUS INFECTIONS,3,Major,Minor,Medical,Private Health Insurance,Private Health Insurance,,,,true,105295.66,11395.49
Long Island,Suffolk,5123000,000885,Long Island Community Hospital,30 to 49,117,F,White,Not Span/Hispanic,1,Emergency,Home or Self Care,2019,INJ010,"INTERNAL ORGAN INJURY, INITIAL ENCOUNTER",,,930,MULTIPLE SIGNIFICANT TRAUMA W/O O.R. PROCEDURE,25,HUMAN IMMUNODEFICIENCY VIRUS INFECTIONS,2,Moderate,Minor,Medical,Private Health Insurance,,,,,true,35050.19,2393.6
Long Island,Suffolk,5123000,000885,Long Island Community Hospital,70 or Older,117,F,White,Not Span/Hispanic,9,Emergency,Skilled Nursing Home,2019,INJ002,"FRACTURE OF THE SPINE AND BACK, INITIAL ENCOUNTER",,,930,MULTIPLE SIGNIFICANT TRAUMA W/O O.R. PROCEDURE,25,HUMAN IMMUNODEFICIENCY VIRUS INFECTIONS,2,Moderate,Moderate,Medical,Medicare,Medicare,,,,true,103810.33,14334.61
Long Island,Suffolk,5123000,000885,Long Island Community Hospital,50 to 69,117,M,White,Not Span/Hispanic,2,Emergency,Home or Self Care,2019,INJ003,"FRACTURE OF TORSO, INITIAL ENCOUNTER",,,930,MULTIPLE SIGNIFICANT TRAUMA W/O O.R. PROCEDURE,25,HUMAN IMMUNODEFICIENCY VIRUS INFECTIONS,2,Moderate,Minor,Medical,Private Health Insurance,Blue Cross/Blue Shield,,,,true,66158.15,5563.1
Long Island,Suffolk,5123000,000885,Long Island Community Hospital,70 or Older,119,M,White,Not Span/Hispanic,2,Emergency,Home or Self Care,2019,INJ001,"FRACTURE OF HEAD AND NECK, INITIAL ENCOUNTER",ADM001,TRANSFUSION OF BLOOD AND BLOOD PRODUCTS,930,MULTIPLE SIGNIFICANT TRAUMA W/O O.R. PROCEDURE,25,HUMAN IMMUNODEFICIENCY VIRUS INFECTIONS,3,Major,Moderate,Medical,Medicare,Medicare,Blue Cross/Blue Shield,,,true,90337.58,8677.61
Long Island,Suffolk,5123000,000885,Long Island Community Hospital,50 to 69,117,F,White,Not Span/Hispanic,6,Emergency,Home w/ Home Health Services,2019,INJ003,"FRACTURE OF TORSO, INITIAL ENCOUNTER",,,930,MULTIPLE SIGNIFICANT TRAUMA W/O O.R. PROCEDURE,25,HUMAN IMMUNODEFICIENCY VIRUS INFECTIONS,3,Major,Minor,Medical,Private Health Insurance,Blue Cross/Blue Shield,,,,true,87958.9,13235.23
Long Island,Suffolk,5123000,000885,Long Island Community Hospital,70 or Older,119,F,White,Not Span/Hispanic,5,Emergency,Skilled Nursing Home,2019,INJ004,"FRACTURE OF THE UPPER LIMB, INITIAL ENCOUNTER",,,930,MULTIPLE SIGNIFICANT TRAUMA W/O O.R. PROCEDURE,25,HUMAN IMMUNODEFICIENCY VIRUS INFECTIONS,3,Major,Major,Medical,Medicare,Medicaid,,,,true,76392.51,8956.38
Long Island,Suffolk,5123000,000885,Long Island Community Hospital,70 or Older,119,M,White,Not Span/Hispanic,5,Emergency,Skilled Nursing Home,2019,INJ003,"FRACTURE OF TORSO, INITIAL ENCOUNTER",ESA001,HEMODIALYSIS,930,MULTIPLE SIGNIFICANT TRAUMA W/O O.R. PROCEDURE,25,HUMAN IMMUNODEFICIENCY VIRUS INFECTIONS,3,Major,Major,Medical,Medicare,Medicare,Private Health Insurance,,,true,83850.97,10415.89
Long Island,Suffolk,5123000,000885,Long Island Community Hospital,50 to 69,117,M,White,Not Span/Hispanic,5,Emergency,Home or Self Care,2019,INJ010,"INTERNAL ORGAN INJURY, INITIAL ENCOUNTER",PLC001,IMMOBILIZATION BY SPLINT OR OTHER EXTERNAL DEVICE,930,MULTIPLE SIGNIFICANT TRAUMA W/O O.R. PROCEDURE,25,HUMAN IMMUNODEFICIENCY VIRUS INFECTIONS,3,Major,Major,Medical,Private Health Insurance,,,,,true,77891.71,9269.9
Long Island,Suffolk,5123000,000885,Long Island Community Hospital,30 to 49,119,M,White,Not Span/Hispanic,3,Emergency,Home or Self Care,2019,INJ010,"INTERNAL ORGAN INJURY, INITIAL ENCOUNTER",,,930,MULTIPLE SIGNIFICANT TRAUMA W/O O.R. PROCEDURE,25,HUMAN IMMUNODEFICIENCY VIRUS INFECTIONS,2,Moderate,Minor,Medical,Private Health Insurance,Private Health Insurance,,,,true,73445.53,6731.2
Long Island,Suffolk,5123000,000885,Long Island Community Hospital,30 to 49,119,F,White,Not Span/Hispanic,2,Emergency,Home or Self Care,2019,INJ010,"INTERNAL ORGAN INJURY, INITIAL ENCOUNTER",,,930,MULTIPLE SIGNIFICANT TRAUMA W/O O.R. PROCEDURE,25,HUMAN IMMUNODEFICIENCY VIRUS INFECTIONS,3,Major,Major,Medical,Private Health Insurance,Medicaid,,,,true,56934.39,4813.3
Long Island,Suffolk,5123000,000885,Long Island Community Hospital,70 or Older,117,F,White,Not Span/Hispanic,14,Emergency,Hospice - Home,2019,INJ003,"FRACTURE OF TORSO, INITIAL ENCOUNTER",ADM001,TRANSFUSION OF BLOOD AND BLOOD PRODUCTS,930,MULTIPLE SIGNIFICANT TRAUMA W/O O.R. PROCEDURE,25,HUMAN IMMUNODEFICIENCY VIRUS INFECTIONS,3,Major,Major,Medical,Medicare,Medicare,,,,true,122108.24,20073.02
Long Island,Suffolk,5123000,000885,Long Island Community Hospital,70 or Older,119,F,White,Not Span/Hispanic,6,Emergency,Skilled Nursing Home,2019,INJ003,"FRACTURE OF TORSO, INITIAL ENCOUNTER",,,930,MULTIPLE SIGNIFICANT TRAUMA W/O O.R. PROCEDURE,25,HUMAN IMMUNODEFICIENCY VIRUS INFECTIONS,3,Major,Major,Medical,Private Health Insurance,Medicare,Medicare,,,true,63491.01,9288.97
Long Island,Suffolk,5123000,000885,Long Island Community Hospital,70 or Older,117,F,White,Not Span/Hispanic,6,Emergency,Skilled Nursing Home,2019,INJ003,"FRACTURE OF TORSO, INITIAL ENCOUNTER",,,930,MULTIPLE SIGNIFICANT TRAUMA W/O O.R. PROCEDURE,25,HUMAN IMMUNODEFICIENCY VIRUS INFECTIONS,3,Major,Major,Medical,Private Health Insurance,Medicare,Medicare,,,true,79181.16,9936.63
Long Island,Suffolk,5123000,000885,Long Island Community Hospital,50 to 69,117,M,White,Not Span/Hispanic,4,Emergency,Home or Self Care,2019,INJ002,"FRACTURE OF THE SPINE AND BACK, INITIAL ENCOUNTER",PLC001,IMMOBILIZATION BY SPLINT OR OTHER EXTERNAL DEVICE,930,MULTIPLE SIGNIFICANT TRAUMA W/O O.R. PROCEDURE,25,HUMAN IMMUNODEFICIENCY VIRUS INFECTIONS,2,Moderate,Minor,Medical,Private Health Insurance,Medicare,Medicare,,,true,77246.49,9810.23
Long Island,Suffolk,5123000,000885,Long Island Community Hospital,70 or Older,117,M,Other Race,Not Span/Hispanic,18,Emergency,Skilled Nursing Home,2019,INJ008,"TRAUMATIC BRAIN INJURY (TBI); CONCUSSION, INITIAL ENCOUNTER",CAR028,INFERIOR VENA CAVA (IVC) FILTER PROCEDURES,930,MULTIPLE SIGNIFICANT TRAUMA W/O O.R. PROCEDURE,25,HUMAN IMMUNODEFICIENCY VIRUS INFECTIONS,3,Major,Major,Medical,Medicare,Medicare,,,,true,291583.07,44791.6
Long Island,Suffolk,5123000,000885,Long Island Community Hospital,50 to 69,119,M,White,Not Span/Hispanic,5,Emergency,Skilled Nursing Home,2019,INJ006,"FRACTURE OF THE NECK OF THE FEMUR (HIP), INITIAL ENCOUNTER",,,930,MULTIPLE SIGNIFICANT TRAUMA W/O O.R. PROCEDURE,25,HUMAN IMMUNODEFICIENCY VIRUS INFECTIONS,3,Major,Major,Medical,Medicare,Medicare,,,,true,80482.99,10663.79
Long Island,Suffolk,5123000,000885,Long Island Community Hospital,50 to 69,119,M,Other Race,Not Span/Hispanic,5,Emergency,Home w/ Home Health Services,2019,INJ010,"INTERNAL ORGAN INJURY, INITIAL ENCOUNTER",,,930,MULTIPLE SIGNIFICANT TRAUMA W/O O.R. PROCEDURE,25,HUMAN IMMUNODEFICIENCY VIRUS INFECTIONS,3,Major,Minor,Medical,Private Health Insurance,Private Health Insurance,,,,true,80819.57,10244.31
Long Island,Suffolk,5123000,000885,Long Island Community Hospital,50 to 69,117,M,Black/African American,Not Span/Hispanic,4,Emergency,Home w/ Home Health Services,2019,INJ005,"FRACTURE OF THE LOWER LIMB (EXCEPT HIP), INITIAL ENCOUNTER",PLC001,IMMOBILIZATION BY SPLINT OR OTHER EXTERNAL DEVICE,930,MULTIPLE SIGNIFICANT TRAUMA W/O O.R. PROCEDURE,25,HUMAN IMMUNODEFICIENCY VIRUS INFECTIONS,3,Major,Moderate,Medical,Private Health Insurance,Private Health Insurance,Private Health Insurance,,,true,86766.74,9141.32
