Hospital Service Area,Hospital County,Operating Certificate Number,Permanent Facility Id,Facility Name,Age Group,Zip Code - 3 digits,Gender,Race,Ethnicity,Length of Stay,Type of Admission,Patient Disposition,Discharge Year,CCS Diagnosis Code,CCS Diagnosis Description,CCS Procedure Code,CCS Procedure Description,APR DRG Code,APR DRG Description,APR MDC Code,APR MDC Description,APR Severity of Illness Code,APR Severity of Illness Description,APR Risk of Mortality,APR Medical Surgical Description,Payment Typology 1,Payment Typology 2,Payment Typology 3,Birth Weight,Abortion Edit Indicator,Emergency Department Indicator,Total Charges,Total Costs
New York City,Manhattan,7002001,001438,Bellevue Hospital Center,70 or Older,100,M,White,Not Span/Hispanic,16,Emergency,Expired,2017,233,Intracranial injury,216,RESP INTUB/MECH VENTIL,950,Extensive procedure unrelated to principal diagnosis,01,Diseases and Disorders of the Nervous System,4,Extreme,Extreme,Surgical,Medicare,Private Health Insurance,,,N,Y,145034.63,93510.79
New York City,Manhattan,7002001,001438,Bellevue Hospital Center,50 to 69,100,M,Other Race,Not Span/Hispanic,17,Emergency,Skilled Nursing Home,2017,138,Esophageal disorders,034,TRACHEOSTOMY; TEMP/PERM,950,Extensive procedure unrelated to principal diagnosis,06,Diseases and Disorders of the Digestive System,2,Moderate,Minor,Surgical,Medicare,Medicaid,,,N,Y,105375.29,67940.51
New York City,Manhattan,7002001,001438,Bellevue Hospital Center,30 to 49,113,M,Other Race,Not Span/Hispanic,11,Emergency,Home or Self Care,2017,003,Bacterial infection; unspecified site,061,OT OR PRCS VES NOT HEAD,950,Extensive procedure unrelated to principal diagnosis,09,"Diseases and Disorders of the Skin, Subcutaneous Tissue and Breast",3,Major,Major,Surgical,Medicaid,,,,N,Y,74121.51,47789.70
New York City,Manhattan,7002001,001438,Bellevue Hospital Center,70 or Older,104,M,Black/African American,Not Span/Hispanic,1,Emergency,Home or Self Care,2017,016,Cancer of liver and intrahepatic bile duct,061,OT OR PRCS VES NOT HEAD,950,Extensive procedure unrelated to principal diagnosis,07,Diseases and Disorders of the Hepatobiliary System and Pancreas,1,Minor,Minor,Surgical,Medicare,Medicare,Medicaid,,N,N,2710.12,1747.34
New York City,Manhattan,7002001,001438,Bellevue Hospital Center,50 to 69,112,M,Other Race,Not Span/Hispanic,61,Emergency,Skilled Nursing Home,2017,081,Other hereditary and degenerative nervous system conditions,034,TRACHEOSTOMY; TEMP/PERM,950,Extensive procedure unrelated to principal diagnosis,01,Diseases and Disorders of the Nervous System,3,Major,Major,Surgical,Medicaid,Medicaid,,,N,Y,325684.24,209984.26
New York City,Manhattan,7002001,001438,Bellevue Hospital Center,50 to 69,112,F,Other Race,Not Span/Hispanic,7,Emergency,Expired,2017,042,Secondary malignancies,083,BIOPSY OF LIVER,950,Extensive procedure unrelated to principal diagnosis,07,Diseases and Disorders of the Hepatobiliary System and Pancreas,3,Major,Major,Surgical,Self-Pay,,,,N,Y,51979.08,33513.41
New York City,Manhattan,7002001,001438,Bellevue Hospital Center,70 or Older,100,M,White,Not Span/Hispanic,18,Emergency,Expired,2017,233,Intracranial injury,216,RESP INTUB/MECH VENTIL,950,Extensive procedure unrelated to principal diagnosis,01,Diseases and Disorders of the Nervous System,4,Extreme,Extreme,Surgical,Miscellaneous/Other,Medicare,,,N,Y,157012.19,101233.30
New York City,Manhattan,7002001,001438,Bellevue Hospital Center,70 or Older,100,M,White,Not Span/Hispanic,33,Emergency,Expired,2017,095,Other nervous system disorders,004,DIAGNOSTIC SPINAL TAP,950,Extensive procedure unrelated to principal diagnosis,01,Diseases and Disorders of the Nervous System,3,Major,Extreme,Surgical,Medicare,,,,N,Y,188693.24,121659.59
New York City,Manhattan,7002001,001438,Bellevue Hospital Center,70 or Older,112,F,Other Race,Not Span/Hispanic,18,Emergency,Home or Self Care,2017,019,Cancer of bronchus; lung,037,DX BRONCHOSCOPY & BIOPS,950,Extensive procedure unrelated to principal diagnosis,04,Diseases and Disorders of the Respiratory System,3,Major,Major,Surgical,Medicare,Medicare,Medicaid,,N,Y,109873.47,70840.70
New York City,Manhattan,7002001,001438,Bellevue Hospital Center,70 or Older,100,M,White,Not Span/Hispanic,3,Emergency,Home or Self Care,2017,244,Other injuries and conditions due to external causes,061,OT OR PRCS VES NOT HEAD,950,Extensive procedure unrelated to principal diagnosis,09,"Diseases and Disorders of the Skin, Subcutaneous Tissue and Breast",2,Moderate,Minor,Surgical,Private Health Insurance,Medicare,,,N,Y,25317.21,16323.22
New York City,Manhattan,7002001,001438,Bellevue Hospital Center,30 to 49,113,M,Other Race,Not Span/Hispanic,13,Emergency,Home or Self Care,2017,660,Alcohol-related disorders,056,OT VASCULAR BYP/SHUNT,950,Extensive procedure unrelated to principal diagnosis,07,Diseases and Disorders of the Hepatobiliary System and Pancreas,3,Major,Major,Surgical,Medicaid,,,,N,N,81631.01,52631.43
New York City,Manhattan,7002001,001438,Bellevue Hospital Center,50 to 69,112,M,Other Race,Not Span/Hispanic,7,Emergency,Home or Self Care,2017,660,Alcohol-related disorders,056,OT VASCULAR BYP/SHUNT,950,Extensive procedure unrelated to principal diagnosis,07,Diseases and Disorders of the Hepatobiliary System and Pancreas,3,Major,Moderate,Surgical,Medicare,Medicare,Medicaid,,N,N,42700.06,27530.78
New York City,Manhattan,7002001,001438,Bellevue Hospital Center,70 or Older,114,F,Other Race,Not Span/Hispanic,7,Emergency,Home or Self Care,2017,016,Cancer of liver and intrahepatic bile duct,061,OT OR PRCS VES NOT HEAD,950,Extensive procedure unrelated to principal diagnosis,07,Diseases and Disorders of the Hepatobiliary System and Pancreas,3,Major,Major,Surgical,Medicare,Medicare,Medicaid,,N,N,41069.24,26479.31
New York City,Manhattan,7002001,001438,Bellevue Hospital Center,50 to 69,112,M,Black/African American,Not Span/Hispanic,14,Emergency,Expired,2017,660,Alcohol-related disorders,216,RESP INTUB/MECH VENTIL,950,Extensive procedure unrelated to principal diagnosis,07,Diseases and Disorders of the Hepatobiliary System and Pancreas,4,Extreme,Extreme,Surgical,Medicare,Medicare,Medicaid,,N,N,113527.55,73196.66
New York City,Manhattan,7002001,001438,Bellevue Hospital Center,30 to 49,104,F,Other Race,Spanish/Hispanic,8,Emergency,Home or Self Care,2017,151,Other liver diseases,063,OT NON-OR THER CARDIO,950,Extensive procedure unrelated to principal diagnosis,07,Diseases and Disorders of the Hepatobiliary System and Pancreas,4,Extreme,Major,Surgical,Medicaid,,,,N,Y,48292.28,31136.35
New York City,Manhattan,7002001,001438,Bellevue Hospital Center,50 to 69,114,F,Other Race,Not Span/Hispanic,18,Elective,Home or Self Care,2017,237,Complication of device; implant or graft,034,TRACHEOSTOMY; TEMP/PERM,950,Extensive procedure unrelated to principal diagnosis,11,Diseases and Disorders of the Kidney and Urinary Tract,3,Major,Major,Surgical,Medicaid,,,,N,N,107089.79,69045.93
New York City,Manhattan,7002001,001438,Bellevue Hospital Center,50 to 69,100,F,White,Not Span/Hispanic,21,Emergency,Home or Self Care,2017,660,Alcohol-related disorders,056,OT VASCULAR BYP/SHUNT,950,Extensive procedure unrelated to principal diagnosis,07,Diseases and Disorders of the Hepatobiliary System and Pancreas,3,Major,Major,Surgical,Medicare,Medicaid,,,N,Y,109972.59,70904.61
New York City,Manhattan,7002001,001438,Bellevue Hospital Center,30 to 49,112,M,White,Not Span/Hispanic,1,Emergency,Home or Self Care,2017,231,Other fractures,216,RESP INTUB/MECH VENTIL,950,Extensive procedure unrelated to principal diagnosis,08,Diseases and Disorders of the Musculoskeletal System and Conn Tissue,2,Moderate,Minor,Surgical,Miscellaneous/Other,Private Health Insurance,,,N,Y,4767.96,3074.13
New York City,Manhattan,7002001,001438,Bellevue Hospital Center,30 to 49,112,F,Other Race,Spanish/Hispanic,1,Emergency,Home or Self Care,2017,047,Other and unspecified benign neoplasm,104,NEPHRECTOMY; PART/TOTAL,950,Extensive procedure unrelated to principal diagnosis,06,Diseases and Disorders of the Digestive System,1,Minor,Minor,Surgical,Self-Pay,,,,N,N,7067.10,4556.50
New York City,Manhattan,7002001,001438,Bellevue Hospital Center,30 to 49,,M,Black/African American,Spanish/Hispanic,5,Emergency,Home or Self Care,2017,660,Alcohol-related disorders,098,OT NON-OR GI THER PRCS,950,Extensive procedure unrelated to principal diagnosis,07,Diseases and Disorders of the Hepatobiliary System and Pancreas,3,Major,Major,Surgical,Medicaid,Medicaid,,,N,Y,45309.44,29213.17
New York City,Manhattan,7002001,001438,Bellevue Hospital Center,70 or Older,100,M,Other Race,Not Span/Hispanic,71,Emergency,Expired,2017,099,Hypertension with complications and secondary hypertension,216,RESP INTUB/MECH VENTIL,950,Extensive procedure unrelated to principal diagnosis,05,Diseases and Disorders of the Circulatory System,3,Major,Major,Surgical,Medicaid,,,,N,Y,440515.20,284021.29
New York City,Manhattan,7002001,001438,Bellevue Hospital Center,50 to 69,100,M,Other Race,Spanish/Hispanic,1,Elective,Home or Self Care,2017,016,Cancer of liver and intrahepatic bile duct,061,OT OR PRCS VES NOT HEAD,950,Extensive procedure unrelated to principal diagnosis,07,Diseases and Disorders of the Hepatobiliary System and Pancreas,1,Minor,Minor,Surgical,Medicaid,Medicaid,,,N,N,6327.81,4079.84
New York City,Manhattan,7002001,001438,Bellevue Hospital Center,50 to 69,114,M,Other Race,Not Span/Hispanic,2,Emergency,Home or Self Care,2017,134,Other upper respiratory disease,042,OT OR RX PRCS RESP SYS,950,Extensive procedure unrelated to principal diagnosis,03,"Ear, Nose, Mouth, Throat and Craniofacial Diseases and Disorders",1,Minor,Moderate,Surgical,Medicaid,,,,N,Y,13280.91,8562.84
New York City,Manhattan,7002001,001438,Bellevue Hospital Center,30 to 49,OOS,M,Other Race,Not Span/Hispanic,1,Elective,Home or Self Care,2017,217,Other congenital anomalies,175,OT OR THER PRC SKN/BRST,950,Extensive procedure unrelated to principal diagnosis,10,"Endocrine, Nutritional and Metabolic Diseases and Disorders",1,Minor,Minor,Surgical,Self-Pay,,,,N,N,2678.69,1727.08
New York City,Manhattan,7002001,001438,Bellevue Hospital Center,70 or Older,113,M,Other Race,Not Span/Hispanic,1,Emergency,Home or Self Care,2017,016,Cancer of liver and intrahepatic bile duct,061,OT OR PRCS VES NOT HEAD,950,Extensive procedure unrelated to principal diagnosis,07,Diseases and Disorders of the Hepatobiliary System and Pancreas,1,Minor,Minor,Surgical,Medicaid,,,,N,N,6300.12,4061.99
New York City,Manhattan,7002001,001438,Bellevue Hospital Center,50 to 69,113,M,Other Race,Not Span/Hispanic,27,Emergency,Hospice - Home,2017,145,Intestinal obstruction without hernia,211,THERAPEUTIC RADIOLOGY,950,Extensive procedure unrelated to principal diagnosis,06,Diseases and Disorders of the Digestive System,3,Major,Major,Surgical,Medicaid,,,,N,Y,164010.05,105745.15
New York City,Manhattan,7002001,001438,Bellevue Hospital Center,30 to 49,100,M,Other Race,Spanish/Hispanic,2,Emergency,Home or Self Care,2017,234,Crushing injury or internal injury,061,OT OR PRCS VES NOT HEAD,950,Extensive procedure unrelated to principal diagnosis,16,"Diseases and Disorders of Blood, Blood Forming Organs and Immunological Disorders",1,Minor,Minor,Surgical,Self-Pay,,,,N,N,13965.34,9004.13
New York City,Manhattan,7002001,001438,Bellevue Hospital Center,50 to 69,112,F,Black/African American,Not Span/Hispanic,11,Emergency,Home w/ Home Health Services,2017,026,Cancer of cervix,073,ILEO- & OT ENTER-OSTOMY,950,Extensive procedure unrelated to principal diagnosis,13,Diseases and Disorders of the Female Reproductive System,2,Moderate,Minor,Surgical,Medicaid,Medicaid,,,N,Y,61111.56,39401.56
New York City,Manhattan,7002001,001438,Bellevue Hospital Center,70 or Older,104,F,Other Race,Spanish/Hispanic,1,Emergency,Home or Self Care,2017,238,Complications of surgical procedures or medical care,098,OT NON-OR GI THER PRCS,950,Extensive procedure unrelated to principal diagnosis,06,Diseases and Disorders of the Digestive System,2,Moderate,Minor,Surgical,Medicare,Medicare,Medicaid,,N,N,6312.95,4070.26
New York City,Manhattan,7002001,001438,Bellevue Hospital Center,70 or Older,112,M,Other Race,Not Span/Hispanic,32,Emergency,Another Type Not Listed,2017,109,Acute cerebrovascular disease,063,OT NON-OR THER CARDIO,950,Extensive procedure unrelated to principal diagnosis,01,Diseases and Disorders of the Nervous System,3,Major,Major,Surgical,Medicare,Medicare,Medicaid,,N,Y,184173.61,118745.57
New York City,Manhattan,7002001,001438,Bellevue Hospital Center,50 to 69,100,F,Other Race,Spanish/Hispanic,1,Emergency,Home or Self Care,2017,016,Cancer of liver and intrahepatic bile duct,061,OT OR PRCS VES NOT HEAD,950,Extensive procedure unrelated to principal diagnosis,07,Diseases and Disorders of the Hepatobiliary System and Pancreas,1,Minor,Minor,Surgical,Medicare,Medicare,Medicaid,,N,N,2772.42,1787.51
New York City,Manhattan,7002001,001438,Bellevue Hospital Center,70 or Older,112,F,Other Race,Spanish/Hispanic,7,Emergency,Home w/ Home Health Services,2017,111,Other and ill-defined cerebrovascular disease,059,OT OR PRCS ON VES HEAD,950,Extensive procedure unrelated to principal diagnosis,01,Diseases and Disorders of the Nervous System,2,Moderate,Moderate,Surgical,Medicare,Medicare,Medicaid,,N,Y,63692.40,41065.55
New York City,Manhattan,7002001,001438,Bellevue Hospital Center,50 to 69,104,M,Black/African American,Not Span/Hispanic,24,Emergency,Home or Self Care,2017,099,Hypertension with complications and secondary hypertension,019,OT THER PRCS EYELIDS,950,Extensive procedure unrelated to principal diagnosis,05,Diseases and Disorders of the Circulatory System,4,Extreme,Major,Surgical,Medicaid,,,,N,Y,125308.29,80792.27
New York City,Manhattan,7002001,001438,Bellevue Hospital Center,50 to 69,112,F,Other Race,Not Span/Hispanic,30,Emergency,Skilled Nursing Home,2017,109,Acute cerebrovascular disease,188,CEREBRAL ARTERIOGRAM,950,Extensive procedure unrelated to principal diagnosis,01,Diseases and Disorders of the Nervous System,4,Extreme,Major,Surgical,Medicaid,,,,N,N,180740.72,116532.22
New York City,Manhattan,7002001,001438,Bellevue Hospital Center,50 to 69,OOS,F,Other Race,Not Span/Hispanic,1,Emergency,Home or Self Care,2017,047,Other and unspecified benign neoplasm,142,PARTIAL EXCISION BONE,950,Extensive procedure unrelated to principal diagnosis,01,Diseases and Disorders of the Nervous System,1,Minor,Minor,Surgical,Private Health Insurance,,,,N,N,2997.81,1932.83
New York City,Manhattan,7002001,001438,Bellevue Hospital Center,70 or Older,114,M,Other Race,Not Span/Hispanic,16,Emergency,Home or Self Care,2017,151,Other liver diseases,042,OT OR RX PRCS RESP SYS,950,Extensive procedure unrelated to principal diagnosis,07,Diseases and Disorders of the Hepatobiliary System and Pancreas,4,Extreme,Major,Surgical,Medicare,Medicare,Medicaid,,N,Y,110474.72,71228.35
