Hospital Service Area,Hospital County,Operating Certificate Number,Permanent Facility Id,Facility Name,Age Group,Zip Code - 3 digits,Gender,Race,Ethnicity,Length of Stay,Type of Admission,Patient Disposition,Discharge Year,CCS Diagnosis Code,CCS Diagnosis Description,CCS Procedure Code,CCS Procedure Description,APR DRG Code,APR DRG Description,APR MDC Code,APR MDC Description,APR Severity of Illness Code,APR Severity of Illness Description,APR Risk of Mortality,APR Medical Surgical Description,Payment Typology 1,Payment Typology 2,Payment Typology 3,Birth Weight,Abortion Edit Indicator,Emergency Department Indicator,Total Charges,Total Costs
New York City,Manhattan,7002001,001438,Bellevue Hospital Center,70 or Older,114,F,Other Race,Not Span/Hispanic,12,Emergency,Home w/ Home Health Services,2019,CIR017,CARDIAC DYSRHYTHMIAS,MST001,ARTHROCENTESIS,950,EXTENSIVE PROCEDURE UNRELATED TO PRINCIPAL DIAGNOSIS,05,DISEASES AND DISORDERS OF THE CIRCULATORY SYSTEM,3,Major,Major,Surgical,Medicare,Medicare,Medicaid,,,false,79651.39,52936.31
New York City,Manhattan,7002001,001438,Bellevue Hospital Center,70 or Older,112,F,Other Race,Spanish/Hispanic,1,Elective,Home or Self Care,2019,NEO017,GASTROINTESTINAL CANCERS - LIVER,CAR010,LIGATION AND EMBOLIZATION OF VESSELS,950,EXTENSIVE PROCEDURE UNRELATED TO PRINCIPAL DIAGNOSIS,07,DISEASES AND DISORDERS OF THE HEPATOBILIARY SYSTEM AND PANCREAS,1,Minor,Minor,Surgical,Medicare,Medicare,Medicaid,,,false,2732.44,1815.98
New York City,Manhattan,7002001,001438,Bellevue Hospital Center,0 to 17,113,F,White,Not Span/Hispanic,9,Elective,Home w/ Home Health Services,2019,MUS011,SPONDYLOPATHIES/SPONDYLOARTHROPATHY (INCLUDING INFECTIVE),MST018,BONE EXCISION,950,EXTENSIVE PROCEDURE UNRELATED TO PRINCIPAL DIAGNOSIS,08,DISEASES AND DISORDERS OF THE MUSCULOSKELETAL SYSTEM AND CONNECTIVE TISSUE,3,Major,Minor,Surgical,Medicaid,,,,,true,51729.62,34379.51
New York City,Manhattan,7002001,001438,Bellevue Hospital Center,30 to 49,104,F,Other Race,Spanish/Hispanic,1,Elective,Home or Self Care,2019,NEO070,SECONDARY MALIGNANCIES,CAR010,LIGATION AND EMBOLIZATION OF VESSELS,950,EXTENSIVE PROCEDURE UNRELATED TO PRINCIPAL DIAGNOSIS,07,DISEASES AND DISORDERS OF THE HEPATOBILIARY SYSTEM AND PANCREAS,1,Minor,Minor,Surgical,Medicaid,Medicaid,,,,false,6300.12,4187.06
New York City,Manhattan,7002001,001438,Bellevue Hospital Center,30 to 49,113,M,Other Race,Spanish/Hispanic,15,Emergency,Expired,2019,BLD003,APLASTIC ANEMIA,ESA002,EXTRACORPOREAL MEMBRANE OXYGENATION,950,EXTENSIVE PROCEDURE UNRELATED TO PRINCIPAL DIAGNOSIS,16,DISEASES AND DISORDERS OF THE BLOOD AND BLOOD FORMING ORGANS AND IMMUNOLOGICAL DISORDERS,4,Extreme,Extreme,Surgical,Medicaid,,,,,true,85591.1,56883.85
New York City,Manhattan,7002001,001438,Bellevue Hospital Center,50 to 69,112,M,White,Not Span/Hispanic,3,Emergency,Home or Self Care,2019,NEO070,SECONDARY MALIGNANCIES,LYM001,LYMPH NODE BIOPSY,950,EXTENSIVE PROCEDURE UNRELATED TO PRINCIPAL DIAGNOSIS,04,DISEASES AND DISORDERS OF THE RESPIRATORY SYSTEM,2,Moderate,Major,Surgical,Medicaid,,,,,true,17775.36,11813.5
New York City,Manhattan,7002001,001438,Bellevue Hospital Center,50 to 69,111,M,Other Race,Spanish/Hispanic,7,Emergency,Home or Self Care,2019,DIG019,OTHER SPECIFIED AND UNSPECIFIED LIVER DISEASE,CAR010,LIGATION AND EMBOLIZATION OF VESSELS,950,EXTENSIVE PROCEDURE UNRELATED TO PRINCIPAL DIAGNOSIS,07,DISEASES AND DISORDERS OF THE HEPATOBILIARY SYSTEM AND PANCREAS,3,Major,Major,Surgical,Medicaid,,,,,true,40654.36,27018.89
New York City,Manhattan,7002001,001438,Bellevue Hospital Center,30 to 49,114,F,Other Race,Spanish/Hispanic,10,Emergency,Home or Self Care,2019,NEO053,ENDOCRINE SYSTEM CANCERS - ADRENOCORTICAL,CAR019,SEPTAL REPAIR AND OTHER THERAPEUTIC HEART PROCEDURES,950,EXTENSIVE PROCEDURE UNRELATED TO PRINCIPAL DIAGNOSIS,10,"ENDOCRINE, NUTRITIONAL AND METABOLIC DISEASES AND DISORDERS",4,Extreme,Extreme,Surgical,Medicaid,,,,,true,65773.37,43712.98
New York City,Manhattan,7002001,001438,Bellevue Hospital Center,50 to 69,113,F,Other Race,Not Span/Hispanic,113,Emergency,Left Against Medical Advice,2019,MUS003,RHEUMATOID ARTHRITIS AND RELATED DISEASE,ADM001,TRANSFUSION OF BLOOD AND BLOOD PRODUCTS,950,EXTENSIVE PROCEDURE UNRELATED TO PRINCIPAL DIAGNOSIS,08,DISEASES AND DISORDERS OF THE MUSCULOSKELETAL SYSTEM AND CONNECTIVE TISSUE,3,Major,Major,Surgical,Medicaid,,,,,false,600659.24,399198.13
New York City,Manhattan,7002001,001438,Bellevue Hospital Center,50 to 69,112,F,Black/African American,Not Span/Hispanic,25,Emergency,Home w/ Home Health Services,2019,CIR027,ARTERIAL DISSECTIONS,IMG008,ULTRASONOGRAPHY,950,EXTENSIVE PROCEDURE UNRELATED TO PRINCIPAL DIAGNOSIS,05,DISEASES AND DISORDERS OF THE CIRCULATORY SYSTEM,4,Extreme,Extreme,Surgical,Medicaid,Medicaid,,,,false,172927.22,114927.43
New York City,Manhattan,7002001,001438,Bellevue Hospital Center,50 to 69,112,M,Black/African American,Not Span/Hispanic,7,Elective,Home w/ Home Health Services,2019,NEO073,BENIGN NEOPLASMS,ENP005,PITUITARY GLAND RESECTION,950,EXTENSIVE PROCEDURE UNRELATED TO PRINCIPAL DIAGNOSIS,10,"ENDOCRINE, NUTRITIONAL AND METABOLIC DISEASES AND DISORDERS",3,Major,Moderate,Surgical,Medicare,Medicare,Medicaid,,,false,47582.7,31623.46
New York City,Manhattan,7002001,001438,Bellevue Hospital Center,50 to 69,114,M,Black/African American,Not Span/Hispanic,12,Urgent,Home or Self Care,2019,DIG017,BILIARY TRACT DISEASE,HEP008,COMMON BILE DUCT SPHINCTEROTOMY AND STENTING,950,EXTENSIVE PROCEDURE UNRELATED TO PRINCIPAL DIAGNOSIS,07,DISEASES AND DISORDERS OF THE HEPATOBILIARY SYSTEM AND PANCREAS,4,Extreme,Major,Surgical,Medicare,,,,,false,157331.85,104562.75
New York City,Manhattan,7002001,001438,Bellevue Hospital Center,50 to 69,112,M,Other Race,Spanish/Hispanic,3,Elective,Home or Self Care,2019,END009,OBESITY,GIS010,GASTRECTOMY,950,EXTENSIVE PROCEDURE UNRELATED TO PRINCIPAL DIAGNOSIS,04,DISEASES AND DISORDERS OF THE RESPIRATORY SYSTEM,2,Moderate,Minor,Surgical,Private Health Insurance,,,,,false,36640.53,24351.3
New York City,Manhattan,7002001,001438,Bellevue Hospital Center,70 or Older,112,F,Black/African American,Not Span/Hispanic,4,Emergency,Home or Self Care,2019,NEO069,CANCER OF OTHER SITES,MST003,"SUBCUTANEOUS TISSUE, FASCIA, AND MUSCLE BIOPSY",950,EXTENSIVE PROCEDURE UNRELATED TO PRINCIPAL DIAGNOSIS,08,DISEASES AND DISORDERS OF THE MUSCULOSKELETAL SYSTEM AND CONNECTIVE TISSUE,3,Major,Major,Surgical,Medicare,,,,,true,57326.62,38099.27
New York City,Manhattan,7002001,001438,Bellevue Hospital Center,18 to 29,112,F,White,Unknown,8,Emergency,Inpatient Rehabilitation Facility,2019,PRG028,OTHER SPECIFIED COMPLICATIONS IN PREGNANCY,MST011,FIXATION OF LEG AND FOOT BONES,950,EXTENSIVE PROCEDURE UNRELATED TO PRINCIPAL DIAGNOSIS,14,"PREGNANCY, CHILDBIRTH AND THE PUERPERIUM",3,Major,Minor,Surgical,Miscellaneous/Other,Medicaid,,,,true,93137.78,61899.37
New York City,Manhattan,7002001,001438,Bellevue Hospital Center,50 to 69,114,F,Black/African American,Not Span/Hispanic,2,Elective,Home or Self Care,2019,NEO073,BENIGN NEOPLASMS,PNS002,CERVICOTHORACIC NERVE DECOMPRESSION,950,EXTENSIVE PROCEDURE UNRELATED TO PRINCIPAL DIAGNOSIS,05,DISEASES AND DISORDERS OF THE CIRCULATORY SYSTEM,1,Minor,Minor,Surgical,Private Health Insurance,,,,,false,53882,35809.98
New York City,Manhattan,7002001,001438,Bellevue Hospital Center,18 to 29,OOS,M,White,Not Span/Hispanic,18,Emergency,Home or Self Care,2019,DIG020,PANCREATIC DISORDERS (EXCLUDING DIABETES),LYM005,SPLENECTOMY,950,EXTENSIVE PROCEDURE UNRELATED TO PRINCIPAL DIAGNOSIS,07,DISEASES AND DISORDERS OF THE HEPATOBILIARY SYSTEM AND PANCREAS,4,Extreme,Extreme,Surgical,Medicare,Medicaid,,,,true,233436,155141.57
New York City,Manhattan,7002001,001438,Bellevue Hospital Center,18 to 29,100,M,Other Race,Unknown,1,Emergency,Home or Self Care,2019,INJ011,"OPEN WOUNDS OF HEAD AND NECK, INITIAL ENCOUNTER",MST028,"SUBCUTANEOUS TISSUE AND FASCIA PROCEDURES, NEC",950,EXTENSIVE PROCEDURE UNRELATED TO PRINCIPAL DIAGNOSIS,09,"DISEASES AND DISORDERS OF THE SKIN, SUBCUTANEOUS TISSUE AND BREAST",2,Moderate,Minor,Surgical,Self-Pay,,,,,true,23785.69,15807.97
New York City,Manhattan,7002001,001438,Bellevue Hospital Center,50 to 69,112,M,Black/African American,Not Span/Hispanic,1,Elective,Home or Self Care,2019,NEO017,GASTROINTESTINAL CANCERS - LIVER,CAR010,LIGATION AND EMBOLIZATION OF VESSELS,950,EXTENSIVE PROCEDURE UNRELATED TO PRINCIPAL DIAGNOSIS,07,DISEASES AND DISORDERS OF THE HEPATOBILIARY SYSTEM AND PANCREAS,2,Moderate,Minor,Surgical,Medicare,Medicaid,,,,false,12760.67,8480.74
New York City,Manhattan,7002001,001438,Bellevue Hospital Center,50 to 69,104,M,Black/African American,Not Span/Hispanic,1,Elective,Home or Self Care,2019,NEO017,GASTROINTESTINAL CANCERS - LIVER,ADM012,CHEMOTHERAPY,950,EXTENSIVE PROCEDURE UNRELATED TO PRINCIPAL DIAGNOSIS,07,DISEASES AND DISORDERS OF THE HEPATOBILIARY SYSTEM AND PANCREAS,2,Moderate,Moderate,Surgical,Medicaid,,,,,false,36733.55,24413.12
New York City,Manhattan,7002001,001438,Bellevue Hospital Center,30 to 49,,M,White,Unknown,28,Urgent,Expired,2019,NVS009,EPILEPSY; CONVULSIONS,RES010,TRACHEOSTOMY,950,EXTENSIVE PROCEDURE UNRELATED TO PRINCIPAL DIAGNOSIS,01,DISEASES AND DISORDERS OF THE NERVOUS SYSTEM,4,Extreme,Extreme,Surgical,Medicaid,,,,,false,440009.04,292430.01
New York City,Manhattan,7002001,001438,Bellevue Hospital Center,50 to 69,104,M,Other Race,Spanish/Hispanic,19,Emergency,Home or Self Care,2019,RSP008,CHRONIC OBSTRUCTIVE PULMONARY DISEASE AND BRONCHIECTASIS,MST013,SPINE FUSION,950,EXTENSIVE PROCEDURE UNRELATED TO PRINCIPAL DIAGNOSIS,04,DISEASES AND DISORDERS OF THE RESPIRATORY SYSTEM,3,Major,Minor,Surgical,Medicaid,,,,,true,182552.04,121324.09
New York City,Manhattan,7002001,001438,Bellevue Hospital Center,18 to 29,100,F,White,Not Span/Hispanic,1,Emergency,Home or Self Care,2019,INJ010,"INTERNAL ORGAN INJURY, INITIAL ENCOUNTER",CAR010,LIGATION AND EMBOLIZATION OF VESSELS,950,EXTENSIVE PROCEDURE UNRELATED TO PRINCIPAL DIAGNOSIS,16,DISEASES AND DISORDERS OF THE BLOOD AND BLOOD FORMING ORGANS AND IMMUNOLOGICAL DISORDERS,2,Moderate,Minor,Surgical,Private Health Insurance,,,,,true,45040.54,29933.94
New York City,Manhattan,7002001,001438,Bellevue Hospital Center,50 to 69,104,F,Other Race,Spanish/Hispanic,1,Elective,Home or Self Care,2019,NEO017,GASTROINTESTINAL CANCERS - LIVER,CAR010,LIGATION AND EMBOLIZATION OF VESSELS,950,EXTENSIVE PROCEDURE UNRELATED TO PRINCIPAL DIAGNOSIS,07,DISEASES AND DISORDERS OF THE HEPATOBILIARY SYSTEM AND PANCREAS,1,Minor,Minor,Surgical,Medicaid,,,,,false,20077.24,13343.33
New York City,Manhattan,7002001,001438,Bellevue Hospital Center,50 to 69,112,M,Other Race,Not Span/Hispanic,23,Emergency,Expired,2019,NEO051,ENDOCRINE SYSTEM CANCERS - PANCREAS,GIS006,PARACENTESIS,950,EXTENSIVE PROCEDURE UNRELATED TO PRINCIPAL DIAGNOSIS,07,DISEASES AND DISORDERS OF THE HEPATOBILIARY SYSTEM AND PANCREAS,4,Extreme,Extreme,Surgical,Medicaid,,,,,true,161070.7,107047.59
New York City,Manhattan,7002001,001438,Bellevue Hospital Center,50 to 69,100,F,Other Race,Spanish/Hispanic,1,Elective,Home or Self Care,2019,NEO070,SECONDARY MALIGNANCIES,CAR010,LIGATION AND EMBOLIZATION OF VESSELS,950,EXTENSIVE PROCEDURE UNRELATED TO PRINCIPAL DIAGNOSIS,07,DISEASES AND DISORDERS OF THE HEPATOBILIARY SYSTEM AND PANCREAS,2,Moderate,Minor,Surgical,Medicaid,,,,,false,18163.83,12071.68
New York City,Manhattan,7002001,001438,Bellevue Hospital Center,50 to 69,114,M,Other Race,Not Span/Hispanic,3,Elective,Home or Self Care,2019,SYM017,ABNORMAL FINDINGS WITHOUT DIAGNOSIS,LYM001,LYMPH NODE BIOPSY,950,EXTENSIVE PROCEDURE UNRELATED TO PRINCIPAL DIAGNOSIS,07,DISEASES AND DISORDERS OF THE HEPATOBILIARY SYSTEM AND PANCREAS,2,Moderate,Minor,Surgical,Medicaid,,,,,false,47670.07,31681.53
