Hospital Service Area,Hospital County,Operating Certificate Number,Permanent Facility Id,Facility Name,Age Group,Zip Code - 3 digits,Gender,Race,Ethnicity,Length of Stay,Type of Admission,Patient Disposition,Discharge Year,CCS Diagnosis Code,CCS Diagnosis Description,CCS Procedure Code,CCS Procedure Description,APR DRG Code,APR DRG Description,APR MDC Code,APR MDC Description,APR Severity of Illness Code,APR Severity of Illness Description,APR Risk of Mortality,APR Medical Surgical Description,Payment Typology 1,Payment Typology 2,Payment Typology 3,Birth Weight,Abortion Edit Indicator,Emergency Department Indicator,Total Charges,Total Costs
Long Island,Nassau,2908000,000511,NYU Langone Hospital-Long Island,70 or Older,113,M,Black/African American,Not Span/Hispanic,62,Emergency,Skilled Nursing Home,2020,CIR019,HEART FAILURE,MST018,BONE EXCISION,951,MODERATELY EXTENSIVE PROCEDURE UNRELATED TO PRINCIPAL DIAGNOSIS,05,DISEASES AND DISORDERS OF THE CIRCULATORY SYSTEM,4,Extreme,Major,Surgical,Blue Cross/Blue Shield,Medicare,,,,Y,963811.64,253887
Long Island,Nassau,2908000,000511,NYU Langone Hospital-Long Island,70 or Older,117,F,Black/African American,Not Span/Hispanic,16,Emergency,Home or Self Care,2020,DIG008,OTHER SPECIFIED AND UNSPECIFIED DISORDERS OF STOMACH AND DUODENUM,GNR004,ENDOSCOPIC CONTROL OF BLEEDING,951,MODERATELY EXTENSIVE PROCEDURE UNRELATED TO PRINCIPAL DIAGNOSIS,06,DISEASES AND DISORDERS OF THE DIGESTIVE SYSTEM,3,Major,Major,Surgical,Medicare,Blue Cross/Blue Shield,,,,Y,597044.98,116459.53
Long Island,Nassau,2908000,000511,NYU Langone Hospital-Long Island,50 to 69,115,M,Black/African American,Not Span/Hispanic,29,Emergency,Inpatient Rehabilitation Facility,2020,CIR020,CEREBRAL INFARCTION,CAR029,"CARDIOVASCULAR DEVICE PROCEDURES, NEC",951,MODERATELY EXTENSIVE PROCEDURE UNRELATED TO PRINCIPAL DIAGNOSIS,01,DISEASES AND DISORDERS OF THE NERVOUS SYSTEM,4,Extreme,Extreme,Surgical,Blue Cross/Blue Shield,Blue Cross/Blue Shield,,,,Y,704765.32,198391.16
Long Island,Nassau,2908000,000511,NYU Langone Hospital-Long Island,18 to 29,115,M,White,Not Span/Hispanic,1,Elective,Home or Self Care,2020,NVS017,NERVE AND NERVE ROOT DISORDERS,MST018,BONE EXCISION,951,MODERATELY EXTENSIVE PROCEDURE UNRELATED TO PRINCIPAL DIAGNOSIS,01,DISEASES AND DISORDERS OF THE NERVOUS SYSTEM,2,Moderate,Minor,Surgical,Private Health Insurance,,,,,N,76811.91,12733.1
Long Island,Nassau,2908000,000511,NYU Langone Hospital-Long Island,70 or Older,115,F,White,Not Span/Hispanic,1,Emergency,Home w/ Home Health Services,2020,DIG015,ANAL AND RECTAL CONDITIONS,GIS029,"LOWER GI THERAPEUTIC PROCEDURES, NEC (EXCLUDING OPEN AND LAPAROSCOPIC)",951,MODERATELY EXTENSIVE PROCEDURE UNRELATED TO PRINCIPAL DIAGNOSIS,06,DISEASES AND DISORDERS OF THE DIGESTIVE SYSTEM,2,Moderate,Minor,Surgical,Medicare,Medicare,,,,Y,32610.27,10461.65
Long Island,Nassau,2908000,000511,NYU Langone Hospital-Long Island,70 or Older,117,M,White,Not Span/Hispanic,13,Emergency,Home w/ Home Health Services,2020,INJ034,"COMPLICATION OF GENITOURINARY DEVICE, IMPLANT OR GRAFT, INITIAL ENCOUNTER",MST002,BONE AND JOINT BIOPSY,951,MODERATELY EXTENSIVE PROCEDURE UNRELATED TO PRINCIPAL DIAGNOSIS,11,DISEASES AND DISORDERS OF THE KIDNEY AND URINARY TRACT,3,Major,Major,Surgical,Medicare,Blue Cross/Blue Shield,,,,Y,169558.72,47725.19
Long Island,Nassau,2908000,000511,NYU Langone Hospital-Long Island,70 or Older,115,M,Other Race,Not Span/Hispanic,9,Emergency,Skilled Nursing Home,2020,CIR020,CEREBRAL INFARCTION,CAR004,PERCUTANEOUS CORONARY INTERVENTIONS (PCI),951,MODERATELY EXTENSIVE PROCEDURE UNRELATED TO PRINCIPAL DIAGNOSIS,01,DISEASES AND DISORDERS OF THE NERVOUS SYSTEM,4,Extreme,Extreme,Surgical,Medicare,Private Health Insurance,,,,Y,366175.75,81037.9
Long Island,Nassau,2908000,000511,NYU Langone Hospital-Long Island,70 or Older,115,F,White,Not Span/Hispanic,7,Emergency,Home w/ Home Health Services,2020,GEN004,URINARY TRACT INFECTIONS,MST009,FIXATION OF UPPER EXTREMITY BONES,951,MODERATELY EXTENSIVE PROCEDURE UNRELATED TO PRINCIPAL DIAGNOSIS,11,DISEASES AND DISORDERS OF THE KIDNEY AND URINARY TRACT,3,Major,Major,Surgical,Private Health Insurance,,,,,Y,182335.87,39619.46
Long Island,Nassau,2908000,000511,NYU Langone Hospital-Long Island,50 to 69,115,F,White,Not Span/Hispanic,2,Emergency,Home w/ Home Health Services,2020,INJ037,"COMPLICATION OF OTHER SURGICAL OR MEDICAL CARE, INJURY, INITIAL ENCOUNTER",GIS024,OTHER PERITONEAL CAVITY PROCEDURES,951,MODERATELY EXTENSIVE PROCEDURE UNRELATED TO PRINCIPAL DIAGNOSIS,01,DISEASES AND DISORDERS OF THE NERVOUS SYSTEM,2,Moderate,Moderate,Surgical,Private Health Insurance,,,,,Y,83343.3,16932.92
Long Island,Nassau,2908000,000511,NYU Langone Hospital-Long Island,70 or Older,115,F,White,Not Span/Hispanic,18,Emergency,Home w/ Home Health Services,2020,END011,FLUID AND ELECTROLYTE DISORDERS,GNR005,CONTROL OF BLEEDING (NON-ENDOSCOPIC),951,MODERATELY EXTENSIVE PROCEDURE UNRELATED TO PRINCIPAL DIAGNOSIS,10,"ENDOCRINE, NUTRITIONAL AND METABOLIC DISEASES AND DISORDERS",4,Extreme,Extreme,Surgical,Medicare,,,,,Y,211512.26,65913.74
Long Island,Nassau,2908000,000511,NYU Langone Hospital-Long Island,50 to 69,115,F,White,Not Span/Hispanic,8,Emergency,Home or Self Care,2020,END003,DIABETES MELLITUS WITH COMPLICATION,MST019,"MUSCLE, TENDON, BURSA, AND LIGAMENT EXCISION",951,MODERATELY EXTENSIVE PROCEDURE UNRELATED TO PRINCIPAL DIAGNOSIS,09,"DISEASES AND DISORDERS OF THE SKIN, SUBCUTANEOUS TISSUE AND BREAST",2,Moderate,Moderate,Surgical,Private Health Insurance,,,,,Y,157055.02,32707.45
Long Island,Nassau,2908000,000511,NYU Langone Hospital-Long Island,70 or Older,119,M,White,Not Span/Hispanic,6,Elective,Home w/ Home Health Services,2020,RSP008,CHRONIC OBSTRUCTIVE PULMONARY DISEASE AND BRONCHIECTASIS,CAR004,PERCUTANEOUS CORONARY INTERVENTIONS (PCI),951,MODERATELY EXTENSIVE PROCEDURE UNRELATED TO PRINCIPAL DIAGNOSIS,04,DISEASES AND DISORDERS OF THE RESPIRATORY SYSTEM,4,Extreme,Major,Surgical,Medicare,,,,,N,199435.37,52416.62
Long Island,Nassau,2908000,000511,NYU Langone Hospital-Long Island,50 to 69,117,F,White,Not Span/Hispanic,1,Elective,Home or Self Care,2020,END009,OBESITY,GIS011,SMALL BOWEL RESECTION,951,MODERATELY EXTENSIVE PROCEDURE UNRELATED TO PRINCIPAL DIAGNOSIS,10,"ENDOCRINE, NUTRITIONAL AND METABOLIC DISEASES AND DISORDERS",1,Minor,Minor,Surgical,Medicare,Medicare,,,,N,180097.83,26313.01
Long Island,Nassau,2908000,000511,NYU Langone Hospital-Long Island,70 or Older,110,F,White,Not Span/Hispanic,9,Emergency,Skilled Nursing Home,2020,DIG007,GASTRITIS AND DUODENITIS,MST020,SUBCUTANEOUS TISSUE AND FASCIA EXCISION,951,MODERATELY EXTENSIVE PROCEDURE UNRELATED TO PRINCIPAL DIAGNOSIS,06,DISEASES AND DISORDERS OF THE DIGESTIVE SYSTEM,3,Major,Minor,Surgical,Medicare,,,,,Y,191489.22,39901.88
Long Island,Nassau,2908000,000511,NYU Langone Hospital-Long Island,70 or Older,115,F,White,Not Span/Hispanic,9,Emergency,Home or Self Care,2020,DIG025,OTHER SPECIFIED AND UNSPECIFIED GASTROINTESTINAL DISORDERS,GIS016,GI SYSTEM ENDOSCOPIC THERAPEUTIC PROCEDURES,951,MODERATELY EXTENSIVE PROCEDURE UNRELATED TO PRINCIPAL DIAGNOSIS,06,DISEASES AND DISORDERS OF THE DIGESTIVE SYSTEM,2,Moderate,Major,Surgical,Medicare,,,,,Y,233404.44,51164.48
Long Island,Nassau,2908000,000511,NYU Langone Hospital-Long Island,70 or Older,115,M,White,Not Span/Hispanic,6,Emergency,Home w/ Home Health Services,2020,BLD006,COAGULATION AND HEMORRHAGIC DISORDERS,MST030,"MUSCULOSKELETAL PROCEDURES, NEC",951,MODERATELY EXTENSIVE PROCEDURE UNRELATED TO PRINCIPAL DIAGNOSIS,16,DISEASES AND DISORDERS OF THE BLOOD AND BLOOD FORMING ORGANS AND IMMUNOLOGICAL DISORDERS,3,Major,Major,Surgical,Medicare,Private Health Insurance,,,,Y,144967,31983.38
Long Island,Nassau,2908000,000511,NYU Langone Hospital-Long Island,30 to 49,116,F,Other Race,Spanish/Hispanic,5,Elective,Home w/ Home Health Services,2020,CIR028,GANGRENE,MST018,BONE EXCISION,951,MODERATELY EXTENSIVE PROCEDURE UNRELATED TO PRINCIPAL DIAGNOSIS,05,DISEASES AND DISORDERS OF THE CIRCULATORY SYSTEM,3,Major,Moderate,Surgical,Medicare,Medicaid,,,,N,155080.63,33823.43
Long Island,Nassau,2908000,000511,NYU Langone Hospital-Long Island,0 to 17,117,M,White,Not Span/Hispanic,2,Elective,Home or Self Care,2020,NEO073,BENIGN NEOPLASMS,MST017,JOINT TISSUE EXCISION (EXCLUDING DISCECTOMY),951,MODERATELY EXTENSIVE PROCEDURE UNRELATED TO PRINCIPAL DIAGNOSIS,05,DISEASES AND DISORDERS OF THE CIRCULATORY SYSTEM,1,Minor,Minor,Surgical,Blue Cross/Blue Shield,,,,,N,60072.89,12610.11
Long Island,Nassau,2908000,000511,NYU Langone Hospital-Long Island,50 to 69,115,M,White,Spanish/Hispanic,11,Emergency,Home w/ Home Health Services,2020,NVS009,EPILEPSY; CONVULSIONS,ESA001,HEMODIALYSIS,951,MODERATELY EXTENSIVE PROCEDURE UNRELATED TO PRINCIPAL DIAGNOSIS,01,DISEASES AND DISORDERS OF THE NERVOUS SYSTEM,3,Major,Major,Surgical,Medicaid,,,,,Y,259858.4,67445.19
Long Island,Nassau,2908000,000511,NYU Langone Hospital-Long Island,70 or Older,113,F,Other Race,Not Span/Hispanic,5,Elective,Home w/ Home Health Services,2020,GEN003,CHRONIC KIDNEY DISEASE,CAR006,CAROTID ENDARTERECTOMY AND STENTING,951,MODERATELY EXTENSIVE PROCEDURE UNRELATED TO PRINCIPAL DIAGNOSIS,11,DISEASES AND DISORDERS OF THE KIDNEY AND URINARY TRACT,3,Major,Major,Surgical,Medicare,,,,,N,123515.02,31013.92
Long Island,Nassau,2908000,000511,NYU Langone Hospital-Long Island,50 to 69,115,F,Black/African American,Not Span/Hispanic,10,Emergency,Home or Self Care,2020,INJ037,"COMPLICATION OF OTHER SURGICAL OR MEDICAL CARE, INJURY, INITIAL ENCOUNTER",GIS024,OTHER PERITONEAL CAVITY PROCEDURES,951,MODERATELY EXTENSIVE PROCEDURE UNRELATED TO PRINCIPAL DIAGNOSIS,11,DISEASES AND DISORDERS OF THE KIDNEY AND URINARY TRACT,4,Extreme,Extreme,Surgical,Medicare,Blue Cross/Blue Shield,,,,Y,206712.78,62773.98
Long Island,Nassau,2908000,000511,NYU Langone Hospital-Long Island,70 or Older,115,F,White,Not Span/Hispanic,12,Emergency,Skilled Nursing Home,2020,GEN002,ACUTE AND UNSPECIFIED RENAL FAILURE,MST018,BONE EXCISION,951,MODERATELY EXTENSIVE PROCEDURE UNRELATED TO PRINCIPAL DIAGNOSIS,11,DISEASES AND DISORDERS OF THE KIDNEY AND URINARY TRACT,3,Major,Major,Surgical,Medicare,Medicare,,,,Y,192601.54,46701.74
Long Island,Nassau,2908000,000511,NYU Langone Hospital-Long Island,50 to 69,115,F,Black/African American,Not Span/Hispanic,39,Emergency,Skilled Nursing Home,2020,RSP009,ASTHMA,MST004,INCISION AND DRAINAGE OF MUSCULOSKELETAL TISSUE AND JOINTS,951,MODERATELY EXTENSIVE PROCEDURE UNRELATED TO PRINCIPAL DIAGNOSIS,04,DISEASES AND DISORDERS OF THE RESPIRATORY SYSTEM,3,Major,Major,Surgical,Medicaid,,,,,Y,659159.37,166400.41
Long Island,Nassau,2908000,000511,NYU Langone Hospital-Long Island,70 or Older,115,F,White,Not Span/Hispanic,1,Urgent,Expired,2020,CIR017,CARDIAC DYSRHYTHMIAS,SKB007,SKIN GRAFT,951,MODERATELY EXTENSIVE PROCEDURE UNRELATED TO PRINCIPAL DIAGNOSIS,05,DISEASES AND DISORDERS OF THE CIRCULATORY SYSTEM,3,Major,Major,Surgical,Medicare,Blue Cross/Blue Shield,,,,N,55034.81,8885.94
Long Island,Nassau,2908000,000511,NYU Langone Hospital-Long Island,70 or Older,110,M,White,Not Span/Hispanic,2,Emergency,Home or Self Care,2020,RSP002,PNEUMONIA (EXCEPT THAT CAUSED BY TUBERCULOSIS),SKB007,SKIN GRAFT,951,MODERATELY EXTENSIVE PROCEDURE UNRELATED TO PRINCIPAL DIAGNOSIS,04,DISEASES AND DISORDERS OF THE RESPIRATORY SYSTEM,2,Moderate,Minor,Surgical,Medicare,Private Health Insurance,,,,Y,40579.65,9361.68
Long Island,Nassau,2908000,000511,NYU Langone Hospital-Long Island,70 or Older,117,M,White,Not Span/Hispanic,1,Emergency,Expired,2020,CIR030,AORTIC AND PERIPHERAL ARTERIAL EMBOLISM OR THROMBOSIS,GIS005,EXPLORATION OF PERITONEAL CAVITY,951,MODERATELY EXTENSIVE PROCEDURE UNRELATED TO PRINCIPAL DIAGNOSIS,05,DISEASES AND DISORDERS OF THE CIRCULATORY SYSTEM,4,Extreme,Extreme,Surgical,Medicare,Private Health Insurance,,,,Y,82650.21,13110.6
Long Island,Nassau,2908000,000511,NYU Langone Hospital-Long Island,70 or Older,114,F,Other Race,Not Span/Hispanic,17,Emergency,Expired,2020,INF012,CORONAVIRUS DISEASE 2019 (COVID-19),CAR029,"CARDIOVASCULAR DEVICE PROCEDURES, NEC",951,MODERATELY EXTENSIVE PROCEDURE UNRELATED TO PRINCIPAL DIAGNOSIS,04,DISEASES AND DISORDERS OF THE RESPIRATORY SYSTEM,4,Extreme,Extreme,Surgical,Medicare,Medicare,,,,Y,439399.97,105303.94
Long Island,Nassau,2908000,000511,NYU Langone Hospital-Long Island,30 to 49,115,F,Other Race,Spanish/Hispanic,2,Emergency,Home or Self Care,2020,NEO024,SARCOMA,MST020,SUBCUTANEOUS TISSUE AND FASCIA EXCISION,951,MODERATELY EXTENSIVE PROCEDURE UNRELATED TO PRINCIPAL DIAGNOSIS,08,DISEASES AND DISORDERS OF THE MUSCULOSKELETAL SYSTEM AND CONNECTIVE TISSUE,1,Minor,Minor,Surgical,Medicaid,,,,,Y,77521.6,15166.69
Long Island,Nassau,2908000,000511,NYU Langone Hospital-Long Island,70 or Older,115,F,White,Not Span/Hispanic,17,Emergency,Home or Self Care,2020,RSP002,PNEUMONIA (EXCEPT THAT CAUSED BY TUBERCULOSIS),MST020,SUBCUTANEOUS TISSUE AND FASCIA EXCISION,951,MODERATELY EXTENSIVE PROCEDURE UNRELATED TO PRINCIPAL DIAGNOSIS,04,DISEASES AND DISORDERS OF THE RESPIRATORY SYSTEM,3,Major,Major,Surgical,Medicare,Medicare,,,,Y,203980.56,59323.48
Long Island,Nassau,2908000,000511,NYU Langone Hospital-Long Island,70 or Older,115,F,White,Not Span/Hispanic,1,Trauma,Home w/ Home Health Services,2020,BLD006,COAGULATION AND HEMORRHAGIC DISORDERS,MST022,"TENDON, MUSCLE, BURSA, AND LIGAMENT REPAIR (EXCLUDING PERINEAL)",951,MODERATELY EXTENSIVE PROCEDURE UNRELATED TO PRINCIPAL DIAGNOSIS,16,DISEASES AND DISORDERS OF THE BLOOD AND BLOOD FORMING ORGANS AND IMMUNOLOGICAL DISORDERS,2,Moderate,Moderate,Surgical,Medicare,Medicare,,,,Y,81267.54,12754.87
Long Island,Nassau,2908000,000511,NYU Langone Hospital-Long Island,50 to 69,117,F,White,Not Span/Hispanic,4,Emergency,Home or Self Care,2020,INF012,CORONAVIRUS DISEASE 2019 (COVID-19),CAR008,ANGIOPLASTY AND RELATED VESSEL PROCEDURES (ENDOVASCULAR; EXCLUDING CAROTID),951,MODERATELY EXTENSIVE PROCEDURE UNRELATED TO PRINCIPAL DIAGNOSIS,04,DISEASES AND DISORDERS OF THE RESPIRATORY SYSTEM,4,Extreme,Major,Surgical,Private Health Insurance,,,,,Y,165659.59,31501.06
Long Island,Nassau,2908000,000511,NYU Langone Hospital-Long Island,50 to 69,114,M,Other Race,Spanish/Hispanic,6,Emergency,Home or Self Care,2020,NVS020,OTHER SPECIFIED NERVOUS SYSTEM DISORDERS,RES006,OPEN AND THORACOSCOPIC PLEURAL DRAINAGE,951,MODERATELY EXTENSIVE PROCEDURE UNRELATED TO PRINCIPAL DIAGNOSIS,01,DISEASES AND DISORDERS OF THE NERVOUS SYSTEM,3,Major,Extreme,Surgical,Medicare,,,,,Y,121718.41,30465.44
Long Island,Nassau,2908000,000511,NYU Langone Hospital-Long Island,50 to 69,115,F,White,Not Span/Hispanic,1,Elective,Home or Self Care,2020,MUS009,TENDON AND SYNOVIAL DISORDERS,PNS005,PERIPHERAL NERVE DENERVATION,951,MODERATELY EXTENSIVE PROCEDURE UNRELATED TO PRINCIPAL DIAGNOSIS,08,DISEASES AND DISORDERS OF THE MUSCULOSKELETAL SYSTEM AND CONNECTIVE TISSUE,1,Minor,Minor,Surgical,Private Health Insurance,Medicare,,,,N,155146.58,25740.62
Long Island,Nassau,2908000,000511,NYU Langone Hospital-Long Island,70 or Older,113,F,Black/African American,Not Span/Hispanic,8,Emergency,Home w/ Home Health Services,2020,END003,DIABETES MELLITUS WITH COMPLICATION,CAR004,PERCUTANEOUS CORONARY INTERVENTIONS (PCI),951,MODERATELY EXTENSIVE PROCEDURE UNRELATED TO PRINCIPAL DIAGNOSIS,10,"ENDOCRINE, NUTRITIONAL AND METABOLIC DISEASES AND DISORDERS",3,Major,Extreme,Surgical,Medicare,Medicare,Medicaid,,,Y,344506.95,84513.16
Long Island,Nassau,2908000,000511,NYU Langone Hospital-Long Island,0 to 17,117,M,White,Not Span/Hispanic,3,Emergency,Home or Self Care,2020,NEO072,NEOPLASMS OF UNSPECIFIED NATURE OR UNCERTAIN BEHAVIOR,ENT008,NASAL AND SINUS EXCISION,951,MODERATELY EXTENSIVE PROCEDURE UNRELATED TO PRINCIPAL DIAGNOSIS,04,DISEASES AND DISORDERS OF THE RESPIRATORY SYSTEM,3,Major,Moderate,Surgical,Private Health Insurance,,,,,Y,187278.73,19096.81
Long Island,Nassau,2908000,000511,NYU Langone Hospital-Long Island,50 to 69,110,M,White,Not Span/Hispanic,7,Emergency,Home w/ Home Health Services,2020,GEN002,ACUTE AND UNSPECIFIED RENAL FAILURE,CAR025,PLACEMENT OF TUNNELED OR IMPLANTABLE PORTION OF A VASCULAR ACCESS DEVICE,951,MODERATELY EXTENSIVE PROCEDURE UNRELATED TO PRINCIPAL DIAGNOSIS,11,DISEASES AND DISORDERS OF THE KIDNEY AND URINARY TRACT,3,Major,Major,Surgical,Blue Cross/Blue Shield,,,,,Y,305819.88,84031.06
Long Island,Nassau,2908000,000511,NYU Langone Hospital-Long Island,50 to 69,112,M,White,Not Span/Hispanic,2,Elective,Home or Self Care,2020,MUS011,SPONDYLOPATHIES/SPONDYLOARTHROPATHY (INCLUDING INFECTIVE),CAR004,PERCUTANEOUS CORONARY INTERVENTIONS (PCI),951,MODERATELY EXTENSIVE PROCEDURE UNRELATED TO PRINCIPAL DIAGNOSIS,08,DISEASES AND DISORDERS OF THE MUSCULOSKELETAL SYSTEM AND CONNECTIVE TISSUE,2,Moderate,Minor,Surgical,Miscellaneous/Other,,,,,N,195857.09,32783.99
Long Island,Nassau,2908000,000511,NYU Langone Hospital-Long Island,50 to 69,112,F,White,Not Span/Hispanic,13,Emergency,Skilled Nursing Home,2020,CIR036,POSTTHROMBOTIC SYNDROME AND VENOUS INSUFFICIENCY/HYPERTENSION,MST020,SUBCUTANEOUS TISSUE AND FASCIA EXCISION,951,MODERATELY EXTENSIVE PROCEDURE UNRELATED TO PRINCIPAL DIAGNOSIS,05,DISEASES AND DISORDERS OF THE CIRCULATORY SYSTEM,4,Extreme,Major,Surgical,Medicare,,,,,Y,219204.33,66523.51
Long Island,Nassau,2908000,000511,NYU Langone Hospital-Long Island,50 to 69,115,F,White,Not Span/Hispanic,40,Emergency,Skilled Nursing Home,2020,CIR019,HEART FAILURE,MST018,BONE EXCISION,951,MODERATELY EXTENSIVE PROCEDURE UNRELATED TO PRINCIPAL DIAGNOSIS,05,DISEASES AND DISORDERS OF THE CIRCULATORY SYSTEM,4,Extreme,Extreme,Surgical,Blue Cross/Blue Shield,Medicare,,,,Y,672237.62,231298.24
Long Island,Nassau,2908000,000511,NYU Langone Hospital-Long Island,70 or Older,110,F,White,Not Span/Hispanic,8,Emergency,Home w/ Home Health Services,2020,RSP010,ASPIRATION PNEUMONITIS,GIS017,GASTROSTOMY,951,MODERATELY EXTENSIVE PROCEDURE UNRELATED TO PRINCIPAL DIAGNOSIS,04,DISEASES AND DISORDERS OF THE RESPIRATORY SYSTEM,3,Major,Major,Surgical,Medicare,Medicare,,,,Y,140385.55,43001.76
Long Island,Nassau,2908000,000511,NYU Langone Hospital-Long Island,50 to 69,115,M,White,Not Span/Hispanic,6,Emergency,Home or Self Care,2020,DIG024,POSTPROCEDURAL OR POSTOPERATIVE DIGESTIVE SYSTEM COMPLICATION,HEP006,CHOLECYSTECTOMY,951,MODERATELY EXTENSIVE PROCEDURE UNRELATED TO PRINCIPAL DIAGNOSIS,06,DISEASES AND DISORDERS OF THE DIGESTIVE SYSTEM,3,Major,Minor,Surgical,Medicare,Blue Cross/Blue Shield,,,,Y,215702.55,46223.81
Long Island,Nassau,2908000,000511,NYU Langone Hospital-Long Island,50 to 69,117,M,White,Not Span/Hispanic,7,Emergency,Home or Self Care,2020,END003,DIABETES MELLITUS WITH COMPLICATION,MST028,"SUBCUTANEOUS TISSUE AND FASCIA PROCEDURES, NEC",951,MODERATELY EXTENSIVE PROCEDURE UNRELATED TO PRINCIPAL DIAGNOSIS,05,DISEASES AND DISORDERS OF THE CIRCULATORY SYSTEM,3,Major,Major,Surgical,Blue Cross/Blue Shield,,,,,Y,252743.16,53521.37
Long Island,Nassau,2908000,000511,NYU Langone Hospital-Long Island,30 to 49,115,F,White,Not Span/Hispanic,2,Elective,Home or Self Care,2020,INF012,CORONAVIRUS DISEASE 2019 (COVID-19),PGN003,CESAREAN SECTION,951,MODERATELY EXTENSIVE PROCEDURE UNRELATED TO PRINCIPAL DIAGNOSIS,04,DISEASES AND DISORDERS OF THE RESPIRATORY SYSTEM,2,Moderate,Minor,Surgical,Self-Pay,,,,,N,53322.15,14385.66
Long Island,Nassau,2908000,000511,NYU Langone Hospital-Long Island,50 to 69,115,F,Black/African American,Not Span/Hispanic,1,Elective,Home or Self Care,2020,END003,DIABETES MELLITUS WITH COMPLICATION,GIS021,GI SYSTEM REPAIR (EXCLUDING ANORECTAL),951,MODERATELY EXTENSIVE PROCEDURE UNRELATED TO PRINCIPAL DIAGNOSIS,01,DISEASES AND DISORDERS OF THE NERVOUS SYSTEM,2,Moderate,Moderate,Surgical,Medicare,Medicaid,,,,N,142276.19,22522.6
Long Island,Nassau,2908000,000511,NYU Langone Hospital-Long Island,70 or Older,115,F,White,Not Span/Hispanic,4,Emergency,Home w/ Home Health Services,2020,CIR019,HEART FAILURE,RES002,"LUNG, PLEURA, OR DIAPHRAGM BIOPSY (NON-ENDOSCOPIC)",951,MODERATELY EXTENSIVE PROCEDURE UNRELATED TO PRINCIPAL DIAGNOSIS,05,DISEASES AND DISORDERS OF THE CIRCULATORY SYSTEM,2,Moderate,Major,Surgical,Medicare,Blue Cross/Blue Shield,,,,Y,98299.96,25324.2
Long Island,Nassau,2908000,000511,NYU Langone Hospital-Long Island,50 to 69,110,M,White,Not Span/Hispanic,3,Emergency,Home w/ Home Health Services,2020,RSP008,CHRONIC OBSTRUCTIVE PULMONARY DISEASE AND BRONCHIECTASIS,CAR004,PERCUTANEOUS CORONARY INTERVENTIONS (PCI),951,MODERATELY EXTENSIVE PROCEDURE UNRELATED TO PRINCIPAL DIAGNOSIS,04,DISEASES AND DISORDERS OF THE RESPIRATORY SYSTEM,3,Major,Major,Surgical,Medicare,,,,,Y,170925.43,36274.08
Long Island,Nassau,2908000,000511,NYU Langone Hospital-Long Island,50 to 69,110,M,White,Not Span/Hispanic,3,Emergency,Home or Self Care,2020,CIR013,ACUTE PULMONARY EMBOLISM,CAR028,INFERIOR VENA CAVA (IVC) FILTER PROCEDURES,951,MODERATELY EXTENSIVE PROCEDURE UNRELATED TO PRINCIPAL DIAGNOSIS,04,DISEASES AND DISORDERS OF THE RESPIRATORY SYSTEM,3,Major,Major,Surgical,Blue Cross/Blue Shield,Blue Cross/Blue Shield,,,,Y,248718.91,45157.34
Long Island,Nassau,2908000,000511,NYU Langone Hospital-Long Island,70 or Older,110,F,White,Not Span/Hispanic,9,Emergency,Skilled Nursing Home,2020,CIR020,CEREBRAL INFARCTION,MST009,FIXATION OF UPPER EXTREMITY BONES,951,MODERATELY EXTENSIVE PROCEDURE UNRELATED TO PRINCIPAL DIAGNOSIS,01,DISEASES AND DISORDERS OF THE NERVOUS SYSTEM,2,Moderate,Moderate,Surgical,Medicare,,,,,Y,237472.03,59962.26
Long Island,Nassau,2908000,000511,NYU Langone Hospital-Long Island,30 to 49,115,M,Other Race,Not Span/Hispanic,3,Trauma,Home w/ Home Health Services,2020,INJ010,"INTERNAL ORGAN INJURY, INITIAL ENCOUNTER",MST009,FIXATION OF UPPER EXTREMITY BONES,951,MODERATELY EXTENSIVE PROCEDURE UNRELATED TO PRINCIPAL DIAGNOSIS,04,DISEASES AND DISORDERS OF THE RESPIRATORY SYSTEM,2,Moderate,Minor,Surgical,Private Health Insurance,,,,,Y,171860.64,32642.39
Long Island,Nassau,2908000,000511,NYU Langone Hospital-Long Island,70 or Older,110,M,White,Not Span/Hispanic,7,Emergency,Skilled Nursing Home,2020,INJ004,"FRACTURE OF THE UPPER LIMB, INITIAL ENCOUNTER",CAR026,PACEMAKER AND DEFIBRILLATOR PROCEDURES,951,MODERATELY EXTENSIVE PROCEDURE UNRELATED TO PRINCIPAL DIAGNOSIS,08,DISEASES AND DISORDERS OF THE MUSCULOSKELETAL SYSTEM AND CONNECTIVE TISSUE,3,Major,Major,Surgical,Medicare,Blue Cross/Blue Shield,,,,Y,235702.4,51941.33
Long Island,Nassau,2908000,000511,NYU Langone Hospital-Long Island,70 or Older,110,F,White,Not Span/Hispanic,5,Trauma,Skilled Nursing Home,2020,INJ016,"INJURY TO BLOOD VESSELS, INITIAL ENCOUNTER",GNR005,CONTROL OF BLEEDING (NON-ENDOSCOPIC),951,MODERATELY EXTENSIVE PROCEDURE UNRELATED TO PRINCIPAL DIAGNOSIS,01,DISEASES AND DISORDERS OF THE NERVOUS SYSTEM,3,Major,Moderate,Surgical,Medicare,,,,,Y,147729.98,38954.12
Long Island,Nassau,2908000,000511,NYU Langone Hospital-Long Island,50 to 69,115,F,White,Not Span/Hispanic,4,Emergency,Home w/ Home Health Services,2020,END003,DIABETES MELLITUS WITH COMPLICATION,MST002,BONE AND JOINT BIOPSY,951,MODERATELY EXTENSIVE PROCEDURE UNRELATED TO PRINCIPAL DIAGNOSIS,09,"DISEASES AND DISORDERS OF THE SKIN, SUBCUTANEOUS TISSUE AND BREAST",2,Moderate,Moderate,Surgical,Medicare,Medicare,,,,Y,82753.74,22575.71
Long Island,Nassau,2908000,000511,NYU Langone Hospital-Long Island,50 to 69,115,M,White,Not Span/Hispanic,4,Elective,Home w/ Home Health Services,2020,CIR035,VARICOSE VEINS OF LOWER EXTREMITY,MST020,SUBCUTANEOUS TISSUE AND FASCIA EXCISION,951,MODERATELY EXTENSIVE PROCEDURE UNRELATED TO PRINCIPAL DIAGNOSIS,05,DISEASES AND DISORDERS OF THE CIRCULATORY SYSTEM,2,Moderate,Minor,Surgical,Blue Cross/Blue Shield,Medicare,,,,N,114806.25,27785.21