Hospital Service Area,Hospital County,Operating Certificate Number,Permanent Facility Id,Facility Name,Age Group,Zip Code - 3 digits,Gender,Race,Ethnicity,Length of Stay,Type of Admission,Patient Disposition,Discharge Year,CCS Diagnosis Code,CCS Diagnosis Description,CCS Procedure Code,CCS Procedure Description,APR DRG Code,APR DRG Description,APR MDC Code,APR MDC Description,APR Severity of Illness Code,APR Severity of Illness Description,APR Risk of Mortality,APR Medical Surgical Description,Payment Typology 1,Payment Typology 2,Payment Typology 3,Birth Weight,Abortion Edit Indicator,Emergency Department Indicator,Total Charges,Total Costs
Capital/Adirond,Schenectady,4601001,000829,Ellis Hospital,70 or Older,123,F,White,Not Span/Hispanic,8,Emergency,Home w/ Home Health Services,2018,NEO022,RESPIRATORY CANCERS,LYM001,LYMPH NODE BIOPSY,952,NONEXTENSIVE PROCEDURE UNRELATED TO PRINCIPAL DIAGNOSIS,04,DISEASES AND DISORDERS OF THE RESPIRATORY SYSTEM,4,Extreme,Extreme,Surgical,Medicare,Medicare,,,,true,53256.78,18445.69
New York City,Manhattan,7002054,001458,New York-Presbyterian Hospital - New York Weill Cornell Center,70 or Older,113,M,White,Not Span/Hispanic,4,Emergency,Home w/ Home Health Services,2018,CIR038,POSTPROCEDURAL OR POSTOPERATIVE CIRCULATORY SYSTEM COMPLICATION,MST028,"SUBCUTANEOUS TISSUE AND FASCIA PROCEDURES, NEC",952,NONEXTENSIVE PROCEDURE UNRELATED TO PRINCIPAL DIAGNOSIS,05,DISEASES AND DISORDERS OF THE CIRCULATORY SYSTEM,2,Moderate,Moderate,Surgical,Medicare,Private Health Insurance,Medicaid,,,false,66131.72,16459.27
Long Island,Nassau,2909000,000513,Mercy Hospital,70 or Older,117,M,White,Spanish/Hispanic,22,Urgent,Skilled Nursing Home,2018,INJ001,"FRACTURE OF HEAD AND NECK, INITIAL ENCOUNTER",MST022,"TENDON, MUSCLE, BURSA, AND LIGAMENT REPAIR (EXCLUDING PERINEAL)",952,NONEXTENSIVE PROCEDURE UNRELATED TO PRINCIPAL DIAGNOSIS,03,"DISEASES AND DISORDERS OF THE EAR, NOSE, MOUTH AND THROAT",3,Major,Moderate,Surgical,Medicare,Medicare,,,,false,168087.04,29337.43
Western NY,Erie,1401014,000207,Buffalo General Medical Center,70 or Older,142,M,White,Not Span/Hispanic,23,Emergency,Skilled Nursing Home,2018,RSP003,INFLUENZA,PNS001,LUMBOSACRAL NERVE DECOMPRESSION,952,NONEXTENSIVE PROCEDURE UNRELATED TO PRINCIPAL DIAGNOSIS,03,"DISEASES AND DISORDERS OF THE EAR, NOSE, MOUTH AND THROAT",4,Extreme,Extreme,Surgical,Medicare,Private Health Insurance,Self-Pay,,,true,131858.63,52208.39
Hudson Valley,Dutchess,1302001,000181,Vassar Brothers Medical Center,30 to 49,125,F,White,Not Span/Hispanic,12,Emergency,Home w/ Home Health Services,2018,RSP009,ASTHMA,GIS024,OTHER PERITONEAL CAVITY PROCEDURES,952,NONEXTENSIVE PROCEDURE UNRELATED TO PRINCIPAL DIAGNOSIS,04,DISEASES AND DISORDERS OF THE RESPIRATORY SYSTEM,3,Major,Major,Surgical,Medicare,,,,,true,169905.49,45559.96
New York City,Bronx,7000001,001178,BronxCare Hospital Center,50 to 69,104,M,Other Race,Spanish/Hispanic,4,Emergency,Home or Self Care,2018,NVS020,OTHER SPECIFIED NERVOUS SYSTEM DISORDERS,ENT013,ENT REPAIR,952,NONEXTENSIVE PROCEDURE UNRELATED TO PRINCIPAL DIAGNOSIS,01,DISEASES AND DISORDERS OF THE NERVOUS SYSTEM,2,Moderate,Minor,Surgical,Medicaid,,,,,true,16868.92,17857.15
Hudson Valley,Westchester,5902001,001045,White Plains Hospital Center,70 or Older,105,F,Other Race,Not Span/Hispanic,5,Emergency,Home w/ Home Health Services,2018,BLD006,COAGULATION AND HEMORRHAGIC DISORDERS,MST028,"SUBCUTANEOUS TISSUE AND FASCIA PROCEDURES, NEC",952,NONEXTENSIVE PROCEDURE UNRELATED TO PRINCIPAL DIAGNOSIS,16,DISEASES AND DISORDERS OF THE BLOOD AND BLOOD FORMING ORGANS AND IMMUNOLOGICAL DISORDERS,3,Major,Moderate,Surgical,Medicare,Private Health Insurance,,,,true,48578,12829.81
New York City,Queens,7003004,001638,Long Island Jewish Forest Hills,70 or Older,114,F,White,Not Span/Hispanic,6,Emergency,Home or Self Care,2018,CIR013,ACUTE PULMONARY EMBOLISM,CAR028,INFERIOR VENA CAVA (IVC) FILTER PROCEDURES,952,NONEXTENSIVE PROCEDURE UNRELATED TO PRINCIPAL DIAGNOSIS,04,DISEASES AND DISORDERS OF THE RESPIRATORY SYSTEM,2,Moderate,Minor,Surgical,Medicare,Blue Cross/Blue Shield,,,,true,109371.05,24670.19
New York City,Bronx,7000008,001172,Lincoln Medical & Mental Health Center,0 to 17,104,M,Other Race,Not Span/Hispanic,1,Emergency,Home or Self Care,2018,INJ003,"FRACTURE OF TORSO, INITIAL ENCOUNTER",GIS005,EXPLORATION OF PERITONEAL CAVITY,952,NONEXTENSIVE PROCEDURE UNRELATED TO PRINCIPAL DIAGNOSIS,08,DISEASES AND DISORDERS OF THE MUSCULOSKELETAL SYSTEM AND CONNECTIVE TISSUE,1,Minor,Minor,Surgical,Medicaid,Medicaid,,,,true,9823.75,5801.48
Western NY,Erie,1401014,000208,John R. Oishei Children's Hospital,0 to 17,142,F,Black/African American,Spanish/Hispanic,27,Emergency,Home or Self Care,2018,RSP012,RESPIRATORY FAILURE; INSUFFICIENCY; ARREST,ESA003,MECHANICAL VENTILATION,952,NONEXTENSIVE PROCEDURE UNRELATED TO PRINCIPAL DIAGNOSIS,04,DISEASES AND DISORDERS OF THE RESPIRATORY SYSTEM,4,Extreme,Major,Surgical,Medicaid,Self-Pay,,,,true,144042.34,75319.85
New York City,Bronx,7000006,001169,Montefiore Medical Center - Henry & Lucy Moses Div,18 to 29,107,F,White,Not Span/Hispanic,2,Emergency,Home or Self Care,2018,PRG028,OTHER SPECIFIED COMPLICATIONS IN PREGNANCY,GIS008,APPENDECTOMY,952,NONEXTENSIVE PROCEDURE UNRELATED TO PRINCIPAL DIAGNOSIS,14,"PREGNANCY, CHILDBIRTH AND THE PUERPERIUM",2,Moderate,Minor,Surgical,Blue Cross/Blue Shield,,,,,true,36054.93,6604.66
Long Island,Suffolk,5154001,000925,Good Samaritan Hospital Medical Center,70 or Older,117,M,White,Not Span/Hispanic,6,Elective,Home w/ Home Health Services,2018,CIR019,HEART FAILURE,GNR002,ABDOMINAL WALL REPAIR (INCLUDING HERNIA),952,NONEXTENSIVE PROCEDURE UNRELATED TO PRINCIPAL DIAGNOSIS,05,DISEASES AND DISORDERS OF THE CIRCULATORY SYSTEM,3,Major,Extreme,Surgical,Medicare,Private Health Insurance,,,,false,115756.04,24961.45
New York City,Manhattan,7002054,001464,New York-Presbyterian Hospital - Columbia Presbyterian Center,50 to 69,113,M,Other Race,Not Span/Hispanic,6,Emergency,Home or Self Care,2018,END003,DIABETES MELLITUS WITH COMPLICATION,MST017,JOINT TISSUE EXCISION (EXCLUDING DISCECTOMY),952,NONEXTENSIVE PROCEDURE UNRELATED TO PRINCIPAL DIAGNOSIS,09,"DISEASES AND DISORDERS OF THE SKIN, SUBCUTANEOUS TISSUE AND BREAST",3,Major,Major,Surgical,Private Health Insurance,Self-Pay,,,,false,79122.37,19250.15
New York City,Manhattan,7002054,001464,New York-Presbyterian Hospital - Columbia Presbyterian Center,70 or Older,100,M,Other Race,Not Span/Hispanic,2,Emergency,Home or Self Care,2018,CIR031,HYPOTENSION,MST028,"SUBCUTANEOUS TISSUE AND FASCIA PROCEDURES, NEC",952,NONEXTENSIVE PROCEDURE UNRELATED TO PRINCIPAL DIAGNOSIS,05,DISEASES AND DISORDERS OF THE CIRCULATORY SYSTEM,3,Major,Major,Surgical,Medicare,Medicare,Medicaid,,,false,27763.77,6339.41
Central NY,Onondaga,3301003,000630,St. Joseph's Hospital Health Center,30 to 49,130,M,White,Not Span/Hispanic,4,Emergency,Home or Self Care,2018,SKN001,SKIN AND SUBCUTANEOUS TISSUE INFECTIONS,MST020,SUBCUTANEOUS TISSUE AND FASCIA EXCISION,952,NONEXTENSIVE PROCEDURE UNRELATED TO PRINCIPAL DIAGNOSIS,09,"DISEASES AND DISORDERS OF THE SKIN, SUBCUTANEOUS TISSUE AND BREAST",3,Major,Minor,Surgical,Blue Cross/Blue Shield,,,,,true,24685.75,10139.34
New York City,Manhattan,7002024,001456,Mount Sinai Hospital,18 to 29,109,F,White,Unknown,2,Elective,Home or Self Care,2018,PRG028,OTHER SPECIFIED COMPLICATIONS IN PREGNANCY,GIS008,APPENDECTOMY,952,NONEXTENSIVE PROCEDURE UNRELATED TO PRINCIPAL DIAGNOSIS,14,"PREGNANCY, CHILDBIRTH AND THE PUERPERIUM",2,Moderate,Minor,Surgical,Medicaid,Medicaid,Self-Pay,,,false,32446.15,9258.66
New York City,Manhattan,7002017,001450,Lenox Hill Hospital,70 or Older,100,M,Other Race,Not Span/Hispanic,2,Emergency,Home or Self Care,2018,CIR017,CARDIAC DYSRHYTHMIAS,GNR003,INGUINAL AND FEMORAL HERNIA REPAIR,952,NONEXTENSIVE PROCEDURE UNRELATED TO PRINCIPAL DIAGNOSIS,05,DISEASES AND DISORDERS OF THE CIRCULATORY SYSTEM,1,Minor,Moderate,Surgical,Medicare,,,,,true,32562.94,6566.33
New York City,Manhattan,7002017,001450,Lenox Hill Hospital,30 to 49,109,F,White,Not Span/Hispanic,1,Emergency,Home or Self Care,2018,PRG028,OTHER SPECIFIED COMPLICATIONS IN PREGNANCY,GIS008,APPENDECTOMY,952,NONEXTENSIVE PROCEDURE UNRELATED TO PRINCIPAL DIAGNOSIS,14,"PREGNANCY, CHILDBIRTH AND THE PUERPERIUM",2,Moderate,Minor,Surgical,Medicaid,Medicaid,,,,true,37885.04,10547.95
Southern Tier,Broome,0301001,000043,Our Lady of Lourdes Memorial Hospital,70 or Older,138,M,White,Not Span/Hispanic,5,Urgent,Home or Self Care,2018,END003,DIABETES MELLITUS WITH COMPLICATION,MST014,JOINT FUSION (EXCLUDING SPINE),952,NONEXTENSIVE PROCEDURE UNRELATED TO PRINCIPAL DIAGNOSIS,05,DISEASES AND DISORDERS OF THE CIRCULATORY SYSTEM,3,Major,Major,Surgical,Medicare,Self-Pay,Self-Pay,,,false,22405.79,7550.83
Long Island,Nassau,2951001,000541,North Shore University Hospital,70 or Older,110,F,White,Not Span/Hispanic,2,Emergency,Home w/ Home Health Services,2018,INJ003,"FRACTURE OF TORSO, INITIAL ENCOUNTER",MST020,SUBCUTANEOUS TISSUE AND FASCIA EXCISION,952,NONEXTENSIVE PROCEDURE UNRELATED TO PRINCIPAL DIAGNOSIS,04,DISEASES AND DISORDERS OF THE RESPIRATORY SYSTEM,2,Moderate,Minor,Surgical,Medicare,Private Health Insurance,,,,true,32463.67,5989.37
New York City,Queens,7003004,001630,Long Island Jewish Medical Center,70 or Older,117,M,White,Not Span/Hispanic,1,Urgent,Home or Self Care,2018,GEN005,CALCULUS OF URINARY TRACT,MRS004,PROSTATE AND SEMINAL VESICLE PROCEDURES (EXCLUDING PROSTATECTOMY),952,NONEXTENSIVE PROCEDURE UNRELATED TO PRINCIPAL DIAGNOSIS,11,DISEASES AND DISORDERS OF THE KIDNEY AND URINARY TRACT,2,Moderate,Minor,Surgical,Blue Cross/Blue Shield,Self-Pay,,,,false,27664.5,6280.53
New York City,Richmond,7004003,001740,Staten Island University Hosp-North,30 to 49,103,F,Other Race,Not Span/Hispanic,16,Emergency,Home w/ Home Health Services,2018,GEN006,OTHER SPECIFIED AND UNSPECIFIED DISEASES OF KIDNEY AND URETERS,ENP001,ENDOCRINE SYSTEM BIOPSY,952,NONEXTENSIVE PROCEDURE UNRELATED TO PRINCIPAL DIAGNOSIS,11,DISEASES AND DISORDERS OF THE KIDNEY AND URINARY TRACT,3,Major,Moderate,Surgical,Medicaid,Medicaid,,,,true,126814.04,34400.53
New York City,Kings,7001008,001293,"New York Community Hospital of Brooklyn, Inc",50 to 69,112,M,White,Not Span/Hispanic,7,Emergency,Inpatient Rehabilitation Facility,2018,GEN007,OTHER SPECIFIED AND UNSPECIFIED DISEASES OF BLADDER AND URETHRA,URN003,URETER AND OTHER URINARY TRACT DILATION,952,NONEXTENSIVE PROCEDURE UNRELATED TO PRINCIPAL DIAGNOSIS,11,DISEASES AND DISORDERS OF THE KIDNEY AND URINARY TRACT,3,Major,Moderate,Surgical,Medicare,Medicare,Self-Pay,,,true,38219.07,21447.24
Long Island,Suffolk,5154000,000924,South Shore University Hospital,50 to 69,117,M,White,Not Span/Hispanic,5,Emergency,Home or Self Care,2018,SKN001,SKIN AND SUBCUTANEOUS TISSUE INFECTIONS,MST004,INCISION AND DRAINAGE OF MUSCULOSKELETAL TISSUE AND JOINTS,952,NONEXTENSIVE PROCEDURE UNRELATED TO PRINCIPAL DIAGNOSIS,09,"DISEASES AND DISORDERS OF THE SKIN, SUBCUTANEOUS TISSUE AND BREAST",2,Moderate,Minor,Surgical,Medicaid,Medicaid,,,,true,52809.37,13757.32
New York City,Kings,7001046,001309,Interfaith Medical Center,70 or Older,112,F,Black/African American,Not Span/Hispanic,22,Emergency,Short-term Hospital,2018,RSP008,CHRONIC OBSTRUCTIVE PULMONARY DISEASE AND BRONCHIECTASIS,CAR024,VENOUS AND ARTERIAL CATHETER PLACEMENT,952,NONEXTENSIVE PROCEDURE UNRELATED TO PRINCIPAL DIAGNOSIS,04,DISEASES AND DISORDERS OF THE RESPIRATORY SYSTEM,4,Extreme,Extreme,Surgical,Medicare,Medicare,,,,false,195783.94,76948.7
Capital/Adirond,Albany,0101000,000001,Albany Medical Center Hospital,30 to 49,121,M,White,Not Span/Hispanic,1,Urgent,Home or Self Care,2018,NEO072,NEOPLASMS OF UNSPECIFIED NATURE OR UNCERTAIN BEHAVIOR,MRS007,"MALE REPRODUCTIVE SYSTEM PROCEDURES, NEC",952,NONEXTENSIVE PROCEDURE UNRELATED TO PRINCIPAL DIAGNOSIS,11,DISEASES AND DISORDERS OF THE KIDNEY AND URINARY TRACT,2,Moderate,Minor,Surgical,"Managed Care, Unspecified",,,,,false,18323.92,6472.45
Western NY,Niagara,3102000,000574,Niagara Falls Memorial Medical Center,50 to 69,143,M,White,Not Span/Hispanic,20,Emergency,Home or Self Care,2018,GEN004,URINARY TRACT INFECTIONS,MRS003,PROSTATECTOMY,952,NONEXTENSIVE PROCEDURE UNRELATED TO PRINCIPAL DIAGNOSIS,11,DISEASES AND DISORDERS OF THE KIDNEY AND URINARY TRACT,3,Major,Moderate,Surgical,Medicare,Medicaid,Medicaid,,,true,47178.85,22158.03
New York City,Bronx,7000006,003058,Montefiore Med Center - Jack D Weiler Hosp of A Einstein College Div,70 or Older,104,M,Other Race,Unknown,2,Emergency,Home or Self Care,2018,GEN007,OTHER SPECIFIED AND UNSPECIFIED DISEASES OF BLADDER AND URETHRA,MRS004,PROSTATE AND SEMINAL VESICLE PROCEDURES (EXCLUDING PROSTATECTOMY),952,NONEXTENSIVE PROCEDURE UNRELATED TO PRINCIPAL DIAGNOSIS,11,DISEASES AND DISORDERS OF THE KIDNEY AND URINARY TRACT,1,Minor,Moderate,Surgical,Medicare,Private Health Insurance,,,,false,37085.15,7460.27
New York City,Manhattan,7002053,001463,NYU Langone Hospitals,30 to 49,OOS,F,Black/African American,Not Span/Hispanic,1,Elective,Home or Self Care,2018,RSP015,MEDIASTINAL DISORDERS,GNR007,"MEDIASTINAL PROCEDURES, NEC",952,NONEXTENSIVE PROCEDURE UNRELATED TO PRINCIPAL DIAGNOSIS,04,DISEASES AND DISORDERS OF THE RESPIRATORY SYSTEM,2,Moderate,Minor,Surgical,Private Health Insurance,,,,,false,139609.97,22324.76
Western NY,Erie,1401014,000208,John R. Oishei Children's Hospital,0 to 17,142,F,Black/African American,Not Span/Hispanic,1,Elective,Home or Self Care,2018,RSP017,POSTPROCEDURAL OR POSTOPERATIVE RESPIRATORY SYSTEM COMPLICATION,ENT013,ENT REPAIR,952,NONEXTENSIVE PROCEDURE UNRELATED TO PRINCIPAL DIAGNOSIS,04,DISEASES AND DISORDERS OF THE RESPIRATORY SYSTEM,2,Moderate,Minor,Surgical,Private Health Insurance,Self-Pay,,,,false,15738.33,5970.01
New York City,Queens,7003004,001638,Long Island Jewish Forest Hills,70 or Older,114,M,Black/African American,Not Span/Hispanic,1,Urgent,Home or Self Care,2018,NVS016,SLEEP WAKE DISORDERS,GNR002,ABDOMINAL WALL REPAIR (INCLUDING HERNIA),952,NONEXTENSIVE PROCEDURE UNRELATED TO PRINCIPAL DIAGNOSIS,03,"DISEASES AND DISORDERS OF THE EAR, NOSE, MOUTH AND THROAT",3,Major,Moderate,Surgical,Medicare,Medicare,,,,false,32418.28,7755.3
New York City,Kings,7001020,001305,Maimonides Medical Center,70 or Older,112,F,White,Not Span/Hispanic,3,Emergency,Skilled Nursing Home,2018,INJ008,"TRAUMATIC BRAIN INJURY (TBI); CONCUSSION, INITIAL ENCOUNTER",MST028,"SUBCUTANEOUS TISSUE AND FASCIA PROCEDURES, NEC",952,NONEXTENSIVE PROCEDURE UNRELATED TO PRINCIPAL DIAGNOSIS,01,DISEASES AND DISORDERS OF THE NERVOUS SYSTEM,2,Moderate,Moderate,Surgical,Medicare,Medicaid,Self-Pay,,,false,23355.04,6254.37
Hudson Valley,Westchester,5907001,001097,SJRH - St Johns Division,50 to 69,107,F,White,Not Span/Hispanic,15,Emergency,Skilled Nursing Home,2018,NEO015,GASTROINTESTINAL CANCERS - COLORECTAL,CAR010,LIGATION AND EMBOLIZATION OF VESSELS,952,NONEXTENSIVE PROCEDURE UNRELATED TO PRINCIPAL DIAGNOSIS,06,DISEASES AND DISORDERS OF THE DIGESTIVE SYSTEM,3,Major,Major,Surgical,Medicare,Blue Cross/Blue Shield,,,,true,141273.14,45210.02
Capital/Adirond,Albany,0101000,000001,Albany Medical Center Hospital,70 or Older,128,F,White,Not Span/Hispanic,19,Emergency,Home or Self Care,2018,RSP008,CHRONIC OBSTRUCTIVE PULMONARY DISEASE AND BRONCHIECTASIS,RES001,BRONCHOSCOPY (DIAGNOSTIC),952,NONEXTENSIVE PROCEDURE UNRELATED TO PRINCIPAL DIAGNOSIS,04,DISEASES AND DISORDERS OF THE RESPIRATORY SYSTEM,3,Major,Moderate,Surgical,Medicare,Medicaid,,,,true,125686.62,35505.21
Hudson Valley,Orange,3523000,000699,Garnet Health Medical Center,70 or Older,109,M,White,Not Span/Hispanic,7,Elective,Skilled Nursing Home,2018,END003,DIABETES MELLITUS WITH COMPLICATION,MST026,FINGER AND OTHER UPPER EXTREMITY AMPUTATION,952,NONEXTENSIVE PROCEDURE UNRELATED TO PRINCIPAL DIAGNOSIS,10,"ENDOCRINE, NUTRITIONAL AND METABOLIC DISEASES AND DISORDERS",3,Major,Moderate,Surgical,Medicaid,,,,,false,52980.17,16208.16
Long Island,Nassau,2952006,000551,St. Joseph Hospital,70 or Older,117,M,White,Not Span/Hispanic,2,Elective,Home w/ Home Health Services,2018,CIR008,HYPERTENSION WITH COMPLICATIONS AND SECONDARY HYPERTENSION,URN009,CYSTECTOMY (INCLUDING FULGURATION) AND URETHRECTOMY,952,NONEXTENSIVE PROCEDURE UNRELATED TO PRINCIPAL DIAGNOSIS,05,DISEASES AND DISORDERS OF THE CIRCULATORY SYSTEM,2,Moderate,Moderate,Surgical,Medicare,Medicare,,,,false,31726.55,8757.86
Capital/Adirond,Schenectady,4601001,000829,Ellis Hospital,50 to 69,120,F,White,Not Span/Hispanic,9,Urgent,Home or Self Care,2018,DIG007,GASTRITIS AND DUODENITIS,GIS001,ESOPHAGOGASTRODUODENOSCOPY (EGD) WITH BIOPSY,952,NONEXTENSIVE PROCEDURE UNRELATED TO PRINCIPAL DIAGNOSIS,06,DISEASES AND DISORDERS OF THE DIGESTIVE SYSTEM,4,Extreme,Extreme,Surgical,Medicaid,Medicaid,,,,false,88111.7,32889.76
Hudson Valley,Dutchess,1327000,000192,Northern Dutchess Hospital,50 to 69,124,M,Other Race,Not Span/Hispanic,7,Emergency,Skilled Nursing Home,2018,SKN001,SKIN AND SUBCUTANEOUS TISSUE INFECTIONS,MST003,"SUBCUTANEOUS TISSUE, FASCIA, AND MUSCLE BIOPSY",952,NONEXTENSIVE PROCEDURE UNRELATED TO PRINCIPAL DIAGNOSIS,09,"DISEASES AND DISORDERS OF THE SKIN, SUBCUTANEOUS TISSUE AND BREAST",2,Moderate,Moderate,Surgical,Blue Cross/Blue Shield,,,,,true,49209.69,13570.53
New York City,Queens,7003004,001630,Long Island Jewish Medical Center,30 to 49,114,F,Other Race,Not Span/Hispanic,120 +,Emergency,Home w/ Home Health Services,2018,END009,OBESITY,GIS017,GASTROSTOMY,952,NONEXTENSIVE PROCEDURE UNRELATED TO PRINCIPAL DIAGNOSIS,04,DISEASES AND DISORDERS OF THE RESPIRATORY SYSTEM,3,Major,Major,Surgical,Medicaid,Self-Pay,,,,true,7146406.7,3041593.57
New York City,Manhattan,7002054,001458,New York-Presbyterian Hospital - New York Weill Cornell Center,50 to 69,112,F,Black/African American,Not Span/Hispanic,15,Emergency,Skilled Nursing Home,2018,RSP003,INFLUENZA,LYM001,LYMPH NODE BIOPSY,952,NONEXTENSIVE PROCEDURE UNRELATED TO PRINCIPAL DIAGNOSIS,03,"DISEASES AND DISORDERS OF THE EAR, NOSE, MOUTH AND THROAT",3,Major,Moderate,Surgical,Medicare,Medicaid,Self-Pay,,,true,204620.44,50807.99
New York City,Kings,7001045,001692,Woodhull Medical & Mental Health Center,50 to 69,112,F,Black/African American,Not Span/Hispanic,34,Emergency,Short-term Hospital,2018,END003,DIABETES MELLITUS WITH COMPLICATION,FRS015,"FEMALE REPRODUCTIVE SYSTEM PROCEDURES, NEC",952,NONEXTENSIVE PROCEDURE UNRELATED TO PRINCIPAL DIAGNOSIS,10,"ENDOCRINE, NUTRITIONAL AND METABOLIC DISEASES AND DISORDERS",4,Extreme,Moderate,Surgical,Blue Cross/Blue Shield,,,,,false,179213.81,139927.1
Western NY,Erie,1401005,000210,Erie County Medical Center,70 or Older,140,M,White,Not Span/Hispanic,13,Emergency,Home w/ Home Health Services,2018,RSP011,"PLEURISY, PLEURAL EFFUSION AND PULMONARY COLLAPSE",MRS004,PROSTATE AND SEMINAL VESICLE PROCEDURES (EXCLUDING PROSTATECTOMY),952,NONEXTENSIVE PROCEDURE UNRELATED TO PRINCIPAL DIAGNOSIS,05,DISEASES AND DISORDERS OF THE CIRCULATORY SYSTEM,3,Major,Major,Surgical,Medicare,Medicare,,,,true,35986.62,24671.17
Central NY,Oneida,3202003,000599,Faxton-St Lukes Healthcare St Lukes Division,30 to 49,135,F,Other Race,Not Span/Hispanic,5,Emergency,Home or Self Care,2018,BLD001,NUTRITIONAL ANEMIA,FRS015,"FEMALE REPRODUCTIVE SYSTEM PROCEDURES, NEC",952,NONEXTENSIVE PROCEDURE UNRELATED TO PRINCIPAL DIAGNOSIS,16,DISEASES AND DISORDERS OF THE BLOOD AND BLOOD FORMING ORGANS AND IMMUNOLOGICAL DISORDERS,1,Minor,Minor,Surgical,Medicaid,,,,,true,37035.36,8544.32
Long Island,Suffolk,5149000,000895,John T Mather Memorial Hospital of Port Jefferson New York Inc,70 or Older,117,M,White,Not Span/Hispanic,3,Emergency,Home or Self Care,2018,CIR012,NONSPECIFIC CHEST PAIN,CAR020,SAPHENOUS VEIN HARVEST AND OTHER THERAPEUTIC VESSEL REMOVAL,952,NONEXTENSIVE PROCEDURE UNRELATED TO PRINCIPAL DIAGNOSIS,05,DISEASES AND DISORDERS OF THE CIRCULATORY SYSTEM,1,Minor,Minor,Surgical,Medicare,Medicare,Blue Cross/Blue Shield,,,true,45705.35,12247.78
New York City,Kings,7002002,001324,Mount Sinai Brooklyn,30 to 49,112,F,Black/African American,Not Span/Hispanic,1,Emergency,Home or Self Care,2018,INJ034,"COMPLICATION OF GENITOURINARY DEVICE, IMPLANT OR GRAFT, INITIAL ENCOUNTER",FRS015,"FEMALE REPRODUCTIVE SYSTEM PROCEDURES, NEC",952,NONEXTENSIVE PROCEDURE UNRELATED TO PRINCIPAL DIAGNOSIS,11,DISEASES AND DISORDERS OF THE KIDNEY AND URINARY TRACT,2,Moderate,Minor,Surgical,Blue Cross/Blue Shield,Self-Pay,,,,true,24587.26,5497.56
Long Island,Suffolk,5154001,000925,Good Samaritan Hospital Medical Center,18 to 29,117,M,White,Not Span/Hispanic,1,Emergency,Home or Self Care,2018,NVS009,EPILEPSY; CONVULSIONS,ENT013,ENT REPAIR,952,NONEXTENSIVE PROCEDURE UNRELATED TO PRINCIPAL DIAGNOSIS,01,DISEASES AND DISORDERS OF THE NERVOUS SYSTEM,2,Moderate,Moderate,Surgical,Self-Pay,,,,,true,34348,6055.07
New York City,Queens,7003004,001630,Long Island Jewish Medical Center,50 to 69,114,F,Other Race,Not Span/Hispanic,7,Emergency,Home or Self Care,2018,DIG001,INTESTINAL INFECTION,FRS015,"FEMALE REPRODUCTIVE SYSTEM PROCEDURES, NEC",952,NONEXTENSIVE PROCEDURE UNRELATED TO PRINCIPAL DIAGNOSIS,06,DISEASES AND DISORDERS OF THE DIGESTIVE SYSTEM,3,Major,Moderate,Surgical,Medicaid,Medicaid,Self-Pay,,,true,87904.76,15386.48
Hudson Valley,Westchester,5922000,001122,New York - Presbyterian Hospital,70 or Older,107,M,White,Not Span/Hispanic,11,Emergency,Home w/ Home Health Services,2018,CIR033,ACUTE PHLEBITIS; THROMBOPHLEBITIS AND THROMBOEMBOLISM,MRS004,PROSTATE AND SEMINAL VESICLE PROCEDURES (EXCLUDING PROSTATECTOMY),952,NONEXTENSIVE PROCEDURE UNRELATED TO PRINCIPAL DIAGNOSIS,05,DISEASES AND DISORDERS OF THE CIRCULATORY SYSTEM,4,Extreme,Extreme,Surgical,Medicare,Federal/State/Local/VA,,,,true,132797.91,59659.33
Long Island,Suffolk,5149001,000896,St. Charles Hospital,18 to 29,117,F,White,Not Span/Hispanic,2,Emergency,Home or Self Care,2018,PRG028,OTHER SPECIFIED COMPLICATIONS IN PREGNANCY,GIS008,APPENDECTOMY,952,NONEXTENSIVE PROCEDURE UNRELATED TO PRINCIPAL DIAGNOSIS,14,"PREGNANCY, CHILDBIRTH AND THE PUERPERIUM",1,Minor,Minor,Surgical,Private Health Insurance,,,,,true,40170.48,8579.55
New York City,Kings,7001008,001293,"New York Community Hospital of Brooklyn, Inc",70 or Older,112,M,White,Not Span/Hispanic,1,Emergency,Home or Self Care,2018,GEN005,CALCULUS OF URINARY TRACT,URN004,REMOVAL OF CALCULI AND OTHER MATTER FROM URINARY TRACT,952,NONEXTENSIVE PROCEDURE UNRELATED TO PRINCIPAL DIAGNOSIS,11,DISEASES AND DISORDERS OF THE KIDNEY AND URINARY TRACT,2,Moderate,Minor,Surgical,Medicare,Medicaid,Self-Pay,,,false,9105.84,7404.31
Hudson Valley,Westchester,5903001,001061,Montefiore Mount Vernon Hospital,50 to 69,105,F,Black/African American,Not Span/Hispanic,3,Emergency,Home or Self Care,2018,BLD003,APLASTIC ANEMIA,ADM001,TRANSFUSION OF BLOOD AND BLOOD PRODUCTS,952,NONEXTENSIVE PROCEDURE UNRELATED TO PRINCIPAL DIAGNOSIS,16,DISEASES AND DISORDERS OF THE BLOOD AND BLOOD FORMING ORGANS AND IMMUNOLOGICAL DISORDERS,2,Moderate,Moderate,Surgical,Medicare,Medicare,Self-Pay,,,false,46916,17945.61
New York City,Kings,7001045,001692,Woodhull Medical & Mental Health Center,50 to 69,112,F,Black/African American,Not Span/Hispanic,3,Emergency,Home or Self Care,2018,NVS012,TRANSIENT CEREBRAL ISCHEMIA,FRS015,"FEMALE REPRODUCTIVE SYSTEM PROCEDURES, NEC",952,NONEXTENSIVE PROCEDURE UNRELATED TO PRINCIPAL DIAGNOSIS,01,DISEASES AND DISORDERS OF THE NERVOUS SYSTEM,2,Moderate,Minor,Surgical,Medicare,Medicare,Blue Cross/Blue Shield,,,true,29287.05,22866.83
Hudson Valley,Westchester,5902001,001045,White Plains Hospital Center,50 to 69,125,M,Black/African American,Not Span/Hispanic,2,Elective,Home or Self Care,2018,NEO022,RESPIRATORY CANCERS,RES008,"LUNG, PLEURA, OR DIAPHRAGM RESECTION (OPEN AND THORACOSCOPIC)",952,NONEXTENSIVE PROCEDURE UNRELATED TO PRINCIPAL DIAGNOSIS,04,DISEASES AND DISORDERS OF THE RESPIRATORY SYSTEM,1,Minor,Minor,Surgical,Blue Cross/Blue Shield,,,,,false,57218,11378.71