Hospital Service Area,Hospital County,Operating Certificate Number,Permanent Facility Id,Facility Name,Age Group,Zip Code - 3 digits,Gender,Race,Ethnicity,Length of Stay,Type of Admission,Patient Disposition,Discharge Year,CCS Diagnosis Code,CCS Diagnosis Description,CCS Procedure Code,CCS Procedure Description,APR DRG Code,APR DRG Description,APR MDC Code,APR MDC Description,APR Severity of Illness Code,APR Severity of Illness Description,APR Risk of Mortality,APR Medical Surgical Description,Payment Typology 1,Payment Typology 2,Payment Typology 3,Birth Weight,Abortion Edit Indicator,Emergency Department Indicator,Total Charges,Total Costs
New York City,Bronx,7000006,001169,Montefiore Medical Center - Henry & Lucy Moses Div,0 to 17,104,M,Other Race,Spanish/Hispanic,1,Elective,Home or Self Care,2017,124,Acute and chronic tonsillitis,030,TONSIL-/ADENOID-ECTOMY,097,Tonsil & adenoid procedures,03,"Ear, Nose, Mouth, Throat and Craniofacial Diseases and Disorders",2,Moderate,Minor,Surgical,Medicaid,,,,N,N,22636.34,5786.18
New York City,Bronx,7000006,001169,Montefiore Medical Center - Henry & Lucy Moses Div,0 to 17,104,F,Black/African American,Not Span/Hispanic,1,Emergency,Home or Self Care,2017,124,Acute and chronic tonsillitis,030,TONSIL-/ADENOID-ECTOMY,097,Tonsil & adenoid procedures,03,"Ear, Nose, Mouth, Throat and Craniofacial Diseases and Disorders",1,Minor,Minor,Surgical,Private Health Insurance,,,,N,N,20365.51,4438.60
New York City,Bronx,7000006,003058,Montefiore Med Center - Jack D Weiler Hosp of A Einstein College Div,18 to 29,109,F,Other Race,Not Span/Hispanic,1,Emergency,Home or Self Care,2017,124,Acute and chronic tonsillitis,030,TONSIL-/ADENOID-ECTOMY,097,Tonsil & adenoid procedures,03,"Ear, Nose, Mouth, Throat and Craniofacial Diseases and Disorders",2,Moderate,Minor,Surgical,Medicaid,,,,N,N,31630.43,8233.67
New York City,Kings,7001033,001315,Kingsbrook Jewish Medical Center,50 to 69,112,F,Black/African American,Not Span/Hispanic,3,Emergency,Home or Self Care,2017,124,Acute and chronic tonsillitis,033,OTHER OR THER PRCS NOSE,097,Tonsil & adenoid procedures,03,"Ear, Nose, Mouth, Throat and Craniofacial Diseases and Disorders",1,Minor,Minor,Surgical,Blue Cross/Blue Shield,Self-Pay,,,N,Y,24726.00,6798.38
New York City,Bronx,7000006,001169,Montefiore Medical Center - Henry & Lucy Moses Div,0 to 17,104,F,Other Race,Not Span/Hispanic,1,Elective,Home or Self Care,2017,124,Acute and chronic tonsillitis,030,TONSIL-/ADENOID-ECTOMY,097,Tonsil & adenoid procedures,03,"Ear, Nose, Mouth, Throat and Craniofacial Diseases and Disorders",2,Moderate,Minor,Surgical,Medicaid,,,,N,N,21755.09,5527.20
New York City,Bronx,7000006,001169,Montefiore Medical Center - Henry & Lucy Moses Div,0 to 17,104,F,Other Race,Spanish/Hispanic,1,Emergency,Home or Self Care,2017,259,Residual codes; unclassified,030,TONSIL-/ADENOID-ECTOMY,097,Tonsil & adenoid procedures,03,"Ear, Nose, Mouth, Throat and Craniofacial Diseases and Disorders",2,Moderate,Minor,Surgical,Medicaid,,,,N,N,30050.48,7167.23
New York City,Bronx,7000006,001169,Montefiore Medical Center - Henry & Lucy Moses Div,0 to 17,104,M,Other Race,Not Span/Hispanic,1,Elective,Home or Self Care,2017,124,Acute and chronic tonsillitis,030,TONSIL-/ADENOID-ECTOMY,097,Tonsil & adenoid procedures,03,"Ear, Nose, Mouth, Throat and Craniofacial Diseases and Disorders",1,Minor,Minor,Surgical,Medicaid,,,,N,N,21762.08,5424.25
New York City,Bronx,7000006,001169,Montefiore Medical Center - Henry & Lucy Moses Div,0 to 17,107,M,Other Race,Not Span/Hispanic,1,Elective,Home or Self Care,2017,259,Residual codes; unclassified,030,TONSIL-/ADENOID-ECTOMY,097,Tonsil & adenoid procedures,03,"Ear, Nose, Mouth, Throat and Craniofacial Diseases and Disorders",1,Minor,Minor,Surgical,Medicaid,,,,N,N,20157.74,5103.50
New York City,Bronx,7000006,001169,Montefiore Medical Center - Henry & Lucy Moses Div,18 to 29,104,F,Black/African American,Not Span/Hispanic,1,Emergency,Home or Self Care,2017,124,Acute and chronic tonsillitis,032,OT NON-OR THER PRC NOSE,097,Tonsil & adenoid procedures,03,"Ear, Nose, Mouth, Throat and Craniofacial Diseases and Disorders",2,Moderate,Minor,Surgical,Medicaid,,,,N,Y,15248.92,3536.67
New York City,Kings,7001037,001320,University Hospital of Brooklyn,18 to 29,112,F,Black/African American,Not Span/Hispanic,1,Elective,Home or Self Care,2017,124,Acute and chronic tonsillitis,030,TONSIL-/ADENOID-ECTOMY,097,Tonsil & adenoid procedures,03,"Ear, Nose, Mouth, Throat and Craniofacial Diseases and Disorders",1,Minor,Minor,Surgical,Blue Cross/Blue Shield,Medicare,Self-Pay,,N,N,38606.00,24186.87
New York City,Manhattan,7002024,001456,Mount Sinai Hospital,50 to 69,104,M,White,Not Span/Hispanic,2,Elective,Home or Self Care,2017,011,Cancer of head and neck,067,OT THER PRCS; HEM/LYMPH,097,Tonsil & adenoid procedures,03,"Ear, Nose, Mouth, Throat and Craniofacial Diseases and Disorders",2,Moderate,Minor,Surgical,Medicare,Private Health Insurance,Self-Pay,,N,N,44329.44,18812.22
Long Island,Nassau,2950002,000528,Nassau University Medical Center,0 to 17,115,F,White,Spanish/Hispanic,1,Elective,Home or Self Care,2017,259,Residual codes; unclassified,030,TONSIL-/ADENOID-ECTOMY,097,Tonsil & adenoid procedures,03,"Ear, Nose, Mouth, Throat and Craniofacial Diseases and Disorders",1,Minor,Minor,Surgical,Medicaid,Self-Pay,,,N,N,5769.21,4429.86
Long Island,Nassau,2950002,000528,Nassau University Medical Center,30 to 49,115,M,White,Spanish/Hispanic,2,Emergency,Home or Self Care,2017,124,Acute and chronic tonsillitis,033,OTHER OR THER PRCS NOSE,097,Tonsil & adenoid procedures,03,"Ear, Nose, Mouth, Throat and Craniofacial Diseases and Disorders",1,Minor,Minor,Surgical,Private Health Insurance,Self-Pay,,,N,N,22040.26,12999.00
Long Island,Nassau,2950002,000528,Nassau University Medical Center,0 to 17,117,M,White,Not Span/Hispanic,1,Emergency,Home or Self Care,2017,124,Acute and chronic tonsillitis,030,TONSIL-/ADENOID-ECTOMY,097,Tonsil & adenoid procedures,03,"Ear, Nose, Mouth, Throat and Craniofacial Diseases and Disorders",1,Minor,Minor,Surgical,Medicaid,Medicaid,Self-Pay,,N,N,5629.03,2048.10
New York City,Kings,7001021,001306,New York - Presbyterian Brooklyn Methodist Hospital,0 to 17,112,M,White,Not Span/Hispanic,1,Emergency,Home or Self Care,2017,124,Acute and chronic tonsillitis,030,TONSIL-/ADENOID-ECTOMY,097,Tonsil & adenoid procedures,03,"Ear, Nose, Mouth, Throat and Craniofacial Diseases and Disorders",1,Minor,Minor,Surgical,Medicaid,Medicaid,Self-Pay,,N,N,4611.08,2695.82
New York City,Kings,7001021,001306,New York - Presbyterian Brooklyn Methodist Hospital,0 to 17,112,M,Other Race,Not Span/Hispanic,1,Emergency,Home or Self Care,2017,259,Residual codes; unclassified,030,TONSIL-/ADENOID-ECTOMY,097,Tonsil & adenoid procedures,03,"Ear, Nose, Mouth, Throat and Craniofacial Diseases and Disorders",1,Minor,Minor,Surgical,Medicaid,Medicaid,Self-Pay,,N,N,14232.53,8514.50
New York City,Manhattan,7002054,001464,New York Presbyterian Hospital - Columbia Presbyterian Center,0 to 17,112,M,White,Not Span/Hispanic,1,Elective,Home or Self Care,2017,259,Residual codes; unclassified,033,OTHER OR THER PRCS NOSE,097,Tonsil & adenoid procedures,03,"Ear, Nose, Mouth, Throat and Craniofacial Diseases and Disorders",1,Minor,Minor,Surgical,Medicaid,Medicaid,Self-Pay,,N,N,33129.91,16740.31
New York City,Manhattan,7002054,001464,New York Presbyterian Hospital - Columbia Presbyterian Center,0 to 17,104,F,White,Spanish/Hispanic,1,Elective,Home or Self Care,2017,124,Acute and chronic tonsillitis,030,TONSIL-/ADENOID-ECTOMY,097,Tonsil & adenoid procedures,03,"Ear, Nose, Mouth, Throat and Craniofacial Diseases and Disorders",2,Moderate,Minor,Surgical,Medicaid,Medicaid,Self-Pay,,N,N,25778.66,14066.47
New York City,Manhattan,7002054,001464,New York Presbyterian Hospital - Columbia Presbyterian Center,0 to 17,100,M,Multi-racial,Not Span/Hispanic,4,Urgent,Home or Self Care,2017,137,Diseases of mouth; excluding dental,160,OT THER PRCS ON MUSCLES,097,Tonsil & adenoid procedures,03,"Ear, Nose, Mouth, Throat and Craniofacial Diseases and Disorders",1,Minor,Minor,Surgical,Medicaid,Medicaid,Self-Pay,,N,N,60986.49,22895.25
New York City,Manhattan,7002054,001464,New York Presbyterian Hospital - Columbia Presbyterian Center,0 to 17,104,M,Other Race,Not Span/Hispanic,1,Urgent,Home or Self Care,2017,124,Acute and chronic tonsillitis,030,TONSIL-/ADENOID-ECTOMY,097,Tonsil & adenoid procedures,03,"Ear, Nose, Mouth, Throat and Craniofacial Diseases and Disorders",1,Minor,Minor,Surgical,Blue Cross/Blue Shield,Self-Pay,,,N,N,21416.78,6738.63
Hudson Valley,Westchester,5907001,001097,SJRH - St Johns Division,18 to 29,107,M,White,Spanish/Hispanic,2,Emergency,Home or Self Care,2017,124,Acute and chronic tonsillitis,031,DX PRCS ON NOSE & MOUTH,097,Tonsil & adenoid procedures,03,"Ear, Nose, Mouth, Throat and Craniofacial Diseases and Disorders",1,Minor,Minor,Surgical,Private Health Insurance,Self-Pay,Self-Pay,,N,Y,11665.91,4210.22
New York City,Bronx,7000001,001178,Bronx-Lebanon Hospital Center - Concourse Division,0 to 17,104,F,Other Race,Unknown,2,Elective,Home or Self Care,2017,124,Acute and chronic tonsillitis,030,TONSIL-/ADENOID-ECTOMY,097,Tonsil & adenoid procedures,03,"Ear, Nose, Mouth, Throat and Craniofacial Diseases and Disorders",1,Minor,Minor,Surgical,Medicaid,Medicaid,,,N,N,10783.87,10007.11
New York City,Bronx,7000001,001178,Bronx-Lebanon Hospital Center - Concourse Division,18 to 29,104,M,Other Race,Spanish/Hispanic,1,Emergency,Home or Self Care,2017,124,Acute and chronic tonsillitis,032,OT NON-OR THER PRC NOSE,097,Tonsil & adenoid procedures,03,"Ear, Nose, Mouth, Throat and Craniofacial Diseases and Disorders",1,Minor,Minor,Surgical,Medicaid,Medicaid,,,N,Y,7077.64,6166.54
New York City,Bronx,7000001,001178,Bronx-Lebanon Hospital Center - Concourse Division,18 to 29,100,F,Black/African American,Not Span/Hispanic,3,Emergency,Home or Self Care,2017,124,Acute and chronic tonsillitis,033,OTHER OR THER PRCS NOSE,097,Tonsil & adenoid procedures,03,"Ear, Nose, Mouth, Throat and Craniofacial Diseases and Disorders",2,Moderate,Minor,Surgical,Medicaid,,,,N,Y,10189.67,10901.47
New York City,Kings,7002053,001304,NYU Langone Hospital-Brooklyn,30 to 49,112,F,White,Not Span/Hispanic,1,Emergency,Home or Self Care,2017,124,Acute and chronic tonsillitis,033,OTHER OR THER PRCS NOSE,097,Tonsil & adenoid procedures,03,"Ear, Nose, Mouth, Throat and Craniofacial Diseases and Disorders",1,Minor,Minor,Surgical,Medicare,,,,N,Y,23567.32,3937.69
New York City,Manhattan,7002002,001439,Mount Sinai Beth Israel,50 to 69,OOS,M,White,Not Span/Hispanic,3,Elective,Home or Self Care,2017,011,Cancer of head and neck,035,TRACHE-/LARYNG-OSCOPY,097,Tonsil & adenoid procedures,03,"Ear, Nose, Mouth, Throat and Craniofacial Diseases and Disorders",2,Moderate,Minor,Surgical,Private Health Insurance,Self-Pay,,,N,N,64158.94,19333.06
Western NY,Erie,1401014,000208,Women And Children's Hospital Of Buffalo,0 to 17,142,M,Black/African American,Not Span/Hispanic,2,Emergency,Home or Self Care,2017,124,Acute and chronic tonsillitis,030,TONSIL-/ADENOID-ECTOMY,097,Tonsil & adenoid procedures,03,"Ear, Nose, Mouth, Throat and Craniofacial Diseases and Disorders",1,Minor,Minor,Surgical,Self-Pay,,,,N,Y,18824.90,7337.78
Hudson Valley,Orange,3523000,000699,Orange Regional Medical Center,50 to 69,125,M,Other Race,Spanish/Hispanic,1,Emergency,Home or Self Care,2017,124,Acute and chronic tonsillitis,032,OT NON-OR THER PRC NOSE,097,Tonsil & adenoid procedures,03,"Ear, Nose, Mouth, Throat and Craniofacial Diseases and Disorders",2,Moderate,Minor,Surgical,Medicaid,,,,N,Y,12358.76,4598.50
New York City,Bronx,7000006,001169,Montefiore Medical Center - Henry & Lucy Moses Div,0 to 17,104,M,Other Race,Not Span/Hispanic,1,Elective,Home or Self Care,2017,124,Acute and chronic tonsillitis,030,TONSIL-/ADENOID-ECTOMY,097,Tonsil & adenoid procedures,03,"Ear, Nose, Mouth, Throat and Craniofacial Diseases and Disorders",1,Minor,Minor,Surgical,Private Health Insurance,,,,N,N,19158.73,4918.96
New York City,Bronx,7000006,001169,Montefiore Medical Center - Henry & Lucy Moses Div,0 to 17,104,M,Other Race,Spanish/Hispanic,1,Emergency,Home or Self Care,2017,124,Acute and chronic tonsillitis,030,TONSIL-/ADENOID-ECTOMY,097,Tonsil & adenoid procedures,03,"Ear, Nose, Mouth, Throat and Craniofacial Diseases and Disorders",1,Minor,Minor,Surgical,Medicaid,,,,N,N,21984.97,4865.85
New York City,Bronx,7000006,001169,Montefiore Medical Center - Henry & Lucy Moses Div,0 to 17,104,M,Black/African American,Not Span/Hispanic,1,Emergency,Home or Self Care,2017,124,Acute and chronic tonsillitis,030,TONSIL-/ADENOID-ECTOMY,097,Tonsil & adenoid procedures,03,"Ear, Nose, Mouth, Throat and Craniofacial Diseases and Disorders",1,Minor,Minor,Surgical,Medicaid,,,,N,N,23212.83,5671.01
New York City,Bronx,7000006,001169,Montefiore Medical Center - Henry & Lucy Moses Div,0 to 17,104,M,Black/African American,Not Span/Hispanic,3,Emergency,Home or Self Care,2017,124,Acute and chronic tonsillitis,030,TONSIL-/ADENOID-ECTOMY,097,Tonsil & adenoid procedures,03,"Ear, Nose, Mouth, Throat and Craniofacial Diseases and Disorders",1,Minor,Minor,Surgical,Medicaid,,,,N,N,41297.47,11199.70
New York City,Bronx,7000006,001169,Montefiore Medical Center - Henry & Lucy Moses Div,0 to 17,104,F,Other Race,Spanish/Hispanic,1,Elective,Home or Self Care,2017,124,Acute and chronic tonsillitis,030,TONSIL-/ADENOID-ECTOMY,097,Tonsil & adenoid procedures,03,"Ear, Nose, Mouth, Throat and Craniofacial Diseases and Disorders",1,Minor,Minor,Surgical,Medicaid,,,,N,N,18305.90,4690.68
New York City,Bronx,7000006,001169,Montefiore Medical Center - Henry & Lucy Moses Div,0 to 17,104,F,Black/African American,Not Span/Hispanic,1,Elective,Home or Self Care,2017,124,Acute and chronic tonsillitis,030,TONSIL-/ADENOID-ECTOMY,097,Tonsil & adenoid procedures,03,"Ear, Nose, Mouth, Throat and Craniofacial Diseases and Disorders",2,Moderate,Minor,Surgical,Medicaid,,,,N,N,24478.30,6040.65
New York City,Bronx,7000006,001169,Montefiore Medical Center - Henry & Lucy Moses Div,0 to 17,109,M,Other Race,Not Span/Hispanic,1,Emergency,Home or Self Care,2017,124,Acute and chronic tonsillitis,030,TONSIL-/ADENOID-ECTOMY,097,Tonsil & adenoid procedures,03,"Ear, Nose, Mouth, Throat and Craniofacial Diseases and Disorders",2,Moderate,Minor,Surgical,Medicaid,,,,N,N,25332.22,6343.69
New York City,Bronx,7000006,001169,Montefiore Medical Center - Henry & Lucy Moses Div,0 to 17,104,M,Other Race,Spanish/Hispanic,3,Elective,Home or Self Care,2017,259,Residual codes; unclassified,030,TONSIL-/ADENOID-ECTOMY,097,Tonsil & adenoid procedures,03,"Ear, Nose, Mouth, Throat and Craniofacial Diseases and Disorders",3,Major,Minor,Surgical,Medicaid,,,,N,N,51795.36,13154.27
New York City,Bronx,7000006,001169,Montefiore Medical Center - Henry & Lucy Moses Div,0 to 17,104,F,Black/African American,Not Span/Hispanic,1,Elective,Home or Self Care,2017,124,Acute and chronic tonsillitis,030,TONSIL-/ADENOID-ECTOMY,097,Tonsil & adenoid procedures,03,"Ear, Nose, Mouth, Throat and Craniofacial Diseases and Disorders",1,Minor,Minor,Surgical,Medicaid,,,,N,N,19953.59,4396.79
New York City,Bronx,7000006,001169,Montefiore Medical Center - Henry & Lucy Moses Div,0 to 17,104,F,Black/African American,Not Span/Hispanic,3,Emergency,Home or Self Care,2017,124,Acute and chronic tonsillitis,030,TONSIL-/ADENOID-ECTOMY,097,Tonsil & adenoid procedures,03,"Ear, Nose, Mouth, Throat and Craniofacial Diseases and Disorders",1,Minor,Minor,Surgical,Private Health Insurance,,,,N,N,36447.87,10056.10
New York City,Bronx,7000006,001169,Montefiore Medical Center - Henry & Lucy Moses Div,0 to 17,107,M,Other Race,Not Span/Hispanic,1,Emergency,Home or Self Care,2017,124,Acute and chronic tonsillitis,030,TONSIL-/ADENOID-ECTOMY,097,Tonsil & adenoid procedures,03,"Ear, Nose, Mouth, Throat and Craniofacial Diseases and Disorders",1,Minor,Minor,Surgical,Medicaid,,,,N,N,28386.62,6749.84
New York City,Bronx,7000006,001169,Montefiore Medical Center - Henry & Lucy Moses Div,0 to 17,104,M,Other Race,Spanish/Hispanic,1,Elective,Home or Self Care,2017,124,Acute and chronic tonsillitis,030,TONSIL-/ADENOID-ECTOMY,097,Tonsil & adenoid procedures,03,"Ear, Nose, Mouth, Throat and Craniofacial Diseases and Disorders",2,Moderate,Minor,Surgical,Medicaid,,,,N,N,29841.11,7028.00
New York City,Bronx,7000006,001169,Montefiore Medical Center - Henry & Lucy Moses Div,0 to 17,109,F,Other Race,Not Span/Hispanic,1,Elective,Home or Self Care,2017,124,Acute and chronic tonsillitis,030,TONSIL-/ADENOID-ECTOMY,097,Tonsil & adenoid procedures,03,"Ear, Nose, Mouth, Throat and Craniofacial Diseases and Disorders",1,Minor,Minor,Surgical,Blue Cross/Blue Shield,,,,N,N,20382.16,5153.18
New York City,Bronx,7000006,001169,Montefiore Medical Center - Henry & Lucy Moses Div,50 to 69,107,M,Other Race,Not Span/Hispanic,2,Elective,Home or Self Care,2017,011,Cancer of head and neck,067,OT THER PRCS; HEM/LYMPH,097,Tonsil & adenoid procedures,03,"Ear, Nose, Mouth, Throat and Craniofacial Diseases and Disorders",2,Moderate,Minor,Surgical,Medicaid,,,,N,N,68529.63,14936.70
New York City,Bronx,7000006,001169,Montefiore Medical Center - Henry & Lucy Moses Div,0 to 17,107,F,Other Race,Not Span/Hispanic,4,Emergency,Home w/ Home Health Services,2017,259,Residual codes; unclassified,030,TONSIL-/ADENOID-ECTOMY,097,Tonsil & adenoid procedures,03,"Ear, Nose, Mouth, Throat and Craniofacial Diseases and Disorders",4,Extreme,Minor,Surgical,Private Health Insurance,,,,N,N,52576.71,14111.43
New York City,Bronx,7000006,001169,Montefiore Medical Center - Henry & Lucy Moses Div,0 to 17,104,F,Other Race,Spanish/Hispanic,1,Elective,Home or Self Care,2017,259,Residual codes; unclassified,030,TONSIL-/ADENOID-ECTOMY,097,Tonsil & adenoid procedures,03,"Ear, Nose, Mouth, Throat and Craniofacial Diseases and Disorders",1,Minor,Minor,Surgical,Medicaid,,,,N,N,18508.51,4798.10
New York City,Bronx,7000006,001169,Montefiore Medical Center - Henry & Lucy Moses Div,0 to 17,104,M,Black/African American,Spanish/Hispanic,10,Emergency,Home or Self Care,2017,134,Other upper respiratory disease,030,TONSIL-/ADENOID-ECTOMY,097,Tonsil & adenoid procedures,03,"Ear, Nose, Mouth, Throat and Craniofacial Diseases and Disorders",3,Major,Moderate,Surgical,Medicaid,,,,N,Y,240480.89,50398.06
New York City,Bronx,7000006,003058,Montefiore Med Center - Jack D Weiler Hosp of A Einstein College Div,50 to 69,107,M,White,Not Span/Hispanic,3,Emergency,Home or Self Care,2017,259,Residual codes; unclassified,030,TONSIL-/ADENOID-ECTOMY,097,Tonsil & adenoid procedures,03,"Ear, Nose, Mouth, Throat and Craniofacial Diseases and Disorders",1,Minor,Minor,Surgical,Private Health Insurance,,,,N,N,77597.12,20515.89
New York City,Richmond,7004003,001740,Staten Island University Hosp-North,0 to 17,103,F,Other Race,Spanish/Hispanic,1,Elective,Home or Self Care,2017,259,Residual codes; unclassified,030,TONSIL-/ADENOID-ECTOMY,097,Tonsil & adenoid procedures,03,"Ear, Nose, Mouth, Throat and Craniofacial Diseases and Disorders",2,Moderate,Minor,Surgical,Medicaid,Medicaid,,,N,N,13517.48,8659.66
New York City,Richmond,7004003,001740,Staten Island University Hosp-North,30 to 49,103,M,Other Race,Spanish/Hispanic,8,Emergency,Home or Self Care,2017,124,Acute and chronic tonsillitis,030,TONSIL-/ADENOID-ECTOMY,097,Tonsil & adenoid procedures,03,"Ear, Nose, Mouth, Throat and Craniofacial Diseases and Disorders",2,Moderate,Minor,Surgical,Medicaid,,,,N,Y,62582.73,13854.74
Capital/Adirond,Schenectady,4601001,000829,Ellis Hospital,0 to 17,123,F,White,Not Span/Hispanic,2,Emergency,Home or Self Care,2017,134,Other upper respiratory disease,033,OTHER OR THER PRCS NOSE,097,Tonsil & adenoid procedures,03,"Ear, Nose, Mouth, Throat and Craniofacial Diseases and Disorders",2,Moderate,Minor,Surgical,Medicaid,,,,N,N,6000.35,1975.28
New York City,Bronx,7000002,001165,Jacobi Medical Center,0 to 17,104,M,Other Race,Spanish/Hispanic,1,Emergency,Home or Self Care,2017,259,Residual codes; unclassified,030,TONSIL-/ADENOID-ECTOMY,097,Tonsil & adenoid procedures,03,"Ear, Nose, Mouth, Throat and Craniofacial Diseases and Disorders",1,Minor,Minor,Surgical,Medicaid,Medicaid,,,N,N,11578.52,6836.87
New York City,Bronx,7000002,001165,Jacobi Medical Center,0 to 17,104,F,Black/African American,Not Span/Hispanic,1,Urgent,Home or Self Care,2017,259,Residual codes; unclassified,030,TONSIL-/ADENOID-ECTOMY,097,Tonsil & adenoid procedures,03,"Ear, Nose, Mouth, Throat and Craniofacial Diseases and Disorders",1,Minor,Minor,Surgical,Medicaid,Medicaid,,,N,N,11578.52,6836.87
New York City,Bronx,7000006,001169,Montefiore Medical Center - Henry & Lucy Moses Div,0 to 17,100,M,Other Race,Not Span/Hispanic,1,Emergency,Home or Self Care,2017,259,Residual codes; unclassified,033,OTHER OR THER PRCS NOSE,097,Tonsil & adenoid procedures,03,"Ear, Nose, Mouth, Throat and Craniofacial Diseases and Disorders",1,Minor,Minor,Surgical,Medicaid,,,,N,N,28668.38,7130.21
New York City,Bronx,7000006,001169,Montefiore Medical Center - Henry & Lucy Moses Div,0 to 17,109,F,White,Not Span/Hispanic,1,Emergency,Home or Self Care,2017,124,Acute and chronic tonsillitis,030,TONSIL-/ADENOID-ECTOMY,097,Tonsil & adenoid procedures,03,"Ear, Nose, Mouth, Throat and Craniofacial Diseases and Disorders",1,Minor,Minor,Surgical,Medicaid,,,,N,N,24055.87,5971.43
New York City,Bronx,7000006,001169,Montefiore Medical Center - Henry & Lucy Moses Div,0 to 17,104,F,Other Race,Spanish/Hispanic,2,Emergency,Home or Self Care,2017,124,Acute and chronic tonsillitis,030,TONSIL-/ADENOID-ECTOMY,097,Tonsil & adenoid procedures,03,"Ear, Nose, Mouth, Throat and Craniofacial Diseases and Disorders",1,Minor,Minor,Surgical,Medicaid,,,,N,Y,59787.04,12991.54
New York City,Kings,7001037,001320,University Hospital of Brooklyn,0 to 17,112,M,Black/African American,Not Span/Hispanic,1,Elective,Home or Self Care,2017,124,Acute and chronic tonsillitis,030,TONSIL-/ADENOID-ECTOMY,097,Tonsil & adenoid procedures,03,"Ear, Nose, Mouth, Throat and Craniofacial Diseases and Disorders",2,Moderate,Minor,Surgical,Federal/State/Local/VA,Private Health Insurance,Self-Pay,,N,N,19454.00,14639.38
New York City,Kings,7001037,001320,University Hospital of Brooklyn,0 to 17,112,F,Black/African American,Not Span/Hispanic,1,Elective,Home or Self Care,2017,259,Residual codes; unclassified,030,TONSIL-/ADENOID-ECTOMY,097,Tonsil & adenoid procedures,03,"Ear, Nose, Mouth, Throat and Craniofacial Diseases and Disorders",1,Minor,Minor,Surgical,Medicaid,Medicaid,Self-Pay,,N,N,12636.00,10648.82
New York City,Bronx,7000002,001165,Jacobi Medical Center,0 to 17,104,M,Other Race,Not Span/Hispanic,1,Emergency,Home or Self Care,2017,259,Residual codes; unclassified,030,TONSIL-/ADENOID-ECTOMY,097,Tonsil & adenoid procedures,03,"Ear, Nose, Mouth, Throat and Craniofacial Diseases and Disorders",1,Minor,Minor,Surgical,Medicaid,Medicaid,,,N,N,11578.52,6836.87
New York City,Bronx,7000002,001165,Jacobi Medical Center,50 to 69,104,M,Other Race,Spanish/Hispanic,1,Urgent,Home or Self Care,2017,259,Residual codes; unclassified,028,PLASTIC PRCS ON NOSE,097,Tonsil & adenoid procedures,03,"Ear, Nose, Mouth, Throat and Craniofacial Diseases and Disorders",1,Minor,Minor,Surgical,Private Health Insurance,,,,N,N,37427.87,22100.37
New York City,Kings,7001020,001305,Maimonides Medical Center,0 to 17,112,M,White,Not Span/Hispanic,1,Elective,Home or Self Care,2017,124,Acute and chronic tonsillitis,030,TONSIL-/ADENOID-ECTOMY,097,Tonsil & adenoid procedures,03,"Ear, Nose, Mouth, Throat and Craniofacial Diseases and Disorders",1,Minor,Minor,Surgical,Medicaid,,Self-Pay,,N,N,13415.00,4565.14
New York City,Kings,7001020,001305,Maimonides Medical Center,0 to 17,112,M,Other Race,Not Span/Hispanic,1,Elective,Home or Self Care,2017,124,Acute and chronic tonsillitis,030,TONSIL-/ADENOID-ECTOMY,097,Tonsil & adenoid procedures,03,"Ear, Nose, Mouth, Throat and Craniofacial Diseases and Disorders",1,Minor,Minor,Surgical,Medicaid,,Self-Pay,,N,N,18344.00,4324.52