Hospital Service Area,Hospital County,Operating Certificate Number,Permanent Facility Id,Facility Name,Age Group,Zip Code - 3 digits,Gender,Race,Ethnicity,Length of Stay,Type of Admission,Patient Disposition,Discharge Year,CCS Diagnosis Code,CCS Diagnosis Description,CCS Procedure Code,CCS Procedure Description,APR DRG Code,APR DRG Description,APR MDC Code,APR MDC Description,APR Severity of Illness Code,APR Severity of Illness Description,APR Risk of Mortality,APR Medical Surgical Description,Payment Typology 1,Payment Typology 2,Payment Typology 3,Birth Weight,Abortion Edit Indicator,Emergency Department Indicator,Total Charges,Total Costs
New York City,Bronx,7000006,001169,Montefiore Medical Center - Henry & Lucy Moses Div,50 to 69,104,F,Other Race,Spanish/Hispanic,1,Elective,Home or Self Care,2017,134,Other upper respiratory disease,028,PLASTIC PRCS ON NOSE,098,"Other ear, nose, mouth & throat procedures",03,"Ear, Nose, Mouth, Throat and Craniofacial Diseases and Disorders",2,Moderate,Minor,Surgical,Private Health Insurance,,,,N,N,70671.53,16867.21
New York City,Bronx,7000006,001169,Montefiore Medical Center - Henry & Lucy Moses Div,0 to 17,105,M,Other Race,Not Span/Hispanic,1,Emergency,Home or Self Care,2017,214,Digestive congenital anomalies,033,OTHER OR THER PRCS NOSE,098,"Other ear, nose, mouth & throat procedures",03,"Ear, Nose, Mouth, Throat and Craniofacial Diseases and Disorders",1,Minor,Minor,Surgical,Private Health Insurance,,,,N,N,23512.26,5866.89
New York City,Bronx,7000006,001169,Montefiore Medical Center - Henry & Lucy Moses Div,50 to 69,104,M,Other Race,Not Span/Hispanic,1,Elective,Home or Self Care,2017,134,Other upper respiratory disease,033,OTHER OR THER PRCS NOSE,098,"Other ear, nose, mouth & throat procedures",03,"Ear, Nose, Mouth, Throat and Craniofacial Diseases and Disorders",2,Moderate,Minor,Surgical,Medicare,,,,N,N,33520.66,7951.53
New York City,Bronx,7000006,001169,Montefiore Medical Center - Henry & Lucy Moses Div,70 or Older,104,F,White,Not Span/Hispanic,1,Emergency,Home or Self Care,2017,011,Cancer of head and neck,033,OTHER OR THER PRCS NOSE,098,"Other ear, nose, mouth & throat procedures",03,"Ear, Nose, Mouth, Throat and Craniofacial Diseases and Disorders",1,Minor,Minor,Surgical,Medicare,,,,N,N,26169.28,5462.77
New York City,Bronx,7000006,001169,Montefiore Medical Center - Henry & Lucy Moses Div,0 to 17,104,M,Black/African American,Not Span/Hispanic,1,Elective,Home or Self Care,2017,134,Other upper respiratory disease,033,OTHER OR THER PRCS NOSE,098,"Other ear, nose, mouth & throat procedures",03,"Ear, Nose, Mouth, Throat and Craniofacial Diseases and Disorders",2,Moderate,Minor,Surgical,Medicaid,,,,N,N,21157.72,4710.87
New York City,Bronx,7000006,001169,Montefiore Medical Center - Henry & Lucy Moses Div,0 to 17,104,M,Other Race,Spanish/Hispanic,4,Emergency,Home or Self Care,2017,092,Otitis media and related conditions,023,MYRINGOTOMY,098,"Other ear, nose, mouth & throat procedures",03,"Ear, Nose, Mouth, Throat and Craniofacial Diseases and Disorders",1,Minor,Minor,Surgical,Medicaid,,,,N,Y,58655.22,14051.30
New York City,Manhattan,7002002,001439,Mount Sinai Beth Israel,70 or Older,OOS,M,Other Race,Not Span/Hispanic,1,Elective,Home or Self Care,2017,137,Diseases of mouth; excluding dental,172,SKIN GRAFT,098,"Other ear, nose, mouth & throat procedures",03,"Ear, Nose, Mouth, Throat and Craniofacial Diseases and Disorders",1,Minor,Minor,Surgical,Medicare,Private Health Insurance,Self-Pay,,N,N,21282.18,7388.17
Hudson Valley,Orange,3523000,000699,Orange Regional Medical Center,0 to 17,,M,White,Not Span/Hispanic,2,Emergency,Home or Self Care,2017,136,Disorders of teeth and jaw,033,OTHER OR THER PRCS NOSE,098,"Other ear, nose, mouth & throat procedures",03,"Ear, Nose, Mouth, Throat and Craniofacial Diseases and Disorders",3,Major,Minor,Surgical,Medicaid,,,,N,Y,14539.11,4592.21
Hudson Valley,Orange,3523000,000699,Orange Regional Medical Center,50 to 69,125,M,Black/African American,Not Span/Hispanic,1,Urgent,Home or Self Care,2017,124,Acute and chronic tonsillitis,033,OTHER OR THER PRCS NOSE,098,"Other ear, nose, mouth & throat procedures",03,"Ear, Nose, Mouth, Throat and Craniofacial Diseases and Disorders",3,Major,Moderate,Surgical,Blue Cross/Blue Shield,,,,N,N,7783.65,4040.34
New York City,Bronx,7000006,001169,Montefiore Medical Center - Henry & Lucy Moses Div,50 to 69,125,F,Other Race,Not Span/Hispanic,1,Elective,Home or Self Care,2017,137,Diseases of mouth; excluding dental,033,OTHER OR THER PRCS NOSE,098,"Other ear, nose, mouth & throat procedures",03,"Ear, Nose, Mouth, Throat and Craniofacial Diseases and Disorders",2,Moderate,Minor,Surgical,Private Health Insurance,,,,N,N,29324.24,6510.90
New York City,Bronx,7000006,001169,Montefiore Medical Center - Henry & Lucy Moses Div,30 to 49,104,F,Black/African American,Not Span/Hispanic,1,Elective,Home or Self Care,2017,134,Other upper respiratory disease,012,OT THER ENDOCRINE PRCS,098,"Other ear, nose, mouth & throat procedures",03,"Ear, Nose, Mouth, Throat and Craniofacial Diseases and Disorders",2,Moderate,Minor,Surgical,Medicaid,,,,N,N,22770.82,5016.98
New York City,Bronx,7000006,001169,Montefiore Medical Center - Henry & Lucy Moses Div,30 to 49,104,M,White,Not Span/Hispanic,2,Emergency,Left Against Medical Advice,2017,137,Diseases of mouth; excluding dental,033,OTHER OR THER PRCS NOSE,098,"Other ear, nose, mouth & throat procedures",03,"Ear, Nose, Mouth, Throat and Craniofacial Diseases and Disorders",1,Minor,Minor,Surgical,Medicaid,,,,N,Y,35564.16,6303.35
New York City,Manhattan,7002024,001456,Mount Sinai Hospital,50 to 69,104,M,Other Race,Not Span/Hispanic,6,Urgent,Home w/ Home Health Services,2017,011,Cancer of head and neck,034,TRACHEOSTOMY; TEMP/PERM,098,"Other ear, nose, mouth & throat procedures",03,"Ear, Nose, Mouth, Throat and Craniofacial Diseases and Disorders",4,Extreme,Extreme,Surgical,Medicare,Medicare,Medicaid,,N,N,57955.48,22013.84
New York City,Manhattan,7002024,001456,Mount Sinai Hospital,50 to 69,115,M,Other Race,Not Span/Hispanic,4,Emergency,Home w/ Home Health Services,2017,011,Cancer of head and neck,034,TRACHEOSTOMY; TEMP/PERM,098,"Other ear, nose, mouth & throat procedures",03,"Ear, Nose, Mouth, Throat and Craniofacial Diseases and Disorders",1,Minor,Minor,Surgical,Private Health Insurance,Self-Pay,,,N,Y,40193.04,14544.91
New York City,Manhattan,7002024,001456,Mount Sinai Hospital,50 to 69,100,M,Other Race,Not Span/Hispanic,3,Emergency,Home or Self Care,2017,137,Diseases of mouth; excluding dental,033,OTHER OR THER PRCS NOSE,098,"Other ear, nose, mouth & throat procedures",03,"Ear, Nose, Mouth, Throat and Craniofacial Diseases and Disorders",2,Moderate,Minor,Surgical,Medicaid,Medicaid,Self-Pay,,N,Y,31287.70,11419.61
New York City,Bronx,7000006,001169,Montefiore Medical Center - Henry & Lucy Moses Div,18 to 29,104,M,Other Race,Not Span/Hispanic,1,Elective,Home or Self Care,2017,214,Digestive congenital anomalies,175,OT OR THER PRC SKN/BRST,098,"Other ear, nose, mouth & throat procedures",03,"Ear, Nose, Mouth, Throat and Craniofacial Diseases and Disorders",1,Minor,Minor,Surgical,Medicaid,,,,N,N,23877.45,5310.41
New York City,Bronx,7000006,001169,Montefiore Medical Center - Henry & Lucy Moses Div,0 to 17,104,F,Black/African American,Not Span/Hispanic,2,Emergency,Home or Self Care,2017,126,Other upper respiratory infections,032,OT NON-OR THER PRC NOSE,098,"Other ear, nose, mouth & throat procedures",03,"Ear, Nose, Mouth, Throat and Craniofacial Diseases and Disorders",1,Minor,Minor,Surgical,Medicaid,,,,N,Y,34760.92,8771.69
New York City,Kings,7001003,001288,Brooklyn Hospital Center - Downtown Campus,30 to 49,112,M,Black/African American,Unknown,3,Emergency,Home or Self Care,2017,137,Diseases of mouth; excluding dental,033,OTHER OR THER PRCS NOSE,098,"Other ear, nose, mouth & throat procedures",03,"Ear, Nose, Mouth, Throat and Craniofacial Diseases and Disorders",1,Minor,Minor,Surgical,Self-Pay,,,,N,N,33035.05,7906.23
New York City,Manhattan,7002002,001439,Mount Sinai Beth Israel,50 to 69,OOS,M,White,Not Span/Hispanic,11,Elective,Home or Self Care,2017,011,Cancer of head and neck,033,OTHER OR THER PRCS NOSE,098,"Other ear, nose, mouth & throat procedures",03,"Ear, Nose, Mouth, Throat and Craniofacial Diseases and Disorders",3,Major,Moderate,Surgical,Medicare,Private Health Insurance,Self-Pay,,N,N,139952.69,46400.84
New York City,Manhattan,7002002,001439,Mount Sinai Beth Israel,70 or Older,111,M,White,Not Span/Hispanic,1,Urgent,Home or Self Care,2017,011,Cancer of head and neck,033,OTHER OR THER PRCS NOSE,098,"Other ear, nose, mouth & throat procedures",03,"Ear, Nose, Mouth, Throat and Craniofacial Diseases and Disorders",1,Minor,Minor,Surgical,Medicare,Blue Cross/Blue Shield,Self-Pay,,N,N,25985.17,8504.13
New York City,Manhattan,7002024,001456,Mount Sinai Hospital,30 to 49,OOS,M,White,Not Span/Hispanic,1,Elective,Home or Self Care,2017,214,Digestive congenital anomalies,033,OTHER OR THER PRCS NOSE,098,"Other ear, nose, mouth & throat procedures",03,"Ear, Nose, Mouth, Throat and Craniofacial Diseases and Disorders",2,Moderate,Minor,Surgical,Blue Cross/Blue Shield,Self-Pay,,,N,N,18009.59,7867.64
New York City,Manhattan,7002024,001456,Mount Sinai Hospital,50 to 69,115,F,Other Race,Not Span/Hispanic,10,Emergency,Home w/ Home Health Services,2017,011,Cancer of head and neck,071,GASTROSTOMY; TEMP/PERM,098,"Other ear, nose, mouth & throat procedures",03,"Ear, Nose, Mouth, Throat and Craniofacial Diseases and Disorders",2,Moderate,Moderate,Surgical,Medicare,Medicare,Medicaid,,N,Y,94421.95,34000.26
New York City,Manhattan,7002032,001469,Mount Sinai St. Luke's,70 or Older,100,M,Black/African American,Not Span/Hispanic,4,Emergency,Short-term Hospital,2017,011,Cancer of head and neck,034,TRACHEOSTOMY; TEMP/PERM,098,"Other ear, nose, mouth & throat procedures",03,"Ear, Nose, Mouth, Throat and Craniofacial Diseases and Disorders",4,Extreme,Extreme,Surgical,Medicare,Medicaid,Self-Pay,,N,Y,86881.26,28652.67
Long Island,Nassau,2950002,000528,Nassau University Medical Center,70 or Older,115,M,Other Race,Spanish/Hispanic,14,Emergency,Skilled Nursing Home,2017,011,Cancer of head and neck,034,TRACHEOSTOMY; TEMP/PERM,098,"Other ear, nose, mouth & throat procedures",03,"Ear, Nose, Mouth, Throat and Craniofacial Diseases and Disorders",3,Major,Moderate,Surgical,Medicaid,Self-Pay,,,N,Y,124988.52,61808.27
Long Island,Nassau,2950002,000528,Nassau University Medical Center,30 to 49,115,M,Black/African American,Not Span/Hispanic,15,Emergency,Psychiatric Hospital or Unit of Hosp,2017,217,Other congenital anomalies,175,OT OR THER PRC SKN/BRST,098,"Other ear, nose, mouth & throat procedures",03,"Ear, Nose, Mouth, Throat and Craniofacial Diseases and Disorders",2,Moderate,Minor,Surgical,Medicare,Medicaid,Self-Pay,,N,Y,90172.33,37138.06
New York City,Kings,7001021,001306,New York - Presbyterian Brooklyn Methodist Hospital,70 or Older,112,F,White,Not Span/Hispanic,2,Elective,Home or Self Care,2017,011,Cancer of head and neck,033,OTHER OR THER PRCS NOSE,098,"Other ear, nose, mouth & throat procedures",03,"Ear, Nose, Mouth, Throat and Craniofacial Diseases and Disorders",1,Minor,Minor,Surgical,Medicare,Medicaid,Self-Pay,,N,N,28106.58,12956.18
New York City,Manhattan,7002054,001437,New York-Presbyterian/Lower Manhattan Hospital,50 to 69,117,F,White,Not Span/Hispanic,2,Emergency,Home or Self Care,2017,228,Skull and face fractures,144,"TRTMNT,FACE FRACT/DISLC",098,"Other ear, nose, mouth & throat procedures",03,"Ear, Nose, Mouth, Throat and Craniofacial Diseases and Disorders",2,Moderate,Minor,Surgical,Blue Cross/Blue Shield,Self-Pay,,,N,Y,32797.82,9678.45
New York City,Manhattan,7002024,001456,Mount Sinai Hospital,70 or Older,111,F,White,Not Span/Hispanic,2,Elective,Home or Self Care,2017,134,Other upper respiratory disease,033,OTHER OR THER PRCS NOSE,098,"Other ear, nose, mouth & throat procedures",03,"Ear, Nose, Mouth, Throat and Craniofacial Diseases and Disorders",2,Moderate,Moderate,Surgical,Medicare,Self-Pay,,,N,N,21054.41,8557.29
New York City,Manhattan,7002024,001456,Mount Sinai Hospital,70 or Older,100,F,White,Not Span/Hispanic,2,Elective,Home or Self Care,2017,011,Cancer of head and neck,033,OTHER OR THER PRCS NOSE,098,"Other ear, nose, mouth & throat procedures",03,"Ear, Nose, Mouth, Throat and Craniofacial Diseases and Disorders",3,Major,Major,Surgical,Medicare,Private Health Insurance,Self-Pay,,N,N,28501.28,10962.48
New York City,Manhattan,7002024,001456,Mount Sinai Hospital,70 or Older,100,M,White,Not Span/Hispanic,5,Urgent,Home or Self Care,2017,134,Other upper respiratory disease,034,TRACHEOSTOMY; TEMP/PERM,098,"Other ear, nose, mouth & throat procedures",03,"Ear, Nose, Mouth, Throat and Craniofacial Diseases and Disorders",3,Major,Moderate,Surgical,Medicare,Medicare,Self-Pay,,N,N,54649.41,21315.97
New York City,Manhattan,7002054,001458,New York Presbyterian Hospital - New York Weill Cornell Center,0 to 17,117,M,Other Race,Not Span/Hispanic,1,Emergency,Home or Self Care,2017,092,Otitis media and related conditions,023,MYRINGOTOMY,098,"Other ear, nose, mouth & throat procedures",03,"Ear, Nose, Mouth, Throat and Craniofacial Diseases and Disorders",1,Minor,Minor,Surgical,Blue Cross/Blue Shield,Self-Pay,,,N,N,25949.40,9728.49
New York City,Manhattan,7002054,001458,New York Presbyterian Hospital - New York Weill Cornell Center,30 to 49,100,M,Other Race,Not Span/Hispanic,3,Emergency,Home or Self Care,2017,134,Other upper respiratory disease,042,OT OR RX PRCS RESP SYS,098,"Other ear, nose, mouth & throat procedures",03,"Ear, Nose, Mouth, Throat and Craniofacial Diseases and Disorders",2,Moderate,Minor,Surgical,Blue Cross/Blue Shield,Self-Pay,,,N,Y,44671.70,13452.27
New York City,Manhattan,7002054,001458,New York Presbyterian Hospital - New York Weill Cornell Center,0 to 17,112,M,White,Not Span/Hispanic,6,Emergency,Home or Self Care,2017,217,Other congenital anomalies,035,TRACHE-/LARYNG-OSCOPY,098,"Other ear, nose, mouth & throat procedures",03,"Ear, Nose, Mouth, Throat and Craniofacial Diseases and Disorders",2,Moderate,Minor,Surgical,Private Health Insurance,Self-Pay,,,N,Y,122067.17,72641.05
New York City,Manhattan,7002054,001464,New York Presbyterian Hospital - Columbia Presbyterian Center,0 to 17,134,M,White,Not Span/Hispanic,1,Elective,Home or Self Care,2017,217,Other congenital anomalies,033,OTHER OR THER PRCS NOSE,098,"Other ear, nose, mouth & throat procedures",03,"Ear, Nose, Mouth, Throat and Craniofacial Diseases and Disorders",1,Minor,Minor,Surgical,Blue Cross/Blue Shield,Self-Pay,,,N,N,39471.74,19072.52
New York City,Manhattan,7002054,001464,New York Presbyterian Hospital - Columbia Presbyterian Center,50 to 69,111,M,White,Not Span/Hispanic,7,Elective,Home or Self Care,2017,011,Cancer of head and neck,032,OT NON-OR THER PRC NOSE,098,"Other ear, nose, mouth & throat procedures",03,"Ear, Nose, Mouth, Throat and Craniofacial Diseases and Disorders",2,Moderate,Minor,Surgical,Private Health Insurance,Medicare,Self-Pay,,N,N,96129.50,26355.64
New York City,Manhattan,7002054,001464,New York Presbyterian Hospital - Columbia Presbyterian Center,30 to 49,100,M,White,Not Span/Hispanic,2,Elective,Home or Self Care,2017,209,Other acquired deformities,172,SKIN GRAFT,098,"Other ear, nose, mouth & throat procedures",03,"Ear, Nose, Mouth, Throat and Craniofacial Diseases and Disorders",1,Minor,Minor,Surgical,Private Health Insurance,Self-Pay,,,N,N,36889.84,14008.98
New York City,Manhattan,7002054,001464,New York Presbyterian Hospital - Columbia Presbyterian Center,50 to 69,125,M,Other Race,Not Span/Hispanic,6,Urgent,Home w/ Home Health Services,2017,137,Diseases of mouth; excluding dental,168,"INCIS/DRAIN, SKIN/SUBCU",098,"Other ear, nose, mouth & throat procedures",03,"Ear, Nose, Mouth, Throat and Craniofacial Diseases and Disorders",2,Moderate,Minor,Surgical,Private Health Insurance,Self-Pay,,,N,N,68024.56,16721.93
New York City,Manhattan,7002054,001464,New York Presbyterian Hospital - Columbia Presbyterian Center,0 to 17,109,M,White,Not Span/Hispanic,2,Emergency,Home or Self Care,2017,136,Disorders of teeth and jaw,168,"INCIS/DRAIN, SKIN/SUBCU",098,"Other ear, nose, mouth & throat procedures",03,"Ear, Nose, Mouth, Throat and Craniofacial Diseases and Disorders",1,Minor,Minor,Surgical,Private Health Insurance,Medicaid,Self-Pay,,N,Y,30744.51,9221.89
New York City,Manhattan,7002054,001464,New York Presbyterian Hospital - Columbia Presbyterian Center,18 to 29,100,F,Other Race,Multi-ethnic,12,Emergency,Home or Self Care,2017,092,Otitis media and related conditions,023,MYRINGOTOMY,098,"Other ear, nose, mouth & throat procedures",03,"Ear, Nose, Mouth, Throat and Craniofacial Diseases and Disorders",3,Major,Moderate,Surgical,Medicaid,Medicaid,Self-Pay,,N,Y,181663.90,60615.47
New York City,Manhattan,7002054,001464,New York Presbyterian Hospital - Columbia Presbyterian Center,50 to 69,100,F,Other Race,Not Span/Hispanic,2,Emergency,Home or Self Care,2017,136,Disorders of teeth and jaw,033,OTHER OR THER PRCS NOSE,098,"Other ear, nose, mouth & throat procedures",03,"Ear, Nose, Mouth, Throat and Craniofacial Diseases and Disorders",1,Minor,Minor,Surgical,Blue Cross/Blue Shield,Self-Pay,,,N,N,18939.69,4709.25
New York City,Manhattan,7002032,001466,Mount Sinai West,30 to 49,,M,Black/African American,Unknown,19,Emergency,Home or Self Care,2017,137,Diseases of mouth; excluding dental,175,OT OR THER PRC SKN/BRST,098,"Other ear, nose, mouth & throat procedures",03,"Ear, Nose, Mouth, Throat and Craniofacial Diseases and Disorders",4,Extreme,Moderate,Surgical,Medicaid,Self-Pay,,,N,Y,162122.97,49881.33
New York City,Queens,7003010,001637,New York - Presbyterian/Queens,50 to 69,113,M,Other Race,Spanish/Hispanic,7,Emergency,Home w/ Home Health Services,2017,235,Open wounds of head; neck; and trunk,034,TRACHEOSTOMY; TEMP/PERM,098,"Other ear, nose, mouth & throat procedures",03,"Ear, Nose, Mouth, Throat and Craniofacial Diseases and Disorders",2,Moderate,Moderate,Surgical,Medicaid,Self-Pay,,,N,Y,77535.52,23833.78
Central NY,Onondaga,3301008,000636,Crouse Hospital,18 to 29,132,F,Black/African American,Not Span/Hispanic,3,Emergency,Home or Self Care,2017,136,Disorders of teeth and jaw,032,OT NON-OR THER PRC NOSE,098,"Other ear, nose, mouth & throat procedures",03,"Ear, Nose, Mouth, Throat and Craniofacial Diseases and Disorders",3,Major,Moderate,Surgical,Medicaid,,,,N,Y,9493.60,3961.59
Hudson Valley,Rockland,4329000,000779,Good Samaritan Hospital of Suffern,50 to 69,109,M,White,Not Span/Hispanic,2,Emergency,Home or Self Care,2017,136,Disorders of teeth and jaw,033,OTHER OR THER PRCS NOSE,098,"Other ear, nose, mouth & throat procedures",03,"Ear, Nose, Mouth, Throat and Craniofacial Diseases and Disorders",1,Minor,Minor,Surgical,Private Health Insurance,,,,N,Y,48877.35,9299.90
New York City,Bronx,7000001,001178,Bronx-Lebanon Hospital Center - Concourse Division,30 to 49,104,F,Other Race,Unknown,2,Emergency,Home or Self Care,2017,137,Diseases of mouth; excluding dental,032,OT NON-OR THER PRC NOSE,098,"Other ear, nose, mouth & throat procedures",03,"Ear, Nose, Mouth, Throat and Craniofacial Diseases and Disorders",1,Minor,Minor,Surgical,Private Health Insurance,,,,N,Y,8495.14,8498.10
New York City,Bronx,7000001,001178,Bronx-Lebanon Hospital Center - Concourse Division,70 or Older,104,M,Black/African American,Not Span/Hispanic,9,Emergency,Hospice - Medical Facility,2017,021,Cancer of bone and connective tissue,031,DX PRCS ON NOSE & MOUTH,098,"Other ear, nose, mouth & throat procedures",03,"Ear, Nose, Mouth, Throat and Craniofacial Diseases and Disorders",3,Major,Major,Surgical,Medicare,Medicaid,,,N,Y,30200.52,33525.61
New York City,Bronx,7000001,001178,Bronx-Lebanon Hospital Center - Concourse Division,18 to 29,104,M,Black/African American,Not Span/Hispanic,2,Emergency,Home or Self Care,2017,137,Diseases of mouth; excluding dental,032,OT NON-OR THER PRC NOSE,098,"Other ear, nose, mouth & throat procedures",03,"Ear, Nose, Mouth, Throat and Craniofacial Diseases and Disorders",1,Minor,Minor,Surgical,Medicaid,Medicaid,,,N,Y,8582.14,8628.04
New York City,Bronx,7000001,001178,Bronx-Lebanon Hospital Center - Concourse Division,50 to 69,104,F,Black/African American,Not Span/Hispanic,7,Emergency,Home or Self Care,2017,134,Other upper respiratory disease,033,OTHER OR THER PRCS NOSE,098,"Other ear, nose, mouth & throat procedures",03,"Ear, Nose, Mouth, Throat and Craniofacial Diseases and Disorders",3,Major,Moderate,Surgical,Medicaid,Medicaid,,,N,Y,31610.79,29323.73
New York City,Manhattan,7002002,001439,Mount Sinai Beth Israel,70 or Older,112,M,Other Race,Not Span/Hispanic,12,Emergency,Expired,2017,011,Cancer of head and neck,175,OT OR THER PRC SKN/BRST,098,"Other ear, nose, mouth & throat procedures",03,"Ear, Nose, Mouth, Throat and Craniofacial Diseases and Disorders",4,Extreme,Extreme,Surgical,Medicare,Miscellaneous/Other,Medicaid,,N,Y,125647.71,41461.37
New York City,Manhattan,7002002,001439,Mount Sinai Beth Israel,30 to 49,112,F,Other Race,Not Span/Hispanic,1,Urgent,Home or Self Care,2017,047,Other and unspecified benign neoplasm,033,OTHER OR THER PRCS NOSE,098,"Other ear, nose, mouth & throat procedures",03,"Ear, Nose, Mouth, Throat and Craniofacial Diseases and Disorders",1,Minor,Minor,Surgical,Private Health Insurance,Self-Pay,,,N,N,28547.45,8750.47
New York City,Manhattan,7002032,001466,Mount Sinai West,30 to 49,100,M,White,Not Span/Hispanic,14,Emergency,Home w/ Home Health Services,2017,137,Diseases of mouth; excluding dental,034,TRACHEOSTOMY; TEMP/PERM,098,"Other ear, nose, mouth & throat procedures",03,"Ear, Nose, Mouth, Throat and Craniofacial Diseases and Disorders",4,Extreme,Moderate,Surgical,Federal/State/Local/VA,Self-Pay,,,N,Y,120601.55,37000.24
New York City,Manhattan,7002032,001469,Mount Sinai St. Luke's,30 to 49,100,F,Black/African American,Not Span/Hispanic,2,Emergency,Home or Self Care,2017,134,Other upper respiratory disease,033,OTHER OR THER PRCS NOSE,098,"Other ear, nose, mouth & throat procedures",03,"Ear, Nose, Mouth, Throat and Craniofacial Diseases and Disorders",1,Minor,Minor,Surgical,Medicaid,Medicaid,Self-Pay,,N,Y,29390.19,10252.09
Long Island,Suffolk,5123000,000885,Brookhaven Memorial Hospital Medical Center Inc,30 to 49,117,F,White,Not Span/Hispanic,1,Emergency,Home or Self Care,2017,228,Skull and face fractures,144,"TRTMNT,FACE FRACT/DISLC",098,"Other ear, nose, mouth & throat procedures",03,"Ear, Nose, Mouth, Throat and Craniofacial Diseases and Disorders",2,Moderate,Minor,Surgical,Private Health Insurance,,,,N,Y,48660.87,5673.25
Western NY,Erie,1401005,000210,Erie County Medical Center,50 to 69,142,F,White,Not Span/Hispanic,15,Elective,Expired,2017,011,Cancer of head and neck,033,OTHER OR THER PRCS NOSE,098,"Other ear, nose, mouth & throat procedures",03,"Ear, Nose, Mouth, Throat and Craniofacial Diseases and Disorders",2,Moderate,Moderate,Surgical,Medicare,Medicaid,,,N,N,57555.31,36179.34
Western NY,Erie,1401005,000210,Erie County Medical Center,50 to 69,140,M,White,Not Span/Hispanic,4,Emergency,Home or Self Care,2017,136,Disorders of teeth and jaw,159,OT DX PRCS ON MUSC/SKEL,098,"Other ear, nose, mouth & throat procedures",03,"Ear, Nose, Mouth, Throat and Craniofacial Diseases and Disorders",2,Moderate,Minor,Surgical,Medicaid,,,,N,Y,17845.33,9052.10
Western NY,Erie,1401005,000210,Erie County Medical Center,18 to 29,,M,White,Not Span/Hispanic,1,Elective,Home or Self Care,2017,136,Disorders of teeth and jaw,029,ORAL AND DENTAL SVCS,098,"Other ear, nose, mouth & throat procedures",03,"Ear, Nose, Mouth, Throat and Craniofacial Diseases and Disorders",1,Minor,Minor,Surgical,Blue Cross/Blue Shield,,,,N,N,16618.29,10042.61