Hospital Service Area,Hospital County,Operating Certificate Number,Permanent Facility Id,Facility Name,Age Group,Zip Code - 3 digits,Gender,Race,Ethnicity,Length of Stay,Type of Admission,Patient Disposition,Discharge Year,CCS Diagnosis Code,CCS Diagnosis Description,CCS Procedure Code,CCS Procedure Description,APR DRG Code,APR DRG Description,APR MDC Code,APR MDC Description,APR Severity of Illness Code,APR Severity of Illness Description,APR Risk of Mortality,APR Medical Surgical Description,Payment Typology 1,Payment Typology 2,Payment Typology 3,Birth Weight,Abortion Edit Indicator,Emergency Department Indicator,Total Charges,Total Costs
New York City,Manhattan,7002054,001458,New York-Presbyterian Hospital - New York Weill Cornell Center,30 to 49,,M,Other Race,Not Span/Hispanic,4,Elective,Home or Self Care,2018,NEO002,HEAD AND NECK CANCERS - LIP AND ORAL CAVITY,ENT009,TONGUE EXCISION,098,"OTHER EAR, NOSE, MOUTH & THROAT PROCEDURES",03,"DISEASES AND DISORDERS OF THE EAR, NOSE, MOUTH AND THROAT",3,Major,Moderate,Surgical,Private Health Insurance,"Managed Care, Unspecified",Self-Pay,,,false,71300.52,20035.42
New York City,Manhattan,7002054,001458,New York-Presbyterian Hospital - New York Weill Cornell Center,0 to 17,116,F,Black/African American,Not Span/Hispanic,6,Emergency,Home or Self Care,2018,RSP001,SINUSITIS,ENT006,ENT DRAINAGE (EXCLUDING MYRINGOTOMY),098,"OTHER EAR, NOSE, MOUTH & THROAT PROCEDURES",03,"DISEASES AND DISORDERS OF THE EAR, NOSE, MOUTH AND THROAT",1,Minor,Minor,Surgical,Blue Cross/Blue Shield,Self-Pay,,,,false,82315.64,26958.91
New York City,Kings,7001045,001692,Woodhull Medical & Mental Health Center,30 to 49,114,F,White,Not Span/Hispanic,8,Emergency,Left Against Medical Advice,2018,DIG003,DISEASES OF MOUTH; EXCLUDING DENTAL,ENT006,ENT DRAINAGE (EXCLUDING MYRINGOTOMY),098,"OTHER EAR, NOSE, MOUTH & THROAT PROCEDURES",03,"DISEASES AND DISORDERS OF THE EAR, NOSE, MOUTH AND THROAT",2,Moderate,Minor,Surgical,Medicaid,Medicaid,,,,true,52551.34,41031.19
New York City,Manhattan,7002054,001464,New York-Presbyterian Hospital - Columbia Presbyterian Center,18 to 29,100,M,Other Race,Spanish/Hispanic,3,Emergency,Home or Self Care,2018,INJ001,"FRACTURE OF HEAD AND NECK, INITIAL ENCOUNTER",MST012,BONE FIXATION (EXCLUDING EXTREMITIES),098,"OTHER EAR, NOSE, MOUTH & THROAT PROCEDURES",03,"DISEASES AND DISORDERS OF THE EAR, NOSE, MOUTH AND THROAT",1,Minor,Minor,Surgical,Private Health Insurance,Self-Pay,,,,true,61453.6,17654.21
Southern Tier,Broome,0303001,000058,United Health Services Hospitals Inc. - Wilson Medical Center,70 or Older,137,F,White,Not Span/Hispanic,5,Urgent,Home or Self Care,2018,DIG003,DISEASES OF MOUTH; EXCLUDING DENTAL,ENT010,SALIVARY GLAND EXCISION,098,"OTHER EAR, NOSE, MOUTH & THROAT PROCEDURES",03,"DISEASES AND DISORDERS OF THE EAR, NOSE, MOUTH AND THROAT",2,Moderate,Moderate,Surgical,Medicare,Medicare,,,,false,24223,12390.02
New York City,Queens,7003004,001630,Long Island Jewish Medical Center,50 to 69,113,M,White,Not Span/Hispanic,7,Emergency,Home w/ Home Health Services,2018,NEO002,HEAD AND NECK CANCERS - LIP AND ORAL CAVITY,RES010,TRACHEOSTOMY,098,"OTHER EAR, NOSE, MOUTH & THROAT PROCEDURES",03,"DISEASES AND DISORDERS OF THE EAR, NOSE, MOUTH AND THROAT",3,Major,Moderate,Surgical,Private Health Insurance,Self-Pay,,,,false,93932.07,18058.97
Hudson Valley,Westchester,5957001,001139,Westchester Medical Center,0 to 17,105,F,Other Race,Unknown,3,Elective,Home or Self Care,2018,RSP007,OTHER SPECIFIED AND UNSPECIFIED UPPER RESPIRATORY DISEASE,ENT012,"ENT EXCISION (EXCLUDING NASAL PASSAGE, SINUSES, TONGUE, SALIVARY GLANDS, LARYNX)",098,"OTHER EAR, NOSE, MOUTH & THROAT PROCEDURES",03,"DISEASES AND DISORDERS OF THE EAR, NOSE, MOUTH AND THROAT",3,Major,Minor,Surgical,Medicaid,Medicaid,,,,false,106475.75,20189.6
Long Island,Suffolk,5154001,000925,Good Samaritan Hospital Medical Center,70 or Older,117,F,White,Not Span/Hispanic,2,Emergency,Home or Self Care,2018,INJ001,"FRACTURE OF HEAD AND NECK, INITIAL ENCOUNTER",MST012,BONE FIXATION (EXCLUDING EXTREMITIES),098,"OTHER EAR, NOSE, MOUTH & THROAT PROCEDURES",03,"DISEASES AND DISORDERS OF THE EAR, NOSE, MOUTH AND THROAT",2,Moderate,Minor,Surgical,Medicare,Blue Cross/Blue Shield,,,,true,44404.26,7497.11
New York City,Richmond,7004003,001740,Staten Island University Hosp-North,70 or Older,103,M,White,Not Span/Hispanic,5,Emergency,Skilled Nursing Home,2018,RSP007,OTHER SPECIFIED AND UNSPECIFIED UPPER RESPIRATORY DISEASE,RES010,TRACHEOSTOMY,098,"OTHER EAR, NOSE, MOUTH & THROAT PROCEDURES",03,"DISEASES AND DISORDERS OF THE EAR, NOSE, MOUTH AND THROAT",2,Moderate,Moderate,Surgical,Medicare,Medicare,,,,true,44534.85,11891.39
New York City,Kings,7001009,001294,Coney Island Hospital,70 or Older,112,F,White,Not Span/Hispanic,2,Emergency,Skilled Nursing Home,2018,INJ011,"OPEN WOUNDS OF HEAD AND NECK, INITIAL ENCOUNTER",ENT013,ENT REPAIR,098,"OTHER EAR, NOSE, MOUTH & THROAT PROCEDURES",03,"DISEASES AND DISORDERS OF THE EAR, NOSE, MOUTH AND THROAT",2,Moderate,Moderate,Surgical,Medicare,Medicare,Medicaid,,,true,15427.1,8635
Western NY,Erie,1401014,000207,Buffalo General Medical Center,50 to 69,148,M,White,Not Span/Hispanic,2,Elective,Home or Self Care,2018,EAR002,DISEASES OF MIDDLE EAR AND MASTOID (EXCEPT OTITIS MEDIA),ENT008,NASAL AND SINUS EXCISION,098,"OTHER EAR, NOSE, MOUTH & THROAT PROCEDURES",03,"DISEASES AND DISORDERS OF THE EAR, NOSE, MOUTH AND THROAT",3,Major,Major,Surgical,Medicare,Self-Pay,,,,false,19234.44,6429.61
Central NY,Onondaga,3301007,000635,University Hospital SUNY Health Science Center,0 to 17,132,M,White,Not Span/Hispanic,1,Emergency,Home or Self Care,2018,RSP007,OTHER SPECIFIED AND UNSPECIFIED UPPER RESPIRATORY DISEASE,ENT011,LARYNGECTOMY,098,"OTHER EAR, NOSE, MOUTH & THROAT PROCEDURES",03,"DISEASES AND DISORDERS OF THE EAR, NOSE, MOUTH AND THROAT",3,Major,Minor,Surgical,Medicaid,,,,,false,26270.3,7270.26
New York City,Kings,7001021,001306,New York - Presbyterian Brooklyn Methodist Hospital,50 to 69,112,F,White,Not Span/Hispanic,5,Emergency,Home or Self Care,2018,NEO010,HEAD AND NECK CANCERS - ALL OTHER TYPES,ENT008,NASAL AND SINUS EXCISION,098,"OTHER EAR, NOSE, MOUTH & THROAT PROCEDURES",03,"DISEASES AND DISORDERS OF THE EAR, NOSE, MOUTH AND THROAT",1,Minor,Minor,Surgical,Medicare,Medicare,Self-Pay,,,true,50839.38,17013.74
New York City,Bronx,7000008,001172,Lincoln Medical & Mental Health Center,70 or Older,104,F,Black/African American,Not Span/Hispanic,2,Emergency,Home or Self Care,2018,NEO002,HEAD AND NECK CANCERS - LIP AND ORAL CAVITY,ENT009,TONGUE EXCISION,098,"OTHER EAR, NOSE, MOUTH & THROAT PROCEDURES",03,"DISEASES AND DISORDERS OF THE EAR, NOSE, MOUTH AND THROAT",2,Moderate,Moderate,Surgical,Medicaid,Medicaid,,,,false,13074.19,7721.05
Finger Lakes,Monroe,2701005,000413,Strong Memorial Hospital,70 or Older,149,F,Other Race,Unknown,6,Urgent,Home or Self Care,2018,DIG003,DISEASES OF MOUTH; EXCLUDING DENTAL,ENT006,ENT DRAINAGE (EXCLUDING MYRINGOTOMY),098,"OTHER EAR, NOSE, MOUTH & THROAT PROCEDURES",03,"DISEASES AND DISORDERS OF THE EAR, NOSE, MOUTH AND THROAT",3,Major,Major,Surgical,Medicare,Medicare,Self-Pay,,,false,20082.29,9934
Central NY,Onondaga,3301007,000635,University Hospital SUNY Health Science Center,70 or Older,130,M,White,Not Span/Hispanic,2,Emergency,Home or Self Care,2018,DIG003,DISEASES OF MOUTH; EXCLUDING DENTAL,ENT006,ENT DRAINAGE (EXCLUDING MYRINGOTOMY),098,"OTHER EAR, NOSE, MOUTH & THROAT PROCEDURES",03,"DISEASES AND DISORDERS OF THE EAR, NOSE, MOUTH AND THROAT",2,Moderate,Moderate,Surgical,Medicare,,,,,true,15544.46,3825.71
Central NY,Onondaga,3301007,000635,University Hospital SUNY Health Science Center,18 to 29,131,M,Black/African American,Not Span/Hispanic,6,Trauma,Court/Law Enforcement,2018,INJ015,"AMPUTATION OF OTHER BODY PARTS, INITIAL ENCOUNTER",ENT013,ENT REPAIR,098,"OTHER EAR, NOSE, MOUTH & THROAT PROCEDURES",03,"DISEASES AND DISORDERS OF THE EAR, NOSE, MOUTH AND THROAT",2,Moderate,Minor,Surgical,Department of Corrections,,,,,true,67397.8,14188.79
New York City,Manhattan,7002026,001460,New York Eye and Ear Infirmary of Mount Sinai,18 to 29,112,F,Other Race,Unknown,6,Elective,Home or Self Care,2018,RSP007,OTHER SPECIFIED AND UNSPECIFIED UPPER RESPIRATORY DISEASE,ENT001,LARYNGOSCOPY (DIAGNOSTIC),098,"OTHER EAR, NOSE, MOUTH & THROAT PROCEDURES",03,"DISEASES AND DISORDERS OF THE EAR, NOSE, MOUTH AND THROAT",2,Moderate,Minor,Surgical,Self-Pay,,,,,false,82219.59,22193.48
New York City,Manhattan,7002020,001453,Memorial Hospital for Cancer and Allied Diseases,50 to 69,137,F,White,Not Span/Hispanic,1,Elective,Home or Self Care,2018,NEO004,HEAD AND NECK CANCERS - SALIVARY GLAND,ENT010,SALIVARY GLAND EXCISION,098,"OTHER EAR, NOSE, MOUTH & THROAT PROCEDURES",03,"DISEASES AND DISORDERS OF THE EAR, NOSE, MOUTH AND THROAT",2,Moderate,Moderate,Surgical,Private Health Insurance,,,,,false,50332.71,21178.81
New York City,Manhattan,7002024,001456,Mount Sinai Hospital,30 to 49,112,M,Other Race,Not Span/Hispanic,2,Elective,Home or Self Care,2018,NEO073,BENIGN NEOPLASMS,ENT013,ENT REPAIR,098,"OTHER EAR, NOSE, MOUTH & THROAT PROCEDURES",03,"DISEASES AND DISORDERS OF THE EAR, NOSE, MOUTH AND THROAT",2,Moderate,Minor,Surgical,Blue Cross/Blue Shield,Self-Pay,,,,false,72016.19,26869.74
New York City,Manhattan,7002054,001458,New York-Presbyterian Hospital - New York Weill Cornell Center,30 to 49,105,F,White,Not Span/Hispanic,2,Emergency,Home or Self Care,2018,MUS029,DISORDERS OF JAW,CAR010,LIGATION AND EMBOLIZATION OF VESSELS,098,"OTHER EAR, NOSE, MOUTH & THROAT PROCEDURES",03,"DISEASES AND DISORDERS OF THE EAR, NOSE, MOUTH AND THROAT",2,Moderate,Minor,Surgical,Blue Cross/Blue Shield,Self-Pay,,,,false,105663.03,43075.16
New York City,Kings,7001021,001306,New York - Presbyterian Brooklyn Methodist Hospital,70 or Older,112,M,White,Not Span/Hispanic,1,Emergency,Home or Self Care,2018,NEO004,HEAD AND NECK CANCERS - SALIVARY GLAND,ENT010,SALIVARY GLAND EXCISION,098,"OTHER EAR, NOSE, MOUTH & THROAT PROCEDURES",03,"DISEASES AND DISORDERS OF THE EAR, NOSE, MOUTH AND THROAT",1,Minor,Minor,Surgical,Medicare,Self-Pay,,,,false,18726.14,9073.66
Long Island,Nassau,2950002,000528,Nassau University Medical Center,30 to 49,118,M,White,Spanish/Hispanic,1,Elective,Home or Self Care,2018,MAL005,"CONGENITAL MALFORMATIONS OF EYE, EAR, FACE, NECK",SKB007,SKIN GRAFT,098,"OTHER EAR, NOSE, MOUTH & THROAT PROCEDURES",03,"DISEASES AND DISORDERS OF THE EAR, NOSE, MOUTH AND THROAT",2,Moderate,Minor,Surgical,Blue Cross/Blue Shield,Self-Pay,,,,false,44165.96,39820.47
New York City,Manhattan,7002020,001453,Memorial Hospital for Cancer and Allied Diseases,50 to 69,112,M,White,Not Span/Hispanic,2,Elective,Home or Self Care,2018,NEO010,HEAD AND NECK CANCERS - ALL OTHER TYPES,ENT008,NASAL AND SINUS EXCISION,098,"OTHER EAR, NOSE, MOUTH & THROAT PROCEDURES",03,"DISEASES AND DISORDERS OF THE EAR, NOSE, MOUTH AND THROAT",2,Moderate,Moderate,Surgical,Blue Cross/Blue Shield,,,,,false,55665.95,19945.03
New York City,Bronx,7000008,001172,Lincoln Medical & Mental Health Center,0 to 17,104,M,Other Race,Spanish/Hispanic,4,Emergency,Home or Self Care,2018,DIG003,DISEASES OF MOUTH; EXCLUDING DENTAL,ENT006,ENT DRAINAGE (EXCLUDING MYRINGOTOMY),098,"OTHER EAR, NOSE, MOUTH & THROAT PROCEDURES",03,"DISEASES AND DISORDERS OF THE EAR, NOSE, MOUTH AND THROAT",1,Minor,Minor,Surgical,Medicaid,,,,,true,21820.77,12886.41
Western NY,Erie,1401014,000208,John R. Oishei Children's Hospital,0 to 17,142,M,Black/African American,Not Span/Hispanic,7,Elective,Home w/ Home Health Services,2018,RSP007,OTHER SPECIFIED AND UNSPECIFIED UPPER RESPIRATORY DISEASE,ENT017,"ENT PROCEDURES, NEC",098,"OTHER EAR, NOSE, MOUTH & THROAT PROCEDURES",03,"DISEASES AND DISORDERS OF THE EAR, NOSE, MOUTH AND THROAT",3,Major,Moderate,Surgical,Private Health Insurance,Self-Pay,,,,false,56369.64,25764.12
Central NY,Onondaga,3301007,000635,University Hospital SUNY Health Science Center,50 to 69,131,F,White,Not Span/Hispanic,33,Elective,Skilled Nursing Home,2018,RSP007,OTHER SPECIFIED AND UNSPECIFIED UPPER RESPIRATORY DISEASE,ENT011,LARYNGECTOMY,098,"OTHER EAR, NOSE, MOUTH & THROAT PROCEDURES",03,"DISEASES AND DISORDERS OF THE EAR, NOSE, MOUTH AND THROAT",4,Extreme,Moderate,Surgical,Medicare,Medicaid,,,,false,304756.8,86681.24
Long Island,Nassau,2951001,000541,North Shore University Hospital,70 or Older,115,F,White,Not Span/Hispanic,6,Emergency,Home or Self Care,2018,INJ001,"FRACTURE OF HEAD AND NECK, INITIAL ENCOUNTER",MST012,BONE FIXATION (EXCLUDING EXTREMITIES),098,"OTHER EAR, NOSE, MOUTH & THROAT PROCEDURES",03,"DISEASES AND DISORDERS OF THE EAR, NOSE, MOUTH AND THROAT",2,Moderate,Minor,Surgical,Medicare,Blue Cross/Blue Shield,,,,true,82026.03,15939.05
Western NY,Erie,1401014,000207,Buffalo General Medical Center,70 or Older,140,M,White,Not Span/Hispanic,15,Emergency,Home w/ Home Health Services,2018,NEO008,HEAD AND NECK CANCERS - LARYNGEAL,RES010,TRACHEOSTOMY,098,"OTHER EAR, NOSE, MOUTH & THROAT PROCEDURES",03,"DISEASES AND DISORDERS OF THE EAR, NOSE, MOUTH AND THROAT",4,Extreme,Extreme,Surgical,Medicare,Self-Pay,,,,true,107632.29,34141.28
New York City,Manhattan,7002032,001466,Mount Sinai West,70 or Older,100,M,Other Race,Not Span/Hispanic,8,Urgent,Home w/ Home Health Services,2018,NEO008,HEAD AND NECK CANCERS - LARYNGEAL,RES010,TRACHEOSTOMY,098,"OTHER EAR, NOSE, MOUTH & THROAT PROCEDURES",03,"DISEASES AND DISORDERS OF THE EAR, NOSE, MOUTH AND THROAT",4,Extreme,Extreme,Surgical,Medicare,Medicaid,Self-Pay,,,false,86888.45,23104.26
New York City,Queens,7003004,001630,Long Island Jewish Medical Center,70 or Older,113,M,Other Race,Not Span/Hispanic,6,Urgent,Home w/ Home Health Services,2018,NEO008,HEAD AND NECK CANCERS - LARYNGEAL,RES010,TRACHEOSTOMY,098,"OTHER EAR, NOSE, MOUTH & THROAT PROCEDURES",03,"DISEASES AND DISORDERS OF THE EAR, NOSE, MOUTH AND THROAT",4,Extreme,Major,Surgical,Medicare,Medicare,Self-Pay,,,false,74534.19,14916.08
New York City,Queens,7003004,001630,Long Island Jewish Medical Center,70 or Older,119,M,White,Not Span/Hispanic,1,Elective,Hospice - Home,2018,NEO002,HEAD AND NECK CANCERS - LIP AND ORAL CAVITY,ENT012,"ENT EXCISION (EXCLUDING NASAL PASSAGE, SINUSES, TONGUE, SALIVARY GLANDS, LARYNX)",098,"OTHER EAR, NOSE, MOUTH & THROAT PROCEDURES",03,"DISEASES AND DISORDERS OF THE EAR, NOSE, MOUTH AND THROAT",2,Moderate,Moderate,Surgical,Medicare,Private Health Insurance,Self-Pay,,,false,26281.78,5620.53
Western NY,Erie,1401005,000210,Erie County Medical Center,18 to 29,140,M,Black/African American,Not Span/Hispanic,1,Elective,Court/Law Enforcement,2018,MUS029,DISORDERS OF JAW,ENT012,"ENT EXCISION (EXCLUDING NASAL PASSAGE, SINUSES, TONGUE, SALIVARY GLANDS, LARYNX)",098,"OTHER EAR, NOSE, MOUTH & THROAT PROCEDURES",03,"DISEASES AND DISORDERS OF THE EAR, NOSE, MOUTH AND THROAT",2,Moderate,Minor,Surgical,Department of Corrections,,,,,false,4444.33,3346.1
New York City,Queens,7003004,003376,Cohen Children's Medical Center,0 to 17,112,M,Other Race,Not Span/Hispanic,1,Elective,Home or Self Care,2018,RSP007,OTHER SPECIFIED AND UNSPECIFIED UPPER RESPIRATORY DISEASE,ENT011,LARYNGECTOMY,098,"OTHER EAR, NOSE, MOUTH & THROAT PROCEDURES",03,"DISEASES AND DISORDERS OF THE EAR, NOSE, MOUTH AND THROAT",2,Moderate,Minor,Surgical,Medicaid,Medicaid,Self-Pay,,,false,26227.58,6068.34
New York City,Manhattan,7002002,001439,Mount Sinai Beth Israel,18 to 29,104,M,Black/African American,Unknown,4,Emergency,Home or Self Care,2018,DIG003,DISEASES OF MOUTH; EXCLUDING DENTAL,ENT006,ENT DRAINAGE (EXCLUDING MYRINGOTOMY),098,"OTHER EAR, NOSE, MOUTH & THROAT PROCEDURES",03,"DISEASES AND DISORDERS OF THE EAR, NOSE, MOUTH AND THROAT",2,Moderate,Minor,Surgical,Medicaid,Medicaid,Self-Pay,,,true,46325.86,9312.25
New York City,Manhattan,7002017,001450,Lenox Hill Hospital,50 to 69,100,M,White,Not Span/Hispanic,12,Emergency,Home or Self Care,2018,DIG003,DISEASES OF MOUTH; EXCLUDING DENTAL,ENT006,ENT DRAINAGE (EXCLUDING MYRINGOTOMY),098,"OTHER EAR, NOSE, MOUTH & THROAT PROCEDURES",03,"DISEASES AND DISORDERS OF THE EAR, NOSE, MOUTH AND THROAT",2,Moderate,Minor,Surgical,Medicare,Medicare,,,,true,153845.82,26898.17
Long Island,Suffolk,5154001,000925,Good Samaritan Hospital Medical Center,0 to 17,117,M,White,Not Span/Hispanic,2,Emergency,Home or Self Care,2018,INJ011,"OPEN WOUNDS OF HEAD AND NECK, INITIAL ENCOUNTER",MST020,SUBCUTANEOUS TISSUE AND FASCIA EXCISION,098,"OTHER EAR, NOSE, MOUTH & THROAT PROCEDURES",03,"DISEASES AND DISORDERS OF THE EAR, NOSE, MOUTH AND THROAT",1,Minor,Minor,Surgical,Medicaid,Medicaid,,,,true,25561.06,8095.44
Capital/Adirond,Albany,0101000,000001,Albany Medical Center Hospital,0 to 17,121,M,White,Not Span/Hispanic,10,Urgent,Home or Self Care,2018,MAL007,RESPIRATORY CONGENITAL MALFORMATIONS,ENT017,"ENT PROCEDURES, NEC",098,"OTHER EAR, NOSE, MOUTH & THROAT PROCEDURES",03,"DISEASES AND DISORDERS OF THE EAR, NOSE, MOUTH AND THROAT",4,Extreme,Moderate,Surgical,"Managed Care, Unspecified",,,,,false,86104.28,40639.72
Western NY,Erie,1401005,000210,Erie County Medical Center,70 or Older,140,M,White,Not Span/Hispanic,1,Emergency,Home or Self Care,2018,DIG003,DISEASES OF MOUTH; EXCLUDING DENTAL,ENT006,ENT DRAINAGE (EXCLUDING MYRINGOTOMY),098,"OTHER EAR, NOSE, MOUTH & THROAT PROCEDURES",03,"DISEASES AND DISORDERS OF THE EAR, NOSE, MOUTH AND THROAT",2,Moderate,Moderate,Surgical,Medicare,Medicare,,,,true,10977.95,4843.56
Long Island,Suffolk,5154001,000925,Good Samaritan Hospital Medical Center,0 to 17,117,F,White,Not Span/Hispanic,2,Emergency,Home or Self Care,2018,RSP004,ACUTE AND CHRONIC TONSILLITIS,ENT003,ENT DIAGNOSTIC PROCEDURES (NON-ENDOSCOPIC),098,"OTHER EAR, NOSE, MOUTH & THROAT PROCEDURES",03,"DISEASES AND DISORDERS OF THE EAR, NOSE, MOUTH AND THROAT",1,Minor,Minor,Surgical,Private Health Insurance,,,,,true,15593,6033.57
Hudson Valley,Westchester,5957001,001139,Westchester Medical Center,30 to 49,125,M,White,Not Span/Hispanic,4,Emergency,Home or Self Care,2018,DIG003,DISEASES OF MOUTH; EXCLUDING DENTAL,ENT006,ENT DRAINAGE (EXCLUDING MYRINGOTOMY),098,"OTHER EAR, NOSE, MOUTH & THROAT PROCEDURES",03,"DISEASES AND DISORDERS OF THE EAR, NOSE, MOUTH AND THROAT",1,Minor,Minor,Surgical,Self-Pay,,,,,true,83989.72,15652.99
Capital/Adirond,Albany,0101000,000001,Albany Medical Center Hospital,18 to 29,128,M,White,Not Span/Hispanic,1,Emergency,Home or Self Care,2018,INJ011,"OPEN WOUNDS OF HEAD AND NECK, INITIAL ENCOUNTER",ENT013,ENT REPAIR,098,"OTHER EAR, NOSE, MOUTH & THROAT PROCEDURES",03,"DISEASES AND DISORDERS OF THE EAR, NOSE, MOUTH AND THROAT",1,Minor,Minor,Surgical,Medicaid,,,,,true,21368.39,7595.88
New York City,Bronx,7000008,001172,Lincoln Medical & Mental Health Center,50 to 69,104,M,Other Race,Spanish/Hispanic,2,Elective,Home or Self Care,2018,NEO003,HEAD AND NECK CANCERS - THROAT,ENT003,ENT DIAGNOSTIC PROCEDURES (NON-ENDOSCOPIC),098,"OTHER EAR, NOSE, MOUTH & THROAT PROCEDURES",03,"DISEASES AND DISORDERS OF THE EAR, NOSE, MOUTH AND THROAT",2,Moderate,Moderate,Surgical,Medicaid,,,,,false,40126.37,23696.91
Long Island,Nassau,2909000,000513,Mercy Hospital,50 to 69,115,F,White,Not Span/Hispanic,4,Emergency,Home or Self Care,2018,DIG003,DISEASES OF MOUTH; EXCLUDING DENTAL,ENT012,"ENT EXCISION (EXCLUDING NASAL PASSAGE, SINUSES, TONGUE, SALIVARY GLANDS, LARYNX)",098,"OTHER EAR, NOSE, MOUTH & THROAT PROCEDURES",03,"DISEASES AND DISORDERS OF THE EAR, NOSE, MOUTH AND THROAT",2,Moderate,Minor,Surgical,Blue Cross/Blue Shield,,,,,true,31761.6,6835.63
Western NY,Erie,1401013,000218,Sisters of Charity Hospital,50 to 69,142,F,White,Not Span/Hispanic,3,Elective,Home or Self Care,2018,NEO003,HEAD AND NECK CANCERS - THROAT,LYM001,LYMPH NODE BIOPSY,098,"OTHER EAR, NOSE, MOUTH & THROAT PROCEDURES",03,"DISEASES AND DISORDERS OF THE EAR, NOSE, MOUTH AND THROAT",2,Moderate,Moderate,Surgical,Private Health Insurance,,,,,false,17004.4,7541.39
Capital/Adirond,Albany,0101004,000005,St. Peter's Hospital,50 to 69,123,M,White,Not Span/Hispanic,36,Elective,Home or Self Care,2018,NEO008,HEAD AND NECK CANCERS - LARYNGEAL,LYM001,LYMPH NODE BIOPSY,098,"OTHER EAR, NOSE, MOUTH & THROAT PROCEDURES",03,"DISEASES AND DISORDERS OF THE EAR, NOSE, MOUTH AND THROAT",4,Extreme,Major,Surgical,Medicaid,Medicaid,,,,false,201357.45,70039.51
Western NY,Erie,1401010,000216,Roswell Park Cancer Institute,50 to 69,134,F,White,Not Span/Hispanic,7,Urgent,Home or Self Care,2018,NEO002,HEAD AND NECK CANCERS - LIP AND ORAL CAVITY,ENT012,"ENT EXCISION (EXCLUDING NASAL PASSAGE, SINUSES, TONGUE, SALIVARY GLANDS, LARYNX)",098,"OTHER EAR, NOSE, MOUTH & THROAT PROCEDURES",03,"DISEASES AND DISORDERS OF THE EAR, NOSE, MOUTH AND THROAT",2,Moderate,Minor,Surgical,Private Health Insurance,Medicaid,,,,false,44819.08,16266.92
New York City,Manhattan,7002032,001466,Mount Sinai West,50 to 69,OOS,F,White,Not Span/Hispanic,8,Elective,Home w/ Home Health Services,2018,NEO003,HEAD AND NECK CANCERS - THROAT,RES010,TRACHEOSTOMY,098,"OTHER EAR, NOSE, MOUTH & THROAT PROCEDURES",03,"DISEASES AND DISORDERS OF THE EAR, NOSE, MOUTH AND THROAT",2,Moderate,Moderate,Surgical,Blue Cross/Blue Shield,Self-Pay,,,,false,118738.9,34179.16
Hudson Valley,Westchester,5957001,001139,Westchester Medical Center,30 to 49,105,F,Other Race,Unknown,3,Elective,Home or Self Care,2018,MAL005,"CONGENITAL MALFORMATIONS OF EYE, EAR, FACE, NECK",ENT013,ENT REPAIR,098,"OTHER EAR, NOSE, MOUTH & THROAT PROCEDURES",03,"DISEASES AND DISORDERS OF THE EAR, NOSE, MOUTH AND THROAT",2,Moderate,Minor,Surgical,Medicaid,Medicaid,,,,false,91581.18,18254.08
Western NY,Erie,1401014,000208,John R. Oishei Children's Hospital,0 to 17,140,M,White,Not Span/Hispanic,21,Emergency,Home or Self Care,2018,RSP007,OTHER SPECIFIED AND UNSPECIFIED UPPER RESPIRATORY DISEASE,ENT011,LARYNGECTOMY,098,"OTHER EAR, NOSE, MOUTH & THROAT PROCEDURES",03,"DISEASES AND DISORDERS OF THE EAR, NOSE, MOUTH AND THROAT",3,Major,Moderate,Surgical,Medicaid,Self-Pay,,,,true,213917.89,99475.07
New York City,Manhattan,7002024,001456,Mount Sinai Hospital,30 to 49,114,M,Black/African American,Unknown,1,Elective,Home or Self Care,2018,NEO073,BENIGN NEOPLASMS,ENT010,SALIVARY GLAND EXCISION,098,"OTHER EAR, NOSE, MOUTH & THROAT PROCEDURES",03,"DISEASES AND DISORDERS OF THE EAR, NOSE, MOUTH AND THROAT",2,Moderate,Minor,Surgical,Private Health Insurance,Self-Pay,,,,false,21122.29,7140.55
Capital/Adirond,Schenectady,4601001,000829,Ellis Hospital,50 to 69,123,F,White,Not Span/Hispanic,6,Emergency,Home or Self Care,2018,DIG003,DISEASES OF MOUTH; EXCLUDING DENTAL,ENT006,ENT DRAINAGE (EXCLUDING MYRINGOTOMY),098,"OTHER EAR, NOSE, MOUTH & THROAT PROCEDURES",03,"DISEASES AND DISORDERS OF THE EAR, NOSE, MOUTH AND THROAT",2,Moderate,Minor,Surgical,Private Health Insurance,,,,,true,31464.9,9286.42
Hudson Valley,Westchester,5957001,001139,Westchester Medical Center,18 to 29,125,M,Other Race,Unknown,5,Emergency,Home or Self Care,2018,DIG003,DISEASES OF MOUTH; EXCLUDING DENTAL,ENT006,ENT DRAINAGE (EXCLUDING MYRINGOTOMY),098,"OTHER EAR, NOSE, MOUTH & THROAT PROCEDURES",03,"DISEASES AND DISORDERS OF THE EAR, NOSE, MOUTH AND THROAT",1,Minor,Minor,Surgical,Medicaid,Medicaid,,,,true,93112.4,17089.6
Finger Lakes,Monroe,2701005,000413,Strong Memorial Hospital,30 to 49,146,F,White,Not Span/Hispanic,1,Emergency,Home or Self Care,2018,DIG003,DISEASES OF MOUTH; EXCLUDING DENTAL,ENT006,ENT DRAINAGE (EXCLUDING MYRINGOTOMY),098,"OTHER EAR, NOSE, MOUTH & THROAT PROCEDURES",03,"DISEASES AND DISORDERS OF THE EAR, NOSE, MOUTH AND THROAT",1,Minor,Minor,Surgical,Private Health Insurance,Self-Pay,,,,true,9637.18,4455.73
New York City,Bronx,7000008,001172,Lincoln Medical & Mental Health Center,70 or Older,104,F,Other Race,Spanish/Hispanic,6,Emergency,Home w/ Home Health Services,2018,RSP001,SINUSITIS,ENT006,ENT DRAINAGE (EXCLUDING MYRINGOTOMY),098,"OTHER EAR, NOSE, MOUTH & THROAT PROCEDURES",03,"DISEASES AND DISORDERS OF THE EAR, NOSE, MOUTH AND THROAT",2,Moderate,Major,Surgical,Medicaid,,,,,true,37063.73,21888.25